All of lore.kernel.org
 help / color / mirror / Atom feed
From: "kernelci.org bot" <bot@kernelci.org>
To: stable@vger.kernel.org, kernel-build-reports@lists.linaro.org,
	kernelci-results@groups.io
Subject: stable-rc/queue/4.19 build: 198 builds: 6 failed, 192 passed, 2 errors, 32 warnings (v4.19.223-27-g41037988c76f)
Date: Tue, 04 Jan 2022 05:19:59 -0800 (PST)	[thread overview]
Message-ID: <61d4497f.1c69fb81.29af8.bf44@mx.google.com> (raw)

stable-rc/queue/4.19 build: 198 builds: 6 failed, 192 passed, 2 errors, 32 warnings (v4.19.223-27-g41037988c76f)

Full Build Summary: https://kernelci.org/build/stable-rc/branch/queue%2F4.19/kernel/v4.19.223-27-g41037988c76f/

Tree: stable-rc
Branch: queue/4.19
Git Describe: v4.19.223-27-g41037988c76f
Git Commit: 41037988c76fb7f0b16c288df4af0e7c8226a8ae
Git URL: https://git.kernel.org/pub/scm/linux/kernel/git/stable/linux-stable-rc.git
Built: 7 unique architectures

Build Failures Detected:

arm:
    rpc_defconfig: (gcc-10) FAIL

mips:
    ip27_defconfig: (gcc-10) FAIL
    ip28_defconfig: (gcc-10) FAIL

riscv:
    allnoconfig: (gcc-10) FAIL
    defconfig: (gcc-10) FAIL
    tinyconfig: (gcc-10) FAIL

Errors and Warnings Detected:

arc:

arm64:
    defconfig (gcc-10): 3 warnings
    defconfig+arm64-chromebook (gcc-10): 3 warnings

arm:
    omap1_defconfig (gcc-10): 1 warning
    rpc_defconfig (gcc-10): 2 errors

i386:
    allnoconfig (gcc-10): 2 warnings
    i386_defconfig (gcc-10): 2 warnings
    tinyconfig (gcc-10): 2 warnings

mips:
    lemote2f_defconfig (gcc-10): 1 warning
    loongson3_defconfig (gcc-10): 1 warning
    malta_qemu_32r6_defconfig (gcc-10): 1 warning
    mtx1_defconfig (gcc-10): 3 warnings
    nlm_xlp_defconfig (gcc-10): 1 warning

riscv:

x86_64:
    allnoconfig (gcc-10): 3 warnings
    tinyconfig (gcc-10): 3 warnings
    x86_64_defconfig (gcc-10): 3 warnings
    x86_64_defconfig+x86-chromebook (gcc-10): 3 warnings

Errors summary:

    1    arm-linux-gnueabihf-gcc: error: unrecognized -march target: armv3
    1    arm-linux-gnueabihf-gcc: error: missing argument to ‘-march=’

Warnings summary:

    7    ld: warning: creating DT_TEXTREL in a PIE
    6    aarch64-linux-gnu-ld: warning: -z norelro ignored
    4    ld: arch/x86/boot/compressed/head_64.o: warning: relocation in read-only section `.head.text'
    4    arch/x86/entry/entry_64.S:1738: Warning: no instruction mnemonic suffix given and no register operands; using default for `sysret'
    3    ld: arch/x86/boot/compressed/head_32.o: warning: relocation in read-only section `.head.text'
    2    sound/pci/echoaudio/echoaudio_dsp.c:647:9: warning: iteration 1073741824 invokes undefined behavior [-Waggressive-loop-optimizations]
    2    net/core/rtnetlink.c:3197:1: warning: the frame size of 1328 bytes is larger than 1024 bytes [-Wframe-larger-than=]
    1    {standard input}:132: Warning: macro instruction expanded into multiple instructions
    1    sound/pci/echoaudio/echoaudio_dsp.c:658:9: warning: iteration 1073741824 invokes undefined behavior [-Waggressive-loop-optimizations]
    1    net/core/rtnetlink.c:3197:1: warning: the frame size of 1344 bytes is larger than 1024 bytes [-Wframe-larger-than=]
    1    drivers/gpio/gpio-omap.c:1233:34: warning: array ‘omap_gpio_match’ assumed to have one element

================================================================================

Detailed per-defconfig build reports:

--------------------------------------------------------------------------------
32r2el_defconfig (mips, gcc-10) — PASS, 0 errors, 0 warnings, 0 section mismatches

--------------------------------------------------------------------------------
acs5k_defconfig (arm, gcc-10) — PASS, 0 errors, 0 warnings, 0 section mismatches

--------------------------------------------------------------------------------
acs5k_tiny_defconfig (arm, gcc-10) — PASS, 0 errors, 0 warnings, 0 section mismatches

--------------------------------------------------------------------------------
allnoconfig (riscv, gcc-10) — FAIL, 0 errors, 0 warnings, 0 section mismatches

--------------------------------------------------------------------------------
allnoconfig (arc, gcc-10) — PASS, 0 errors, 0 warnings, 0 section mismatches

--------------------------------------------------------------------------------
allnoconfig (x86_64, gcc-10) — PASS, 0 errors, 3 warnings, 0 section mismatches

Warnings:
    arch/x86/entry/entry_64.S:1738: Warning: no instruction mnemonic suffix given and no register operands; using default for `sysret'
    ld: arch/x86/boot/compressed/head_64.o: warning: relocation in read-only section `.head.text'
    ld: warning: creating DT_TEXTREL in a PIE

--------------------------------------------------------------------------------
allnoconfig (i386, gcc-10) — PASS, 0 errors, 2 warnings, 0 section mismatches

Warnings:
    ld: arch/x86/boot/compressed/head_32.o: warning: relocation in read-only section `.head.text'
    ld: warning: creating DT_TEXTREL in a PIE

--------------------------------------------------------------------------------
am200epdkit_defconfig (arm, gcc-10) — PASS, 0 errors, 0 warnings, 0 section mismatches

--------------------------------------------------------------------------------
ar7_defconfig (mips, gcc-10) — PASS, 0 errors, 0 warnings, 0 section mismatches

--------------------------------------------------------------------------------
aspeed_g4_defconfig (arm, gcc-10) — PASS, 0 errors, 0 warnings, 0 section mismatches

--------------------------------------------------------------------------------
aspeed_g5_defconfig (arm, gcc-10) — PASS, 0 errors, 0 warnings, 0 section mismatches

--------------------------------------------------------------------------------
assabet_defconfig (arm, gcc-10) — PASS, 0 errors, 0 warnings, 0 section mismatches

--------------------------------------------------------------------------------
at91_dt_defconfig (arm, gcc-10) — PASS, 0 errors, 0 warnings, 0 section mismatches

--------------------------------------------------------------------------------
ath25_defconfig (mips, gcc-10) — PASS, 0 errors, 0 warnings, 0 section mismatches

--------------------------------------------------------------------------------
ath79_defconfig (mips, gcc-10) — PASS, 0 errors, 0 warnings, 0 section mismatches

--------------------------------------------------------------------------------
axm55xx_defconfig (arm, gcc-10) — PASS, 0 errors, 0 warnings, 0 section mismatches

--------------------------------------------------------------------------------
axs103_defconfig (arc, gcc-10) — PASS, 0 errors, 0 warnings, 0 section mismatches

--------------------------------------------------------------------------------
axs103_smp_defconfig (arc, gcc-10) — PASS, 0 errors, 0 warnings, 0 section mismatches

--------------------------------------------------------------------------------
badge4_defconfig (arm, gcc-10) — PASS, 0 errors, 0 warnings, 0 section mismatches

--------------------------------------------------------------------------------
bcm2835_defconfig (arm, gcc-10) — PASS, 0 errors, 0 warnings, 0 section mismatches

--------------------------------------------------------------------------------
bcm47xx_defconfig (mips, gcc-10) — PASS, 0 errors, 0 warnings, 0 section mismatches

--------------------------------------------------------------------------------
bcm63xx_defconfig (mips, gcc-10) — PASS, 0 errors, 0 warnings, 0 section mismatches

--------------------------------------------------------------------------------
bigsur_defconfig (mips, gcc-10) — PASS, 0 errors, 0 warnings, 0 section mismatches

--------------------------------------------------------------------------------
bmips_be_defconfig (mips, gcc-10) — PASS, 0 errors, 0 warnings, 0 section mismatches

--------------------------------------------------------------------------------
bmips_stb_defconfig (mips, gcc-10) — PASS, 0 errors, 0 warnings, 0 section mismatches

--------------------------------------------------------------------------------
capcella_defconfig (mips, gcc-10) — PASS, 0 errors, 0 warnings, 0 section mismatches

--------------------------------------------------------------------------------
cavium_octeon_defconfig (mips, gcc-10) — PASS, 0 errors, 0 warnings, 0 section mismatches

--------------------------------------------------------------------------------
cerfcube_defconfig (arm, gcc-10) — PASS, 0 errors, 0 warnings, 0 section mismatches

--------------------------------------------------------------------------------
ci20_defconfig (mips, gcc-10) — PASS, 0 errors, 0 warnings, 0 section mismatches

--------------------------------------------------------------------------------
cm_x2xx_defconfig (arm, gcc-10) — PASS, 0 errors, 0 warnings, 0 section mismatches

--------------------------------------------------------------------------------
cm_x300_defconfig (arm, gcc-10) — PASS, 0 errors, 0 warnings, 0 section mismatches

--------------------------------------------------------------------------------
cobalt_defconfig (mips, gcc-10) — PASS, 0 errors, 0 warnings, 0 section mismatches

--------------------------------------------------------------------------------
colibri_pxa270_defconfig (arm, gcc-10) — PASS, 0 errors, 0 warnings, 0 section mismatches

--------------------------------------------------------------------------------
colibri_pxa300_defconfig (arm, gcc-10) — PASS, 0 errors, 0 warnings, 0 section mismatches

--------------------------------------------------------------------------------
collie_defconfig (arm, gcc-10) — PASS, 0 errors, 0 warnings, 0 section mismatches

--------------------------------------------------------------------------------
corgi_defconfig (arm, gcc-10) — PASS, 0 errors, 0 warnings, 0 section mismatches

--------------------------------------------------------------------------------
davinci_all_defconfig (arm, gcc-10) — PASS, 0 errors, 0 warnings, 0 section mismatches

--------------------------------------------------------------------------------
db1xxx_defconfig (mips, gcc-10) — PASS, 0 errors, 0 warnings, 0 section mismatches

--------------------------------------------------------------------------------
decstation_defconfig (mips, gcc-10) — PASS, 0 errors, 0 warnings, 0 section mismatches

--------------------------------------------------------------------------------
defconfig (riscv, gcc-10) — FAIL, 0 errors, 0 warnings, 0 section mismatches

--------------------------------------------------------------------------------
defconfig (arm64, gcc-10) — PASS, 0 errors, 3 warnings, 0 section mismatches

Warnings:
    aarch64-linux-gnu-ld: warning: -z norelro ignored
    aarch64-linux-gnu-ld: warning: -z norelro ignored
    aarch64-linux-gnu-ld: warning: -z norelro ignored

--------------------------------------------------------------------------------
defconfig+arm64-chromebook (arm64, gcc-10) — PASS, 0 errors, 3 warnings, 0 section mismatches

Warnings:
    aarch64-linux-gnu-ld: warning: -z norelro ignored
    aarch64-linux-gnu-ld: warning: -z norelro ignored
    aarch64-linux-gnu-ld: warning: -z norelro ignored

--------------------------------------------------------------------------------
dove_defconfig (arm, gcc-10) — PASS, 0 errors, 0 warnings, 0 section mismatches

--------------------------------------------------------------------------------
e55_defconfig (mips, gcc-10) — PASS, 0 errors, 0 warnings, 0 section mismatches

--------------------------------------------------------------------------------
ebsa110_defconfig (arm, gcc-10) — PASS, 0 errors, 0 warnings, 0 section mismatches

--------------------------------------------------------------------------------
efm32_defconfig (arm, gcc-10) — PASS, 0 errors, 0 warnings, 0 section mismatches

--------------------------------------------------------------------------------
em_x270_defconfig (arm, gcc-10) — PASS, 0 errors, 0 warnings, 0 section mismatches

--------------------------------------------------------------------------------
ep93xx_defconfig (arm, gcc-10) — PASS, 0 errors, 0 warnings, 0 section mismatches

--------------------------------------------------------------------------------
eseries_pxa_defconfig (arm, gcc-10) — PASS, 0 errors, 0 warnings, 0 section mismatches

--------------------------------------------------------------------------------
exynos_defconfig (arm, gcc-10) — PASS, 0 errors, 0 warnings, 0 section mismatches

--------------------------------------------------------------------------------
ezx_defconfig (arm, gcc-10) — PASS, 0 errors, 0 warnings, 0 section mismatches

--------------------------------------------------------------------------------
footbridge_defconfig (arm, gcc-10) — PASS, 0 errors, 0 warnings, 0 section mismatches

--------------------------------------------------------------------------------
fuloong2e_defconfig (mips, gcc-10) — PASS, 0 errors, 0 warnings, 0 section mismatches

--------------------------------------------------------------------------------
gcw0_defconfig (mips, gcc-10) — PASS, 0 errors, 0 warnings, 0 section mismatches

--------------------------------------------------------------------------------
gemini_defconfig (arm, gcc-10) — PASS, 0 errors, 0 warnings, 0 section mismatches

--------------------------------------------------------------------------------
gpr_defconfig (mips, gcc-10) — PASS, 0 errors, 0 warnings, 0 section mismatches

--------------------------------------------------------------------------------
h3600_defconfig (arm, gcc-10) — PASS, 0 errors, 0 warnings, 0 section mismatches

--------------------------------------------------------------------------------
h5000_defconfig (arm, gcc-10) — PASS, 0 errors, 0 warnings, 0 section mismatches

--------------------------------------------------------------------------------
hackkit_defconfig (arm, gcc-10) — PASS, 0 errors, 0 warnings, 0 section mismatches

--------------------------------------------------------------------------------
haps_hs_defconfig (arc, gcc-10) — PASS, 0 errors, 0 warnings, 0 section mismatches

--------------------------------------------------------------------------------
haps_hs_smp_defconfig (arc, gcc-10) — PASS, 0 errors, 0 warnings, 0 section mismatches

--------------------------------------------------------------------------------
hisi_defconfig (arm, gcc-10) — PASS, 0 errors, 0 warnings, 0 section mismatches

--------------------------------------------------------------------------------
hsdk_defconfig (arc, gcc-10) — PASS, 0 errors, 0 warnings, 0 section mismatches

--------------------------------------------------------------------------------
i386_defconfig (i386, gcc-10) — PASS, 0 errors, 2 warnings, 0 section mismatches

Warnings:
    ld: arch/x86/boot/compressed/head_32.o: warning: relocation in read-only section `.head.text'
    ld: warning: creating DT_TEXTREL in a PIE

--------------------------------------------------------------------------------
imote2_defconfig (arm, gcc-10) — PASS, 0 errors, 0 warnings, 0 section mismatches

--------------------------------------------------------------------------------
imx_v4_v5_defconfig (arm, gcc-10) — PASS, 0 errors, 0 warnings, 0 section mismatches

--------------------------------------------------------------------------------
imx_v6_v7_defconfig (arm, gcc-10) — PASS, 0 errors, 0 warnings, 0 section mismatches

--------------------------------------------------------------------------------
integrator_defconfig (arm, gcc-10) — PASS, 0 errors, 0 warnings, 0 section mismatches

--------------------------------------------------------------------------------
iop13xx_defconfig (arm, gcc-10) — PASS, 0 errors, 0 warnings, 0 section mismatches

--------------------------------------------------------------------------------
iop32x_defconfig (arm, gcc-10) — PASS, 0 errors, 0 warnings, 0 section mismatches

--------------------------------------------------------------------------------
iop33x_defconfig (arm, gcc-10) — PASS, 0 errors, 0 warnings, 0 section mismatches

--------------------------------------------------------------------------------
ip22_defconfig (mips, gcc-10) — PASS, 0 errors, 0 warnings, 0 section mismatches

--------------------------------------------------------------------------------
ip27_defconfig (mips, gcc-10) — FAIL, 0 errors, 0 warnings, 0 section mismatches

--------------------------------------------------------------------------------
ip28_defconfig (mips, gcc-10) — FAIL, 0 errors, 0 warnings, 0 section mismatches

--------------------------------------------------------------------------------
ip32_defconfig (mips, gcc-10) — PASS, 0 errors, 0 warnings, 0 section mismatches

--------------------------------------------------------------------------------
ixp4xx_defconfig (arm, gcc-10) — PASS, 0 errors, 0 warnings, 0 section mismatches

--------------------------------------------------------------------------------
jazz_defconfig (mips, gcc-10) — PASS, 0 errors, 0 warnings, 0 section mismatches

--------------------------------------------------------------------------------
jmr3927_defconfig (mips, gcc-10) — PASS, 0 errors, 0 warnings, 0 section mismatches

--------------------------------------------------------------------------------
jornada720_defconfig (arm, gcc-10) — PASS, 0 errors, 0 warnings, 0 section mismatches

--------------------------------------------------------------------------------
keystone_defconfig (arm, gcc-10) — PASS, 0 errors, 0 warnings, 0 section mismatches

--------------------------------------------------------------------------------
ks8695_defconfig (arm, gcc-10) — PASS, 0 errors, 0 warnings, 0 section mismatches

--------------------------------------------------------------------------------
lart_defconfig (arm, gcc-10) — PASS, 0 errors, 0 warnings, 0 section mismatches

--------------------------------------------------------------------------------
lasat_defconfig (mips, gcc-10) — PASS, 0 errors, 0 warnings, 0 section mismatches

--------------------------------------------------------------------------------
lemote2f_defconfig (mips, gcc-10) — PASS, 0 errors, 1 warning, 0 section mismatches

Warnings:
    net/core/rtnetlink.c:3197:1: warning: the frame size of 1328 bytes is larger than 1024 bytes [-Wframe-larger-than=]

--------------------------------------------------------------------------------
loongson1b_defconfig (mips, gcc-10) — PASS, 0 errors, 0 warnings, 0 section mismatches

--------------------------------------------------------------------------------
loongson1c_defconfig (mips, gcc-10) — PASS, 0 errors, 0 warnings, 0 section mismatches

--------------------------------------------------------------------------------
loongson3_defconfig (mips, gcc-10) — PASS, 0 errors, 1 warning, 0 section mismatches

Warnings:
    net/core/rtnetlink.c:3197:1: warning: the frame size of 1328 bytes is larger than 1024 bytes [-Wframe-larger-than=]

--------------------------------------------------------------------------------
lpc18xx_defconfig (arm, gcc-10) — PASS, 0 errors, 0 warnings, 0 section mismatches

--------------------------------------------------------------------------------
lpc32xx_defconfig (arm, gcc-10) — PASS, 0 errors, 0 warnings, 0 section mismatches

--------------------------------------------------------------------------------
lpd270_defconfig (arm, gcc-10) — PASS, 0 errors, 0 warnings, 0 section mismatches

--------------------------------------------------------------------------------
lubbock_defconfig (arm, gcc-10) — PASS, 0 errors, 0 warnings, 0 section mismatches

--------------------------------------------------------------------------------
magician_defconfig (arm, gcc-10) — PASS, 0 errors, 0 warnings, 0 section mismatches

--------------------------------------------------------------------------------
mainstone_defconfig (arm, gcc-10) — PASS, 0 errors, 0 warnings, 0 section mismatches

--------------------------------------------------------------------------------
malta_defconfig (mips, gcc-10) — PASS, 0 errors, 0 warnings, 0 section mismatches

--------------------------------------------------------------------------------
malta_kvm_defconfig (mips, gcc-10) — PASS, 0 errors, 0 warnings, 0 section mismatches

--------------------------------------------------------------------------------
malta_kvm_guest_defconfig (mips, gcc-10) — PASS, 0 errors, 0 warnings, 0 section mismatches

--------------------------------------------------------------------------------
malta_qemu_32r6_defconfig (mips, gcc-10) — PASS, 0 errors, 1 warning, 0 section mismatches

Warnings:
    {standard input}:132: Warning: macro instruction expanded into multiple instructions

--------------------------------------------------------------------------------
maltaaprp_defconfig (mips, gcc-10) — PASS, 0 errors, 0 warnings, 0 section mismatches

--------------------------------------------------------------------------------
maltasmvp_defconfig (mips, gcc-10) — PASS, 0 errors, 0 warnings, 0 section mismatches

--------------------------------------------------------------------------------
maltasmvp_eva_defconfig (mips, gcc-10) — PASS, 0 errors, 0 warnings, 0 section mismatches

--------------------------------------------------------------------------------
maltaup_defconfig (mips, gcc-10) — PASS, 0 errors, 0 warnings, 0 section mismatches

--------------------------------------------------------------------------------
maltaup_xpa_defconfig (mips, gcc-10) — PASS, 0 errors, 0 warnings, 0 section mismatches

--------------------------------------------------------------------------------
markeins_defconfig (mips, gcc-10) — PASS, 0 errors, 0 warnings, 0 section mismatches

--------------------------------------------------------------------------------
mini2440_defconfig (arm, gcc-10) — PASS, 0 errors, 0 warnings, 0 section mismatches

--------------------------------------------------------------------------------
mips_paravirt_defconfig (mips, gcc-10) — PASS, 0 errors, 0 warnings, 0 section mismatches

--------------------------------------------------------------------------------
mmp2_defconfig (arm, gcc-10) — PASS, 0 errors, 0 warnings, 0 section mismatches

--------------------------------------------------------------------------------
moxart_defconfig (arm, gcc-10) — PASS, 0 errors, 0 warnings, 0 section mismatches

--------------------------------------------------------------------------------
mpc30x_defconfig (mips, gcc-10) — PASS, 0 errors, 0 warnings, 0 section mismatches

--------------------------------------------------------------------------------
mps2_defconfig (arm, gcc-10) — PASS, 0 errors, 0 warnings, 0 section mismatches

--------------------------------------------------------------------------------
msp71xx_defconfig (mips, gcc-10) — PASS, 0 errors, 0 warnings, 0 section mismatches

--------------------------------------------------------------------------------
mtx1_defconfig (mips, gcc-10) — PASS, 0 errors, 3 warnings, 0 section mismatches

Warnings:
    sound/pci/echoaudio/echoaudio_dsp.c:647:9: warning: iteration 1073741824 invokes undefined behavior [-Waggressive-loop-optimizations]
    sound/pci/echoaudio/echoaudio_dsp.c:658:9: warning: iteration 1073741824 invokes undefined behavior [-Waggressive-loop-optimizations]
    sound/pci/echoaudio/echoaudio_dsp.c:647:9: warning: iteration 1073741824 invokes undefined behavior [-Waggressive-loop-optimizations]

--------------------------------------------------------------------------------
multi_v4t_defconfig (arm, gcc-10) — PASS, 0 errors, 0 warnings, 0 section mismatches

--------------------------------------------------------------------------------
multi_v5_defconfig (arm, gcc-10) — PASS, 0 errors, 0 warnings, 0 section mismatches

--------------------------------------------------------------------------------
multi_v7_defconfig (arm, gcc-10) — PASS, 0 errors, 0 warnings, 0 section mismatches

--------------------------------------------------------------------------------
mvebu_v5_defconfig (arm, gcc-10) — PASS, 0 errors, 0 warnings, 0 section mismatches

--------------------------------------------------------------------------------
mvebu_v7_defconfig (arm, gcc-10) — PASS, 0 errors, 0 warnings, 0 section mismatches

--------------------------------------------------------------------------------
mxs_defconfig (arm, gcc-10) — PASS, 0 errors, 0 warnings, 0 section mismatches

--------------------------------------------------------------------------------
neponset_defconfig (arm, gcc-10) — PASS, 0 errors, 0 warnings, 0 section mismatches

--------------------------------------------------------------------------------
netwinder_defconfig (arm, gcc-10) — PASS, 0 errors, 0 warnings, 0 section mismatches

--------------------------------------------------------------------------------
netx_defconfig (arm, gcc-10) — PASS, 0 errors, 0 warnings, 0 section mismatches

--------------------------------------------------------------------------------
nhk8815_defconfig (arm, gcc-10) — PASS, 0 errors, 0 warnings, 0 section mismatches

--------------------------------------------------------------------------------
nlm_xlp_defconfig (mips, gcc-10) — PASS, 0 errors, 1 warning, 0 section mismatches

Warnings:
    net/core/rtnetlink.c:3197:1: warning: the frame size of 1344 bytes is larger than 1024 bytes [-Wframe-larger-than=]

--------------------------------------------------------------------------------
nlm_xlr_defconfig (mips, gcc-10) — PASS, 0 errors, 0 warnings, 0 section mismatches

--------------------------------------------------------------------------------
nsim_hs_defconfig (arc, gcc-10) — PASS, 0 errors, 0 warnings, 0 section mismatches

--------------------------------------------------------------------------------
nsim_hs_smp_defconfig (arc, gcc-10) — PASS, 0 errors, 0 warnings, 0 section mismatches

--------------------------------------------------------------------------------
nsimosci_hs_defconfig (arc, gcc-10) — PASS, 0 errors, 0 warnings, 0 section mismatches

--------------------------------------------------------------------------------
nsimosci_hs_smp_defconfig (arc, gcc-10) — PASS, 0 errors, 0 warnings, 0 section mismatches

--------------------------------------------------------------------------------
nuc910_defconfig (arm, gcc-10) — PASS, 0 errors, 0 warnings, 0 section mismatches

--------------------------------------------------------------------------------
nuc950_defconfig (arm, gcc-10) — PASS, 0 errors, 0 warnings, 0 section mismatches

--------------------------------------------------------------------------------
nuc960_defconfig (arm, gcc-10) — PASS, 0 errors, 0 warnings, 0 section mismatches

--------------------------------------------------------------------------------
omap1_defconfig (arm, gcc-10) — PASS, 0 errors, 1 warning, 0 section mismatches

Warnings:
    drivers/gpio/gpio-omap.c:1233:34: warning: array ‘omap_gpio_match’ assumed to have one element

--------------------------------------------------------------------------------
omap2plus_defconfig (arm, gcc-10) — PASS, 0 errors, 0 warnings, 0 section mismatches

--------------------------------------------------------------------------------
omega2p_defconfig (mips, gcc-10) — PASS, 0 errors, 0 warnings, 0 section mismatches

--------------------------------------------------------------------------------
orion5x_defconfig (arm, gcc-10) — PASS, 0 errors, 0 warnings, 0 section mismatches

--------------------------------------------------------------------------------
oxnas_v6_defconfig (arm, gcc-10) — PASS, 0 errors, 0 warnings, 0 section mismatches

--------------------------------------------------------------------------------
palmz72_defconfig (arm, gcc-10) — PASS, 0 errors, 0 warnings, 0 section mismatches

--------------------------------------------------------------------------------
pcm027_defconfig (arm, gcc-10) — PASS, 0 errors, 0 warnings, 0 section mismatches

--------------------------------------------------------------------------------
pic32mzda_defconfig (mips, gcc-10) — PASS, 0 errors, 0 warnings, 0 section mismatches

--------------------------------------------------------------------------------
pistachio_defconfig (mips, gcc-10) — PASS, 0 errors, 0 warnings, 0 section mismatches

--------------------------------------------------------------------------------
pleb_defconfig (arm, gcc-10) — PASS, 0 errors, 0 warnings, 0 section mismatches

--------------------------------------------------------------------------------
pnx8335_stb225_defconfig (mips, gcc-10) — PASS, 0 errors, 0 warnings, 0 section mismatches

--------------------------------------------------------------------------------
prima2_defconfig (arm, gcc-10) — PASS, 0 errors, 0 warnings, 0 section mismatches

--------------------------------------------------------------------------------
pxa168_defconfig (arm, gcc-10) — PASS, 0 errors, 0 warnings, 0 section mismatches

--------------------------------------------------------------------------------
pxa255-idp_defconfig (arm, gcc-10) — PASS, 0 errors, 0 warnings, 0 section mismatches

--------------------------------------------------------------------------------
pxa3xx_defconfig (arm, gcc-10) — PASS, 0 errors, 0 warnings, 0 section mismatches

--------------------------------------------------------------------------------
pxa910_defconfig (arm, gcc-10) — PASS, 0 errors, 0 warnings, 0 section mismatches

--------------------------------------------------------------------------------
pxa_defconfig (arm, gcc-10) — PASS, 0 errors, 0 warnings, 0 section mismatches

--------------------------------------------------------------------------------
qcom_defconfig (arm, gcc-10) — PASS, 0 errors, 0 warnings, 0 section mismatches

--------------------------------------------------------------------------------
qi_lb60_defconfig (mips, gcc-10) — PASS, 0 errors, 0 warnings, 0 section mismatches

--------------------------------------------------------------------------------
raumfeld_defconfig (arm, gcc-10) — PASS, 0 errors, 0 warnings, 0 section mismatches

--------------------------------------------------------------------------------
rb532_defconfig (mips, gcc-10) — PASS, 0 errors, 0 warnings, 0 section mismatches

--------------------------------------------------------------------------------
rbtx49xx_defconfig (mips, gcc-10) — PASS, 0 errors, 0 warnings, 0 section mismatches

--------------------------------------------------------------------------------
realview_defconfig (arm, gcc-10) — PASS, 0 errors, 0 warnings, 0 section mismatches

--------------------------------------------------------------------------------
rm200_defconfig (mips, gcc-10) — PASS, 0 errors, 0 warnings, 0 section mismatches

--------------------------------------------------------------------------------
rpc_defconfig (arm, gcc-10) — FAIL, 2 errors, 0 warnings, 0 section mismatches

Errors:
    arm-linux-gnueabihf-gcc: error: unrecognized -march target: armv3
    arm-linux-gnueabihf-gcc: error: missing argument to ‘-march=’

--------------------------------------------------------------------------------
rt305x_defconfig (mips, gcc-10) — PASS, 0 errors, 0 warnings, 0 section mismatches

--------------------------------------------------------------------------------
s3c2410_defconfig (arm, gcc-10) — PASS, 0 errors, 0 warnings, 0 section mismatches

--------------------------------------------------------------------------------
s3c6400_defconfig (arm, gcc-10) — PASS, 0 errors, 0 warnings, 0 section mismatches

--------------------------------------------------------------------------------
s5pv210_defconfig (arm, gcc-10) — PASS, 0 errors, 0 warnings, 0 section mismatches

--------------------------------------------------------------------------------
sama5_defconfig (arm, gcc-10) — PASS, 0 errors, 0 warnings, 0 section mismatches

--------------------------------------------------------------------------------
sb1250_swarm_defconfig (mips, gcc-10) — PASS, 0 errors, 0 warnings, 0 section mismatches

--------------------------------------------------------------------------------
shannon_defconfig (arm, gcc-10) — PASS, 0 errors, 0 warnings, 0 section mismatches

--------------------------------------------------------------------------------
shmobile_defconfig (arm, gcc-10) — PASS, 0 errors, 0 warnings, 0 section mismatches

--------------------------------------------------------------------------------
simpad_defconfig (arm, gcc-10) — PASS, 0 errors, 0 warnings, 0 section mismatches

--------------------------------------------------------------------------------
socfpga_defconfig (arm, gcc-10) — PASS, 0 errors, 0 warnings, 0 section mismatches

--------------------------------------------------------------------------------
spear13xx_defconfig (arm, gcc-10) — PASS, 0 errors, 0 warnings, 0 section mismatches

--------------------------------------------------------------------------------
spear3xx_defconfig (arm, gcc-10) — PASS, 0 errors, 0 warnings, 0 section mismatches

--------------------------------------------------------------------------------
spear6xx_defconfig (arm, gcc-10) — PASS, 0 errors, 0 warnings, 0 section mismatches

--------------------------------------------------------------------------------
spitz_defconfig (arm, gcc-10) — PASS, 0 errors, 0 warnings, 0 section mismatches

--------------------------------------------------------------------------------
stm32_defconfig (arm, gcc-10) — PASS, 0 errors, 0 warnings, 0 section mismatches

--------------------------------------------------------------------------------
sunxi_defconfig (arm, gcc-10) — PASS, 0 errors, 0 warnings, 0 section mismatches

--------------------------------------------------------------------------------
tango4_defconfig (arm, gcc-10) — PASS, 0 errors, 0 warnings, 0 section mismatches

--------------------------------------------------------------------------------
tb0219_defconfig (mips, gcc-10) — PASS, 0 errors, 0 warnings, 0 section mismatches

--------------------------------------------------------------------------------
tb0226_defconfig (mips, gcc-10) — PASS, 0 errors, 0 warnings, 0 section mismatches

--------------------------------------------------------------------------------
tb0287_defconfig (mips, gcc-10) — PASS, 0 errors, 0 warnings, 0 section mismatches

--------------------------------------------------------------------------------
tct_hammer_defconfig (arm, gcc-10) — PASS, 0 errors, 0 warnings, 0 section mismatches

--------------------------------------------------------------------------------
tegra_defconfig (arm, gcc-10) — PASS, 0 errors, 0 warnings, 0 section mismatches

--------------------------------------------------------------------------------
tinyconfig (x86_64, gcc-10) — PASS, 0 errors, 3 warnings, 0 section mismatches

Warnings:
    arch/x86/entry/entry_64.S:1738: Warning: no instruction mnemonic suffix given and no register operands; using default for `sysret'
    ld: arch/x86/boot/compressed/head_64.o: warning: relocation in read-only section `.head.text'
    ld: warning: creating DT_TEXTREL in a PIE

--------------------------------------------------------------------------------
tinyconfig (arc, gcc-10) — PASS, 0 errors, 0 warnings, 0 section mismatches

--------------------------------------------------------------------------------
tinyconfig (riscv, gcc-10) — FAIL, 0 errors, 0 warnings, 0 section mismatches

--------------------------------------------------------------------------------
tinyconfig (i386, gcc-10) — PASS, 0 errors, 2 warnings, 0 section mismatches

Warnings:
    ld: arch/x86/boot/compressed/head_32.o: warning: relocation in read-only section `.head.text'
    ld: warning: creating DT_TEXTREL in a PIE

--------------------------------------------------------------------------------
trizeps4_defconfig (arm, gcc-10) — PASS, 0 errors, 0 warnings, 0 section mismatches

--------------------------------------------------------------------------------
u300_defconfig (arm, gcc-10) — PASS, 0 errors, 0 warnings, 0 section mismatches

--------------------------------------------------------------------------------
u8500_defconfig (arm, gcc-10) — PASS, 0 errors, 0 warnings, 0 section mismatches

--------------------------------------------------------------------------------
vdk_hs38_defconfig (arc, gcc-10) — PASS, 0 errors, 0 warnings, 0 section mismatches

--------------------------------------------------------------------------------
vdk_hs38_smp_defconfig (arc, gcc-10) — PASS, 0 errors, 0 warnings, 0 section mismatches

--------------------------------------------------------------------------------
versatile_defconfig (arm, gcc-10) — PASS, 0 errors, 0 warnings, 0 section mismatches

--------------------------------------------------------------------------------
vexpress_defconfig (arm, gcc-10) — PASS, 0 errors, 0 warnings, 0 section mismatches

--------------------------------------------------------------------------------
vf610m4_defconfig (arm, gcc-10) — PASS, 0 errors, 0 warnings, 0 section mismatches

--------------------------------------------------------------------------------
viper_defconfig (arm, gcc-10) — PASS, 0 errors, 0 warnings, 0 section mismatches

--------------------------------------------------------------------------------
vocore2_defconfig (mips, gcc-10) — PASS, 0 errors, 0 warnings, 0 section mismatches

--------------------------------------------------------------------------------
vt8500_v6_v7_defconfig (arm, gcc-10) — PASS, 0 errors, 0 warnings, 0 section mismatches

--------------------------------------------------------------------------------
workpad_defconfig (mips, gcc-10) — PASS, 0 errors, 0 warnings, 0 section mismatches

--------------------------------------------------------------------------------
x86_64_defconfig (x86_64, gcc-10) — PASS, 0 errors, 3 warnings, 0 section mismatches

Warnings:
    arch/x86/entry/entry_64.S:1738: Warning: no instruction mnemonic suffix given and no register operands; using default for `sysret'
    ld: arch/x86/boot/compressed/head_64.o: warning: relocation in read-only section `.head.text'
    ld: warning: creating DT_TEXTREL in a PIE

--------------------------------------------------------------------------------
x86_64_defconfig+x86-chromebook (x86_64, gcc-10) — PASS, 0 errors, 3 warnings, 0 section mismatches

Warnings:
    arch/x86/entry/entry_64.S:1738: Warning: no instruction mnemonic suffix given and no register operands; using default for `sysret'
    ld: arch/x86/boot/compressed/head_64.o: warning: relocation in read-only section `.head.text'
    ld: warning: creating DT_TEXTREL in a PIE

--------------------------------------------------------------------------------
xcep_defconfig (arm, gcc-10) — PASS, 0 errors, 0 warnings, 0 section mismatches

--------------------------------------------------------------------------------
zeus_defconfig (arm, gcc-10) — PASS, 0 errors, 0 warnings, 0 section mismatches

--------------------------------------------------------------------------------
zx_defconfig (arm, gcc-10) — PASS, 0 errors, 0 warnings, 0 section mismatches

---
For more info write to <info@kernelci.org>

                 reply	other threads:[~2022-01-04 13:20 UTC|newest]

Thread overview: [no followups] expand[flat|nested]  mbox.gz  Atom feed

Reply instructions:

You may reply publicly to this message via plain-text email
using any one of the following methods:

* Save the following mbox file, import it into your mail client,
  and reply-to-all from there: mbox

  Avoid top-posting and favor interleaved quoting:
  https://en.wikipedia.org/wiki/Posting_style#Interleaved_style

* Reply using the --to, --cc, and --in-reply-to
  switches of git-send-email(1):

  git send-email \
    --in-reply-to=61d4497f.1c69fb81.29af8.bf44@mx.google.com \
    --to=bot@kernelci.org \
    --cc=kernel-build-reports@lists.linaro.org \
    --cc=kernelci-results@groups.io \
    --cc=stable@vger.kernel.org \
    /path/to/YOUR_REPLY

  https://kernel.org/pub/software/scm/git/docs/git-send-email.html

* If your mail client supports setting the In-Reply-To header
  via mailto: links, try the mailto: link
Be sure your reply has a Subject: header at the top and a blank line before the message body.
This is an external index of several public inboxes,
see mirroring instructions on how to clone and mirror
all data and code used by this external index.