All of lore.kernel.org
 help / color / mirror / Atom feed
* kselftest/fixes build: 5 builds: 2 failed, 3 passed, 2 errors, 6 warnings (v6.8-rc1-5-g93ffe3f1e97da)
@ 2024-01-26  0:49 kernelci.org bot
  0 siblings, 0 replies; only message in thread
From: kernelci.org bot @ 2024-01-26  0:49 UTC (permalink / raw)
  To: kernelci-results, linux-kselftest, shuah

kselftest/fixes build: 5 builds: 2 failed, 3 passed, 2 errors, 6 warnings (v6.8-rc1-5-g93ffe3f1e97da)

Full Build Summary: https://kernelci.org/build/kselftest/branch/fixes/kernel/v6.8-rc1-5-g93ffe3f1e97da/

Tree: kselftest
Branch: fixes
Git Describe: v6.8-rc1-5-g93ffe3f1e97da
Git Commit: 93ffe3f1e97da3657451004145e767f88ca218c6
Git URL: https://git.kernel.org/pub/scm/linux/kernel/git/shuah/linux-kselftest.git
Built: 4 unique architectures

Build Failures Detected:

i386:
    i386_defconfig+kselftest: (gcc-10) FAIL

x86_64:
    x86_64_defconfig+kselftest: (gcc-10) FAIL

Errors and Warnings Detected:

arm64:
    defconfig+kselftest (gcc-10): 1 warning
    defconfig+kselftest+arm64-chromebook (gcc-10): 1 warning

arm:
    multi_v7_defconfig+kselftest (gcc-10): 1 warning

i386:
    i386_defconfig+kselftest (gcc-10): 1 error, 1 warning

x86_64:
    x86_64_defconfig+kselftest (gcc-10): 1 error, 1 warning
    x86_64_defconfig+kselftest (clang-16): 1 warning

Errors summary:

    2    include/linux/fortify-string.h:57:29: error: ‘__builtin_memcpy’ offset 32 is out of the bounds [0, 0] [-Werror=array-bounds]

Warnings summary:

    2    include/linux/fortify-string.h:57:29: warning: ‘__builtin_memcpy’ offset 32 is out of the bounds [0, 0] [-Warray-bounds]
    2    cc1: all warnings being treated as errors
    1    vmlinux.o: warning: objtool: set_ftrace_ops_ro+0x39: relocation to !ENDBR: .text+0x14cfd6

================================================================================

Detailed per-defconfig build reports:

--------------------------------------------------------------------------------
defconfig+kselftest (arm64, gcc-10) — PASS, 0 errors, 1 warning, 0 section mismatches

Warnings:
    include/linux/fortify-string.h:57:29: warning: ‘__builtin_memcpy’ offset 32 is out of the bounds [0, 0] [-Warray-bounds]

--------------------------------------------------------------------------------
defconfig+kselftest+arm64-chromebook (arm64, gcc-10) — PASS, 0 errors, 1 warning, 0 section mismatches

Warnings:
    include/linux/fortify-string.h:57:29: warning: ‘__builtin_memcpy’ offset 32 is out of the bounds [0, 0] [-Warray-bounds]

--------------------------------------------------------------------------------
i386_defconfig+kselftest (i386, gcc-10) — FAIL, 1 error, 1 warning, 0 section mismatches

Errors:
    include/linux/fortify-string.h:57:29: error: ‘__builtin_memcpy’ offset 32 is out of the bounds [0, 0] [-Werror=array-bounds]

Warnings:
    cc1: all warnings being treated as errors

--------------------------------------------------------------------------------
multi_v7_defconfig+kselftest (arm, gcc-10) — PASS, 0 errors, 1 warning, 0 section mismatches

Warnings:
    include/linux/fortify-string.h:57:29: warning: ‘__builtin_memcpy’ offset 32 is out of the bounds [0, 0] [-Warray-bounds]

--------------------------------------------------------------------------------
x86_64_defconfig+kselftest (x86_64, gcc-10) — FAIL, 1 error, 1 warning, 0 section mismatches

Errors:
    include/linux/fortify-string.h:57:29: error: ‘__builtin_memcpy’ offset 32 is out of the bounds [0, 0] [-Werror=array-bounds]

Warnings:
    cc1: all warnings being treated as errors

--------------------------------------------------------------------------------
x86_64_defconfig+kselftest (x86_64, clang-16) — PASS, 0 errors, 1 warning, 0 section mismatches

Warnings:
    vmlinux.o: warning: objtool: set_ftrace_ops_ro+0x39: relocation to !ENDBR: .text+0x14cfd6

---
For more info write to <info@kernelci.org>

^ permalink raw reply	[flat|nested] only message in thread

only message in thread, other threads:[~2024-01-26  0:49 UTC | newest]

Thread overview: (only message) (download: mbox.gz / follow: Atom feed)
-- links below jump to the message on this page --
2024-01-26  0:49 kselftest/fixes build: 5 builds: 2 failed, 3 passed, 2 errors, 6 warnings (v6.8-rc1-5-g93ffe3f1e97da) kernelci.org bot

This is an external index of several public inboxes,
see mirroring instructions on how to clone and mirror
all data and code used by this external index.