All of lore.kernel.org
 help / color / mirror / Atom feed
[PATCH 00/17] iio:adc:ad7280a Cleanup and proposed staging graduation
 2021-07-11 14:50 UTC  (4+ messages)

[PATCHv3 bpf-next 0/7] bpf, x86: Add bpf_get_func_ip helper
 2021-07-11 14:48 UTC  (12+ messages)
` [PATCHv3 bpf-next 3/7] bpf: Add bpf_get_func_ip helper for tracing programs
` [PATCHv3 bpf-next 4/7] bpf: Add bpf_get_func_ip helper for kprobe programs
` [PATCHv3 bpf-next 7/7] selftests/bpf: Add test for bpf_get_func_ip in kprobe+offset probe

[syzbot] INFO: task hung in io_uring_cancel_generic
 2021-07-11 14:45 UTC  (4+ messages)

[PATCH][dunfell] bootchart2: update 0.14.8 -> 0.14.9
 2021-07-11 14:45 UTC 

stable-rc/linux-5.12.y build: 177 builds: 0 failed, 177 passed, 12 warnings (v5.12.16)
 2021-07-11 14:39 UTC 

[xiang-linux:erofs/lzma 8/8] fs/erofs/decompressor-lzma.c:140:5: warning: no previous prototype for 'z_erofs_lzma_decompress'
 2021-07-11 14:36 UTC 

[PATCH 1/2] ARM: dts: rockchip: remove interrupt-names from iommu nodes
 2021-07-11 14:34 UTC  (6+ messages)
` [PATCH 2/2] arm64: "

[xen-unstable-smoke test] 163564: regressions - FAIL
 2021-07-11 14:34 UTC 

[PATCH v2] kretprobe scalability improvement
 2021-07-11 14:33 UTC  (2+ messages)

OE-core CVE metrics for dunfell on Sun 11 Jul 2021 04:30:01 AM HST
 2021-07-11 14:32 UTC 

intermittent hang in qos-test for qemu-system-i386 on 32-bit arm host
 2021-07-11 14:27 UTC  (6+ messages)

stable-rc/linux-5.13.y build: 177 builds: 2 failed, 175 passed, 8 warnings (v5.13.1)
 2021-07-11 14:27 UTC 

[dpdk-dev] [PATCH] dmadev: introduce DMA device library
 2021-07-11 14:25 UTC  (5+ messages)
` [dpdk-dev] [PATCH v2] "

[ovmf test] 163557: regressions - FAIL
 2021-07-11 14:23 UTC 

Re: [PATCH v2] mm: hugetlb: add hwcrp_hugepages to record memory failure on hugetlbfs
 2021-07-11 14:20 UTC  (2+ messages)

[btrfs] 483a265a17: aim7.jobs-per-min 2.8% improvement
 2021-07-11 14:18 UTC 

[PATCH] rtw88: Fix out-of-bounds write
 2021-07-11 14:16 UTC 

[RFC PATCH v1 1/3] locking/lockdep: Fix false warning of check_wait_context()
 2021-07-11 14:14 UTC  (3+ messages)
` [RFC PATCH v1 2/3] locking/lockdep: Unify the return values "
` [PATCH v1 3/3] locking/lockdep,doc: Correct the max number of lock classes

stable-rc/linux-5.4.y build: 186 builds: 0 failed, 186 passed, 91 warnings (v5.4.131)
 2021-07-11 14:14 UTC 

[PULL SUBSYSTEM qemu-pseries] pseries: Update SLOF firmware image
 2021-07-11 14:10 UTC 

[PATCH v3 0/2] DMA fixes for PS3 gelic network driver
 2021-07-11 14:10 UTC  (7+ messages)
` [PATCH v3 1/2] net/ps3_gelic: Add gelic_descr structures
` [PATCH v3 2/2] net/ps3_gelic: Cleanups, improve logging

[PATCH v2] drivers:edac: Use DEVICE_ATTR helper macros
 2021-07-11 14:10 UTC 

[PATCH -tip v8 00/13] kprobes: Fix stacktrace with kretprobes on x86
 2021-07-11 14:09 UTC  (13+ messages)
` [PATCH -tip v8 11/13] x86/unwind: Recover kretprobe trampoline entry

[PATCH v12 00/17] Introduce the Counter character device interface
 2021-07-11 14:08 UTC  (22+ messages)
` [PATCH v12 10/17] counter: Add "
` [PATCH v12 12/17] tools/counter: Create Counter tools
` [PATCH v12 14/17] counter: Implement *_component_id sysfs attributes
` [PATCH v12 17/17] counter: 104-quad-8: Add IRQ support for the ACCES 104-QUAD-8

[PATCH v5 0/2] Add p2p via dmabuf to habanalabs
 2021-07-11 14:06 UTC  (9+ messages)
` [PATCH v5 1/2] habanalabs: define uAPI to export FD for DMA-BUF
` [PATCH v5 2/2] habanalabs: add support for dma-buf exporter

stable-rc/linux-4.14.y build: 193 builds: 0 failed, 193 passed, 64 warnings (v4.14.239)
 2021-07-11 14:03 UTC 

OE-core CVE metrics for master on Sun 11 Jul 2021 04:00:01 AM HST
 2021-07-11 14:02 UTC 

FAILED: patch "[PATCH] mm/page_alloc: fix memory map initialization for descending" failed to apply to 5.10-stable tree
 2021-07-11 13:54 UTC  (2+ messages)

[GIT PULL] IRQ fixes
 2021-07-11 13:40 UTC 

stable-rc/linux-4.9.y build: 185 builds: 0 failed, 185 passed, 4 warnings (v4.9.275)
 2021-07-11 13:40 UTC 

PATCH: improve git switch documentation
 2021-07-11 13:39 UTC  (23+ messages)
  ` What actually is a branch?

[PATCH v1 1/2] dt-bindings: iio: adc: rockchip-saradc: add description for rk3568
 2021-07-11 13:38 UTC  (6+ messages)
` [PATCH v1 2/2] iio: adc: rockchip_saradc: add support for rk3568 saradc

[PATCH -tip v9 00/14] kprobes: Fix stacktrace with kretprobes on x86
 2021-07-11 13:37 UTC  (15+ messages)
` [PATCH -tip v9 01/14] ia64: kprobes: Fix to pass correct trampoline address to the handler
` [PATCH -tip v9 02/14] kprobes: treewide: Replace arch_deref_entry_point() with dereference_symbol_descriptor()
` [PATCH -tip v9 03/14] kprobes: treewide: Remove trampoline_address from kretprobe_trampoline_handler()
` [PATCH -tip v9 04/14] kprobes: treewide: Make it harder to refer kretprobe_trampoline directly
` [PATCH -tip v9 05/14] kprobes: Add kretprobe_find_ret_addr() for searching return address
` [PATCH -tip v9 06/14] x86/kprobes: Add UNWIND_HINT_FUNC on kretprobe_trampoline()
` [PATCH -tip v9 07/14] ARC: Add instruction_pointer_set() API
` [PATCH -tip v9 08/14] ia64: "
` [PATCH -tip v9 09/14] arm: kprobes: Make space for instruction pointer on stack
` [PATCH -tip v9 10/14] kprobes: Enable stacktrace from pt_regs in kretprobe handler
` [PATCH -tip v9 11/14] x86/kprobes: Push a fake return address at kretprobe_trampoline
` [PATCH -tip v9 12/14] x86/unwind: Recover kretprobe trampoline entry
` [PATCH -tip v9 13/14] tracing: Show kretprobe unknown indicator only for kretprobe_trampoline
` [PATCH -tip v9 14/14] x86/kprobes: Fixup return address in generic trampoline handler

stable/linux-5.10.y build: 182 builds: 0 failed, 182 passed, 15 warnings (v5.10.49)
 2021-07-11 13:35 UTC 

[GIT PULL] scheduler fixes
 2021-07-11 13:32 UTC 

[PATCH v2 rdma-rc] RDMA/bnxt_re: Fix stats counters
 2021-07-11 13:31 UTC 

[PULL 00/17] target-arm queue
 2021-07-11 13:31 UTC  (2+ messages)

[PATCH rdma-rc] RDMA/bnxt_re: Fix stats counters
 2021-07-11 13:29 UTC  (3+ messages)

[GIT PULL] perf fixes
 2021-07-11 13:26 UTC 

[GIT PULL] locking fixes
 2021-07-11 13:22 UTC 

[PATCH] sched: Fix nr_uninterruptible race causing increasing load average
 2021-07-11 13:19 UTC  (10+ messages)

[PATCH] nvme-tcp: Use __dev_get_by_name instead dev_get_by_name for OPT_HOST_IFACE
 2021-07-11 13:17 UTC  (3+ messages)

[dpdk-dev] [PATCH] net/mvpp2: fix declare unsupported vlan offload features
 2021-07-11 13:13 UTC 

[dpdk-dev] [PATCH] net/mvpp2: config and commit tm after port configured
 2021-07-11 13:12 UTC 

FAILED: patch "[PATCH] fuse: reject internal errno" failed to apply to 4.9-stable tree
 2021-07-11 13:11 UTC 

FAILED: patch "[PATCH] fuse: reject internal errno" failed to apply to 4.19-stable tree
 2021-07-11 13:11 UTC 

FAILED: patch "[PATCH] fuse: reject internal errno" failed to apply to 4.14-stable tree
 2021-07-11 13:11 UTC 

FAILED: patch "[PATCH] fuse: reject internal errno" failed to apply to 4.4-stable tree
 2021-07-11 13:11 UTC 

[dpdk-dev] [PATCH] net/mvpp2: fix port max speed overflow
 2021-07-11 13:11 UTC 

[PATCH net-next v4 00/16] net: phy: marvell10g updates
 2021-07-11 13:09 UTC  (4+ messages)
` [PATCH net-next v4 11/16] net: phy: marvell10g: add separate structure for 88X3340

FAILED: patch "[PATCH] evm: Execute evm_inode_init_security() only when an HMAC key" failed to apply to 4.9-stable tree
 2021-07-11 13:09 UTC 

FAILED: patch "[PATCH] evm: Execute evm_inode_init_security() only when an HMAC key" failed to apply to 4.14-stable tree
 2021-07-11 13:09 UTC 

FAILED: patch "[PATCH] selftests/resctrl: Fix incorrect parsing of option "-t"" failed to apply to 5.12-stable tree
 2021-07-11 13:06 UTC 

FAILED: patch "[PATCH] selftests/resctrl: Fix incorrect parsing of option "-t"" failed to apply to 5.10-stable tree
 2021-07-11 13:06 UTC 

FAILED: patch "[PATCH] rsi: fix AP mode with WPA failure due to encrypted EAPOL" failed to apply to 4.14-stable tree
 2021-07-11 13:05 UTC 

FAILED: patch "[PATCH] Revert "drm/amd/display: Fix overlay validation by" failed to apply to 5.13-stable tree
 2021-07-11 13:04 UTC 

FAILED: patch "[PATCH] serial: mvebu-uart: fix calculation of clock divisor" failed to apply to 4.19-stable tree
 2021-07-11 13:02 UTC 

[xen-unstable test] 163552: regressions - FAIL
 2021-07-11 13:01 UTC 

FAILED: patch "[PATCH] iio: accel: bma180: Fix BMA25x bandwidth register values" failed to apply to 4.4-stable tree
 2021-07-11 13:01 UTC 

FAILED: patch "[PATCH] iio: accel: bma180: Fix BMA25x bandwidth register values" failed to apply to 4.9-stable tree
 2021-07-11 13:01 UTC 

FAILED: patch "[PATCH] iio: accel: bma180: Fix BMA25x bandwidth register values" failed to apply to 4.14-stable tree
 2021-07-11 13:01 UTC 

FAILED: patch "[PATCH] iio: accel: bma180: Fix BMA25x bandwidth register values" failed to apply to 4.19-stable tree
 2021-07-11 13:01 UTC 

FAILED: patch "[PATCH] iio: accel: bma180: Fix BMA25x bandwidth register values" failed to apply to 5.4-stable tree
 2021-07-11 13:01 UTC 

FAILED: patch "[PATCH] clk: agilex/stratix10: add support for the 2nd bypass" failed to apply to 5.12-stable tree
 2021-07-11 12:58 UTC 

stable/linux-4.19.y build: 188 builds: 0 failed, 188 passed, 62 warnings (v4.19.197)
 2021-07-11 12:58 UTC 

FAILED: patch "[PATCH] clk: agilex/stratix10: add support for the 2nd bypass" failed to apply to 5.10-stable tree
 2021-07-11 12:58 UTC 

stable/linux-4.4.y build: 183 builds: 0 failed, 183 passed, 9 warnings (v4.4.275)
 2021-07-11 12:58 UTC 

FAILED: patch "[PATCH] f2fs: Show casefolding support only when supported" failed to apply to 5.13-stable tree
 2021-07-11 12:56 UTC 

FAILED: patch "[PATCH] f2fs: Show casefolding support only when supported" failed to apply to 5.12-stable tree
 2021-07-11 12:56 UTC 

FAILED: patch "[PATCH] f2fs: Show casefolding support only when supported" failed to apply to 5.10-stable tree
 2021-07-11 12:56 UTC 

FAILED: patch "[PATCH] f2fs: Show casefolding support only when supported" failed to apply to 5.4-stable tree
 2021-07-11 12:56 UTC 

[PATCH 1/7] habanalabs: missing mutex_unlock in process kill procedure
 2021-07-11 12:54 UTC  (7+ messages)
` [PATCH 2/7] habanalabs: rename cb_mmap to mmap
` [PATCH 3/7] habanalabs: fix nullifying of destroyed mmu pgt pool
` [PATCH 4/7] habanalabs: mark linux image as not loaded after hw_fini
` [PATCH 5/7] habanalabs: fix type of variable
` [PATCH 6/7] habanalabs: add asic property of host dma offset
` [PATCH 7/7] habanalabs: set dma max segment size

stable/linux-4.14.y build: 193 builds: 0 failed, 193 passed, 64 warnings (v4.14.239)
 2021-07-11 12:52 UTC 

stable/linux-5.4.y build: 186 builds: 0 failed, 186 passed, 91 warnings (v5.4.131)
 2021-07-11 12:49 UTC 

[PATCH v6 2/2] ASoC: sun50i-dmic: dt-bindings: add DT bindings for DMIC controller
 2021-07-11 12:48 UTC  (3+ messages)

[Buildroot] [PATCH 1/2] board/wandboard: Switch to extlinux.conf
 2021-07-11 12:48 UTC  (2+ messages)
` [Buildroot] [PATCH 2/2] configs/wandboard: Bump U-Boot and kernel versions

[Buildroot] [PATCH] configs/imx7dpico: bump Kernel and U-Boot version
 2021-07-11 12:44 UTC  (5+ messages)

FAILED: patch "[PATCH] KVM: x86: Force all MMUs to reinitialize if guest CPUID is" failed to apply to 5.4-stable tree
 2021-07-11 12:42 UTC 

FAILED: patch "[PATCH] KVM: x86: Force all MMUs to reinitialize if guest CPUID is" failed to apply to 5.10-stable tree
 2021-07-11 12:42 UTC 

[PATCH v4 0/6] refs: cleanup errno sideband ref related functions
 2021-07-11 12:41 UTC  (4+ messages)
` [PATCH v5 "
  ` [PATCH v5 5/6] refs: explicitly return failure_errno from parse_loose_ref_contents

FAILED: patch "[PATCH] KVM: x86/mmu: Use MMU's role to detect CR4.SMEP value in" failed to apply to 5.4-stable tree
 2021-07-11 12:41 UTC 

FAILED: patch "[PATCH] KVM: x86/mmu: Use MMU's role to detect CR4.SMEP value in" failed to apply to 4.19-stable tree
 2021-07-11 12:41 UTC 

FAILED: patch "[PATCH] KVM: x86/mmu: Use MMU's role to detect CR4.SMEP value in" failed to apply to 4.14-stable tree
 2021-07-11 12:41 UTC 

FAILED: patch "[PATCH] KVM: x86/mmu: Use MMU's role to detect CR4.SMEP value in" failed to apply to 4.9-stable tree
 2021-07-11 12:41 UTC 

FAILED: patch "[PATCH] KVM: x86/mmu: Use MMU's role to detect CR4.SMEP value in" failed to apply to 4.4-stable tree
 2021-07-11 12:41 UTC 

FAILED: patch "[PATCH] KVM: x86/mmu: Treat NX as used (not reserved) for all !TDP" failed to apply to 4.9-stable tree
 2021-07-11 12:40 UTC 

FAILED: patch "[PATCH] KVM: x86/mmu: Treat NX as used (not reserved) for all !TDP" failed to apply to 4.14-stable tree
 2021-07-11 12:40 UTC 

FAILED: patch "[PATCH] KVM: x86/mmu: Treat NX as used (not reserved) for all !TDP" failed to apply to 4.19-stable tree
 2021-07-11 12:40 UTC 

FAILED: patch "[PATCH] KVM: x86/mmu: Treat NX as used (not reserved) for all !TDP" failed to apply to 5.4-stable tree
 2021-07-11 12:40 UTC 

FAILED: patch "[PATCH] KVM: PPC: Book3S HV: Save host FSCR in the P7/8 path" failed to apply to 5.13-stable tree
 2021-07-11 12:39 UTC 

FAILED: patch "[PATCH] KVM: PPC: Book3S HV: Save host FSCR in the P7/8 path" failed to apply to 5.12-stable tree
 2021-07-11 12:39 UTC 

FAILED: patch "[PATCH] KVM: PPC: Book3S HV: Save host FSCR in the P7/8 path" failed to apply to 5.10-stable tree
 2021-07-11 12:39 UTC 

FAILED: patch "[PATCH] KVM: PPC: Book3S HV: Save host FSCR in the P7/8 path" failed to apply to 5.4-stable tree
 2021-07-11 12:39 UTC 

FAILED: patch "[PATCH] KVM: PPC: Book3S HV: Save host FSCR in the P7/8 path" failed to apply to 4.19-stable tree
 2021-07-11 12:39 UTC 

FAILED: patch "[PATCH] KVM: PPC: Book3S HV: Save host FSCR in the P7/8 path" failed to apply to 4.14-stable tree
 2021-07-11 12:39 UTC 

FAILED: patch "[PATCH] KVM: PPC: Book3S HV: Save host FSCR in the P7/8 path" failed to apply to 4.9-stable tree
 2021-07-11 12:39 UTC 

FAILED: patch "[PATCH] KVM: PPC: Book3S HV: Save host FSCR in the P7/8 path" failed to apply to 4.4-stable tree
 2021-07-11 12:39 UTC 

FAILED: patch "[PATCH] mm/gup: fix try_grab_compound_head() race with" failed to apply to 5.4-stable tree
 2021-07-11 12:37 UTC 

FAILED: patch "[PATCH] mm/gup: fix try_grab_compound_head() race with" failed to apply to 4.19-stable tree
 2021-07-11 12:37 UTC 

FAILED: patch "[PATCH] mm/gup: fix try_grab_compound_head() race with" failed to apply to 4.14-stable tree
 2021-07-11 12:37 UTC 

FAILED: patch "[PATCH] mm/gup: fix try_grab_compound_head() race with" failed to apply to 4.9-stable tree
 2021-07-11 12:37 UTC 

FAILED: patch "[PATCH] mm/gup: fix try_grab_compound_head() race with" failed to apply to 4.4-stable tree
 2021-07-11 12:37 UTC 

[PATCH] fault-inject: Declare the second argument of setup_fault_attr() const
 2021-07-11 12:37 UTC  (4+ messages)
` [PATCH v2 13/19] scsi: ufs: Fix a race in the completion path

FAILED: patch "[PATCH] bus: mhi: core: Fix power down latency" failed to apply to 5.10-stable tree
 2021-07-11 12:35 UTC 

[PATCH nf] Revert "netfilter: flowtable: Remove redundant hw refresh bit"
 2021-07-11 12:33 UTC  (3+ messages)

FAILED: patch "[PATCH] btrfs: send: fix invalid path for unlink operations after" failed to apply to 4.9-stable tree
 2021-07-11 12:28 UTC 

FAILED: patch "[PATCH] btrfs: send: fix invalid path for unlink operations after" failed to apply to 4.4-stable tree
 2021-07-11 12:28 UTC 

FAILED: patch "[PATCH] mac80211: remove iwlwifi specific workaround that broke sta" failed to apply to 4.19-stable tree
 2021-07-11 12:26 UTC 

[PATCH V2] powerpc/perf: Enable PMU counters post partition migration if PMU is active
 2021-07-11 12:25 UTC 

FAILED: patch "[PATCH] can: gw: synchronize rcu operations before removing gw job" failed to apply to 4.4-stable tree
 2021-07-11 12:25 UTC 

FAILED: patch "[PATCH] can: gw: synchronize rcu operations before removing gw job" failed to apply to 4.9-stable tree
 2021-07-11 12:25 UTC 

FAILED: patch "[PATCH] can: bcm: delay release of struct bcm_op after" failed to apply to 4.9-stable tree
 2021-07-11 12:24 UTC 

FAILED: patch "[PATCH] can: bcm: delay release of struct bcm_op after" failed to apply to 4.4-stable tree
 2021-07-11 12:24 UTC 

[ti:ti-linux-5.10.y 6302/6309] drivers/net/ethernet/ti/prueth_lre.c:120:6: warning: no previous prototype for 'pru_spin_lock'
 2021-07-11 12:21 UTC 

FAILED: patch "[PATCH] btrfs: compression: don't try to compress if we don't have" failed to apply to 5.4-stable tree
 2021-07-11 12:21 UTC 

FAILED: patch "[PATCH] btrfs: compression: don't try to compress if we don't have" failed to apply to 4.19-stable tree
 2021-07-11 12:21 UTC 

FAILED: patch "[PATCH] btrfs: compression: don't try to compress if we don't have" failed to apply to 4.9-stable tree
 2021-07-11 12:21 UTC 

FAILED: patch "[PATCH] btrfs: compression: don't try to compress if we don't have" failed to apply to 4.14-stable tree
 2021-07-11 12:21 UTC 

FAILED: patch "[PATCH] btrfs: compression: don't try to compress if we don't have" failed to apply to 4.4-stable tree
 2021-07-11 12:21 UTC 

[PATCH v6 1/2] ASoC: sunxi: Add Allwinner H6 Digital MIC driver
 2021-07-11 12:20 UTC  (3+ messages)

[Buildroot] [PATCH] package/sbc: bump to version 1.5
 2021-07-11 12:19 UTC 

FAILED: patch "[PATCH] crypto: ccp - Annotate SEV Firmware file names" failed to apply to 5.4-stable tree
 2021-07-11 12:17 UTC 

FAILED: patch "[PATCH] crypto: nx - Fix memcpy() over-reading in nonce" failed to apply to 5.4-stable tree
 2021-07-11 12:17 UTC 

FAILED: patch "[PATCH] crypto: nx - Fix memcpy() over-reading in nonce" failed to apply to 4.19-stable tree
 2021-07-11 12:17 UTC 

FAILED: patch "[PATCH] crypto: nx - Fix memcpy() over-reading in nonce" failed to apply to 4.14-stable tree
 2021-07-11 12:17 UTC 

FAILED: patch "[PATCH] crypto: nx - Fix memcpy() over-reading in nonce" failed to apply to 4.9-stable tree
 2021-07-11 12:17 UTC 

Running VMs with an eGPU and VFIO: from flaky (<= 5.12.x) to broken (5.13.x)
 2021-07-11 12:15 UTC 

[PATCH 00/17] Makefile: Start simplifying Makefile rules (Part A)
 2021-07-11  3:14 UTC  (2+ messages)
` [PATCH 16/17] i2c: Rename SPL/TPL_I2C_SUPPORT to I2C

page:  |  | latest

This is an external index of several public inboxes,
see mirroring instructions on how to clone and mirror
all data and code used by this external index.