Linux-Next Archive on lore.kernel.org
 help / color / Atom feed
* next/master build: 219 builds: 6 failed, 213 passed, 25 errors, 548 warnings (next-20191021)
@ 2019-10-21  9:49 kernelci.org bot
  0 siblings, 0 replies; only message in thread
From: kernelci.org bot @ 2019-10-21  9:49 UTC (permalink / raw)
  To: linux-next

next/master build: 219 builds: 6 failed, 213 passed, 25 errors, 548 warnings (next-20191021)

Full Build Summary: https://kernelci.org/build/next/branch/master/kernel/next-20191021/

Tree: next
Branch: master
Git Describe: next-20191021
Git Commit: a6fcdcd94927a1b24dea6a9951ffa7c64545ecfb
Git URL: git://git.kernel.org/pub/scm/linux/kernel/git/next/linux-next.git
Built: 7 unique architectures

Build Failures Detected:

arm64:
    allmodconfig: (clang-8) FAIL
    allmodconfig: (gcc-8) FAIL

mips:
    cavium_octeon_defconfig: (gcc-8) FAIL
    ci20_defconfig: (gcc-8) FAIL
    omega2p_defconfig: (gcc-8) FAIL
    vocore2_defconfig: (gcc-8) FAIL

Errors and Warnings Detected:

arc:
    allnoconfig (gcc-8): 1 warning
    axs103_defconfig (gcc-8): 2 warnings
    axs103_smp_defconfig (gcc-8): 2 warnings
    haps_hs_defconfig (gcc-8): 2 warnings
    haps_hs_smp_defconfig (gcc-8): 2 warnings
    hsdk_defconfig (gcc-8): 2 warnings
    nsim_hs_defconfig (gcc-8): 2 warnings
    nsim_hs_defconfig (gcc-8): 30 warnings
    nsim_hs_smp_defconfig (gcc-8): 2 warnings
    nsimosci_hs_defconfig (gcc-8): 2 warnings
    nsimosci_hs_smp_defconfig (gcc-8): 2 warnings
    tinyconfig (gcc-8): 1 warning
    vdk_hs38_defconfig (gcc-8): 1 warning
    vdk_hs38_smp_defconfig (gcc-8): 1 warning

arm64:
    allmodconfig (clang-8): 9 errors, 46 warnings
    allmodconfig (gcc-8): 9 errors, 1 warning
    defconfig (gcc-8): 27 warnings

arm:
    allmodconfig (gcc-8): 18 warnings
    am200epdkit_defconfig (gcc-8): 1 warning
    at91_dt_defconfig (gcc-8): 1 warning
    axm55xx_defconfig (gcc-8): 1 warning
    bcm2835_defconfig (gcc-8): 3 warnings
    cm_x2xx_defconfig (gcc-8): 1 warning
    cm_x300_defconfig (gcc-8): 1 warning
    cns3420vb_defconfig (gcc-8): 1 warning
    colibri_pxa270_defconfig (gcc-8): 1 warning
    colibri_pxa300_defconfig (gcc-8): 1 warning
    davinci_all_defconfig (gcc-8): 1 warning
    dove_defconfig (gcc-8): 1 warning
    em_x270_defconfig (gcc-8): 1 warning
    ep93xx_defconfig (gcc-8): 1 warning
    eseries_pxa_defconfig (gcc-8): 2 warnings
    exynos_defconfig (gcc-8): 171 warnings
    ezx_defconfig (gcc-8): 1 warning
    h5000_defconfig (gcc-8): 1 warning
    imote2_defconfig (gcc-8): 1 warning
    imx_v4_v5_defconfig (gcc-8): 1 warning
    imx_v6_v7_defconfig (gcc-8): 1 warning
    integrator_defconfig (gcc-8): 1 warning
    ixp4xx_defconfig (gcc-8): 1 warning
    keystone_defconfig (gcc-8): 1 warning
    lpc32xx_defconfig (gcc-8): 1 warning
    magician_defconfig (gcc-8): 2 warnings
    milbeaut_m10v_defconfig (gcc-8): 1 warning
    mini2440_defconfig (gcc-8): 1 warning
    mmp2_defconfig (gcc-8): 1 warning
    multi_v5_defconfig (gcc-8): 1 warning
    multi_v7_defconfig (gcc-8): 3 warnings
    multi_v7_defconfig (gcc-8): 3 warnings
    multi_v7_defconfig (gcc-8): 3 warnings
    multi_v7_defconfig (gcc-8): 3 warnings
    multi_v7_defconfig (gcc-8): 30 warnings
    mv78xx0_defconfig (gcc-8): 1 warning
    mvebu_v5_defconfig (gcc-8): 1 warning
    mvebu_v7_defconfig (gcc-8): 1 warning
    mxs_defconfig (gcc-8): 1 warning
    nhk8815_defconfig (gcc-8): 1 warning
    omap1_defconfig (gcc-8): 1 warning
    omap2plus_defconfig (gcc-8): 1 warning
    orion5x_defconfig (gcc-8): 1 warning
    oxnas_v6_defconfig (gcc-8): 1 warning
    palmz72_defconfig (gcc-8): 1 warning
    pcm027_defconfig (gcc-8): 1 warning
    prima2_defconfig (gcc-8): 1 warning
    pxa168_defconfig (gcc-8): 1 warning
    pxa3xx_defconfig (gcc-8): 1 warning
    pxa910_defconfig (gcc-8): 1 warning
    qcom_defconfig (gcc-8): 1 warning
    realview_defconfig (gcc-8): 1 warning
    s3c2410_defconfig (gcc-8): 1 warning
    s3c6400_defconfig (gcc-8): 2 warnings
    s5pv210_defconfig (gcc-8): 1 warning
    sama5_defconfig (gcc-8): 1 warning
    spear13xx_defconfig (gcc-8): 1 warning
    sunxi_defconfig (gcc-8): 1 warning
    tango4_defconfig (gcc-8): 1 warning
    tegra_defconfig (gcc-8): 1 warning
    trizeps4_defconfig (gcc-8): 1 warning
    u300_defconfig (gcc-8): 1 warning
    u8500_defconfig (gcc-8): 1 warning
    versatile_defconfig (gcc-8): 1 warning
    vexpress_defconfig (gcc-8): 1 warning
    viper_defconfig (gcc-8): 1 warning
    xcep_defconfig (gcc-8): 1 warning
    zeus_defconfig (gcc-8): 2 warnings

i386:
    i386_defconfig (gcc-8): 28 warnings

mips:
    32r2el_defconfig (gcc-8): 28 warnings
    cavium_octeon_defconfig (gcc-8): 4 errors, 3 warnings
    ci20_defconfig (gcc-8): 1 error
    db1xxx_defconfig (gcc-8): 1 warning
    malta_qemu_32r6_defconfig (gcc-8): 1 warning
    nlm_xlr_defconfig (gcc-8): 1 warning
    omega2p_defconfig (gcc-8): 1 error
    rbtx49xx_defconfig (gcc-8): 1 warning
    vocore2_defconfig (gcc-8): 1 error

riscv:
    defconfig (gcc-8): 27 warnings
    rv32_defconfig (gcc-8): 6 warnings

x86_64:
    tinyconfig (gcc-8): 1 warning
    x86_64_defconfig (gcc-8): 27 warnings

Errors summary:

    3    include/linux/compiler.h:350:38: error: call to '__compiletime_assert_1659' declared with attribute error: BUILD_BUG_ON failed: stat_items_size != ARRAY_SIZE(vmstat_text) * sizeof(unsigned long)
    2    ERROR: "dpdmai_set_rx_queue" [drivers/dma/fsl-dpaa2-qdma/dpaa2-qdma.ko] undefined!
    2    ERROR: "dpdmai_reset" [drivers/dma/fsl-dpaa2-qdma/dpaa2-qdma.ko] undefined!
    2    ERROR: "dpdmai_open" [drivers/dma/fsl-dpaa2-qdma/dpaa2-qdma.ko] undefined!
    2    ERROR: "dpdmai_get_tx_queue" [drivers/dma/fsl-dpaa2-qdma/dpaa2-qdma.ko] undefined!
    2    ERROR: "dpdmai_get_rx_queue" [drivers/dma/fsl-dpaa2-qdma/dpaa2-qdma.ko] undefined!
    2    ERROR: "dpdmai_get_attributes" [drivers/dma/fsl-dpaa2-qdma/dpaa2-qdma.ko] undefined!
    2    ERROR: "dpdmai_enable" [drivers/dma/fsl-dpaa2-qdma/dpaa2-qdma.ko] undefined!
    2    ERROR: "dpdmai_disable" [drivers/dma/fsl-dpaa2-qdma/dpaa2-qdma.ko] undefined!
    2    ERROR: "dpdmai_close" [drivers/dma/fsl-dpaa2-qdma/dpaa2-qdma.ko] undefined!
    1    drivers/staging/octeon/ethernet.c:516:29: error: type of formal parameter 2 is incomplete
    1    drivers/staging/octeon/ethernet.c:499:30: error: storage size of 'link_info' isn't known
    1    drivers/staging/octeon/ethernet.c:463:30: error: storage size of 'link_info' isn't known
    1    drivers/staging/octeon/ethernet.c:177:21: error: dereferencing pointer to incomplete type 'struct cvmx_wqe'

Warnings summary:

    64   WARNING: "return_address" [vmlinux] is a static EXPORT_SYMBOL_GPL
    26   <stdin>:1511:2: warning: #warning syscall clone3 not implemented [-Wcpp]
    15   1 warning generated.
    9    drivers/net/phy/mdio-cavium.h:113:48: warning: cast to pointer from integer of different size [-Wint-to-pointer-cast]
    6    sound/soc/soc-pcm.c:1207:8: warning: unused variable 'name' [-Wunused-variable]
    6    include/linux/kern_levels.h:5:18: warning: format '%lu' expects argument of type 'long unsigned int', but argument 8 has type 'unsigned int' [-Wformat=]
    5    2 warnings generated.
    4    drivers/net/phy/mdio-cavium.h:114:37: warning: cast to pointer from integer of different size [-Wint-to-pointer-cast]
    2    depmod: WARNING: /home/buildslave/workspace/kernel-build@2/linux/build/_modules_/lib/modules/5.4.0-rc4-next-20191021/kernel/drivers/usb/storage/uas.ko needs unknown symbol usb_stor_sense_invalidCDB
    2    depmod: WARNING: /home/buildslave/workspace/kernel-build@2/linux/build/_modules_/lib/modules/5.4.0-rc4-next-20191021/kernel/drivers/usb/storage/uas.ko needs unknown symbol usb_stor_adjust_quirks
    2    WARNING: modpost: missing MODULE_LICENSE() in drivers/dma/fsl-dpaa2-qdma/dpdmai.o
    2    <stdin>:830:2: warning: #warning syscall fstat64 not implemented [-Wcpp]
    2    <stdin>:1127:2: warning: #warning syscall fstatat64 not implemented [-Wcpp]
    1    {standard input}:134: Warning: macro instruction expanded into multiple instructions
    1    warning: same module names found:
    1    sound/soc/txx9/txx9aclc.c:54:30: warning: unused variable 'rtd' [-Wunused-variable]
    1    net/nfc/hci/llc_shdlc.c:687:34: warning: variable 'connect_wq' is uninitialized when used within its own initialization [-Wuninitialized]
    1    net/nfc/hci/command.c:59:34: warning: variable 'ew_wq' is uninitialized when used within its own initialization [-Wuninitialized]
    1    mm/shmem.c:2737:35: warning: variable 'shmem_falloc_waitq' is uninitialized when used within its own initialization [-Wuninitialized]
    1    kernel/debug/debug_core.c:470:18: warning: array subscript [0, 0] is outside array bounds of 'struct debuggerinfo_struct[1]' [-Warray-bounds]
    1    kernel/debug/debug_core.c:469:33: warning: array subscript [0, 0] is outside array bounds of 'struct debuggerinfo_struct[1]' [-Warray-bounds]
    1    kernel/debug/debug_core.c:452:17: warning: array subscript [0, 0] is outside array bounds of 'struct debuggerinfo_struct[1]' [-Warray-bounds]
    1    fs/proc/proc_sysctl.c:705:35: warning: variable 'wq' is uninitialized when used within its own initialization [-Wuninitialized]
    1    fs/proc/base.c:1894:35: warning: variable 'wq' is uninitialized when used within its own initialization [-Wuninitialized]
    1    fs/nfs/dir.c:448:34: warning: variable 'wq' is uninitialized when used within its own initialization [-Wuninitialized]
    1    fs/nfs/dir.c:1499:34: warning: variable 'wq' is uninitialized when used within its own initialization [-Wuninitialized]
    1    fs/namei.c:3132:34: warning: variable 'wq' is uninitialized when used within its own initialization [-Wuninitialized]
    1    fs/namei.c:1644:34: warning: variable 'wq' is uninitialized when used within its own initialization [-Wuninitialized]
    1    fs/fuse/readdir.c:161:34: warning: variable 'wq' is uninitialized when used within its own initialization [-Wuninitialized]
    1    fs/cifs/readdir.c:83:34: warning: variable 'wq' is uninitialized when used within its own initialization [-Wuninitialized]
    1    fs/afs/dir_silly.c:205:34: warning: variable 'wq' is uninitialized when used within its own initialization [-Wuninitialized]
    1    drivers/staging/octeon/octeon-ethernet.h:94:12: warning: 'union cvmx_helper_link_info' declared inside parameter list will not be visible outside of this definition or declaration
    1    drivers/staging/octeon/ethernet.c:499:30: warning: unused variable 'link_info' [-Wunused-variable]
    1    drivers/staging/octeon/ethernet.c:463:30: warning: unused variable 'link_info' [-Wunused-variable]
    1    drivers/scsi/lpfc/lpfc_sli.c:11855:34: warning: variable 'done_q' is uninitialized when used within its own initialization [-Wuninitialized]
    1    drivers/scsi/lpfc/lpfc_scsi.c:4722:34: warning: variable 'waitq' is uninitialized when used within its own initialization [-Wuninitialized]
    1    drivers/scsi/bfa/bfad_im.c:378:34: warning: variable 'wq' is uninitialized when used within its own initialization [-Wuninitialized]
    1    drivers/scsi/bfa/bfad_im.c:301:34: warning: variable 'wq' is uninitialized when used within its own initialization [-Wuninitialized]
    1    drivers/net/usb/lan78xx.c:2662:34: warning: variable 'unlink_wakeup' is uninitialized when used within its own initialization [-Wuninitialized]
    1    drivers/net/phy/mdio-octeon.c:48:3: warning: cast from pointer to integer of different size [-Wpointer-to-int-cast]
    1    drivers/misc/mic/vop/vop_vringh.c:399:34: warning: variable 'wake' is uninitialized when used within its own initialization [-Wuninitialized]
    1    drivers/misc/mic/vop/vop_vringh.c:155:34: warning: variable 'wake' is uninitialized when used within its own initialization [-Wuninitialized]
    1    drivers/gpu/host1x/syncpt.c:208:34: warning: variable 'wq' is uninitialized when used within its own initialization [-Wuninitialized]
    1    drivers/gpu/drm/amd/amdgpu/../powerplay/renoir_ppt.c:182:26: warning: suggest braces around initialization of subobject [-Wmissing-braces]
    1    drivers/dma/fsl-dpaa2-qdma/dpdmai.c:148:25: warning: variable 'cfg' is uninitialized when used within its own initialization [-Wuninitialized]
    1    drivers/dma/fsl-dpaa2-qdma/dpdmai.c:148:20: warning: variable 'cmd' is uninitialized when used within its own initialization [-Wuninitialized]
    1    drivers/bluetooth/bluecard_cs.c:282:36: warning: variable 'wq' is uninitialized when used within its own initialization [-Wuninitialized]
    1    drivers/android/binderfs.c:657:41: warning: suggest braces around initialization of subobject [-Wmissing-braces]
    1    depmod: WARNING: /home/buildslave/workspace/workspace/kernel-build@9/linux/build/_modules_/lib/modules/5.4.0-rc4-next-20191021/kernel/drivers/usb/storage/uas.ko needs unknown symbol usb_stor_sense_invalidCDB
    1    depmod: WARNING: /home/buildslave/workspace/workspace/kernel-build@9/linux/build/_modules_/lib/modules/5.4.0-rc4-next-20191021/kernel/drivers/usb/storage/uas.ko needs unknown symbol usb_stor_adjust_quirks
    1    depmod: WARNING: /home/buildslave/workspace/workspace/kernel-build@6/linux/build/_modules_/lib/modules/5.4.0-rc4-next-20191021/kernel/drivers/usb/storage/uas.ko needs unknown symbol usb_stor_sense_invalidCDB
    1    depmod: WARNING: /home/buildslave/workspace/workspace/kernel-build@6/linux/build/_modules_/lib/modules/5.4.0-rc4-next-20191021/kernel/drivers/usb/storage/uas.ko needs unknown symbol usb_stor_adjust_quirks
    1    depmod: WARNING: /home/buildslave/workspace/workspace/kernel-build@4/linux/build/_modules_/lib/modules/5.4.0-rc4-next-20191021/kernel/drivers/usb/storage/uas.ko needs unknown symbol usb_stor_sense_invalidCDB
    1    depmod: WARNING: /home/buildslave/workspace/workspace/kernel-build@4/linux/build/_modules_/lib/modules/5.4.0-rc4-next-20191021/kernel/drivers/usb/storage/uas.ko needs unknown symbol usb_stor_adjust_quirks
    1    depmod: WARNING: /home/buildslave/workspace/kernel-build/linux/build/_modules_/lib/modules/5.4.0-rc4-next-20191021/kernel/drivers/usb/storage/ums-usbat.ko needs unknown symbol usb_stor_suspend
    1    depmod: WARNING: /home/buildslave/workspace/kernel-build/linux/build/_modules_/lib/modules/5.4.0-rc4-next-20191021/kernel/drivers/usb/storage/ums-usbat.ko needs unknown symbol usb_stor_set_xfer_buf
    1    depmod: WARNING: /home/buildslave/workspace/kernel-build/linux/build/_modules_/lib/modules/5.4.0-rc4-next-20191021/kernel/drivers/usb/storage/ums-usbat.ko needs unknown symbol usb_stor_resume
    1    depmod: WARNING: /home/buildslave/workspace/kernel-build/linux/build/_modules_/lib/modules/5.4.0-rc4-next-20191021/kernel/drivers/usb/storage/ums-usbat.ko needs unknown symbol usb_stor_reset_resume
    1    depmod: WARNING: /home/buildslave/workspace/kernel-build/linux/build/_modules_/lib/modules/5.4.0-rc4-next-20191021/kernel/drivers/usb/storage/ums-usbat.ko needs unknown symbol usb_stor_probe2
    1    depmod: WARNING: /home/buildslave/workspace/kernel-build/linux/build/_modules_/lib/modules/5.4.0-rc4-next-20191021/kernel/drivers/usb/storage/ums-usbat.ko needs unknown symbol usb_stor_probe1
    1    depmod: WARNING: /home/buildslave/workspace/kernel-build/linux/build/_modules_/lib/modules/5.4.0-rc4-next-20191021/kernel/drivers/usb/storage/ums-usbat.ko needs unknown symbol usb_stor_pre_reset
    1    depmod: WARNING: /home/buildslave/workspace/kernel-build/linux/build/_modules_/lib/modules/5.4.0-rc4-next-20191021/kernel/drivers/usb/storage/ums-usbat.ko needs unknown symbol usb_stor_post_reset
    1    depmod: WARNING: /home/buildslave/workspace/kernel-build/linux/build/_modules_/lib/modules/5.4.0-rc4-next-20191021/kernel/drivers/usb/storage/ums-usbat.ko needs unknown symbol usb_stor_host_template_init
    1    depmod: WARNING: /home/buildslave/workspace/kernel-build/linux/build/_modules_/lib/modules/5.4.0-rc4-next-20191021/kernel/drivers/usb/storage/ums-usbat.ko needs unknown symbol usb_stor_disconnect
    1    depmod: WARNING: /home/buildslave/workspace/kernel-build/linux/build/_modules_/lib/modules/5.4.0-rc4-next-20191021/kernel/drivers/usb/storage/ums-usbat.ko needs unknown symbol usb_stor_ctrl_transfer
    1    depmod: WARNING: /home/buildslave/workspace/kernel-build/linux/build/_modules_/lib/modules/5.4.0-rc4-next-20191021/kernel/drivers/usb/storage/ums-usbat.ko needs unknown symbol usb_stor_clear_halt
    1    depmod: WARNING: /home/buildslave/workspace/kernel-build/linux/build/_modules_/lib/modules/5.4.0-rc4-next-20191021/kernel/drivers/usb/storage/ums-usbat.ko needs unknown symbol usb_stor_bulk_transfer_sg
    1    depmod: WARNING: /home/buildslave/workspace/kernel-build/linux/build/_modules_/lib/modules/5.4.0-rc4-next-20191021/kernel/drivers/usb/storage/ums-usbat.ko needs unknown symbol usb_stor_access_xfer_buf
    1    depmod: WARNING: /home/buildslave/workspace/kernel-build/linux/build/_modules_/lib/modules/5.4.0-rc4-next-20191021/kernel/drivers/usb/storage/ums-usbat.ko needs unknown symbol usb_stor_CB_reset
    1    depmod: WARNING: /home/buildslave/workspace/kernel-build/linux/build/_modules_/lib/modules/5.4.0-rc4-next-20191021/kernel/drivers/usb/storage/ums-usbat.ko needs unknown symbol fill_inquiry_response
    1    depmod: WARNING: /home/buildslave/workspace/kernel-build/linux/build/_modules_/lib/modules/5.4.0-rc4-next-20191021/kernel/drivers/usb/storage/ums-sddr55.ko needs unknown symbol usb_stor_suspend
    1    depmod: WARNING: /home/buildslave/workspace/kernel-build/linux/build/_modules_/lib/modules/5.4.0-rc4-next-20191021/kernel/drivers/usb/storage/ums-sddr55.ko needs unknown symbol usb_stor_set_xfer_buf
    1    depmod: WARNING: /home/buildslave/workspace/kernel-build/linux/build/_modules_/lib/modules/5.4.0-rc4-next-20191021/kernel/drivers/usb/storage/ums-sddr55.ko needs unknown symbol usb_stor_resume
    1    depmod: WARNING: /home/buildslave/workspace/kernel-build/linux/build/_modules_/lib/modules/5.4.0-rc4-next-20191021/kernel/drivers/usb/storage/ums-sddr55.ko needs unknown symbol usb_stor_reset_resume
    1    depmod: WARNING: /home/buildslave/workspace/kernel-build/linux/build/_modules_/lib/modules/5.4.0-rc4-next-20191021/kernel/drivers/usb/storage/ums-sddr55.ko needs unknown symbol usb_stor_probe2
    1    depmod: WARNING: /home/buildslave/workspace/kernel-build/linux/build/_modules_/lib/modules/5.4.0-rc4-next-20191021/kernel/drivers/usb/storage/ums-sddr55.ko needs unknown symbol usb_stor_probe1
    1    depmod: WARNING: /home/buildslave/workspace/kernel-build/linux/build/_modules_/lib/modules/5.4.0-rc4-next-20191021/kernel/drivers/usb/storage/ums-sddr55.ko needs unknown symbol usb_stor_pre_reset
    1    depmod: WARNING: /home/buildslave/workspace/kernel-build/linux/build/_modules_/lib/modules/5.4.0-rc4-next-20191021/kernel/drivers/usb/storage/ums-sddr55.ko needs unknown symbol usb_stor_post_reset
    1    depmod: WARNING: /home/buildslave/workspace/kernel-build/linux/build/_modules_/lib/modules/5.4.0-rc4-next-20191021/kernel/drivers/usb/storage/ums-sddr55.ko needs unknown symbol usb_stor_host_template_init
    1    depmod: WARNING: /home/buildslave/workspace/kernel-build/linux/build/_modules_/lib/modules/5.4.0-rc4-next-20191021/kernel/drivers/usb/storage/ums-sddr55.ko needs unknown symbol usb_stor_disconnect
    1    depmod: WARNING: /home/buildslave/workspace/kernel-build/linux/build/_modules_/lib/modules/5.4.0-rc4-next-20191021/kernel/drivers/usb/storage/ums-sddr55.ko needs unknown symbol usb_stor_bulk_transfer_buf
    1    depmod: WARNING: /home/buildslave/workspace/kernel-build/linux/build/_modules_/lib/modules/5.4.0-rc4-next-20191021/kernel/drivers/usb/storage/ums-sddr55.ko needs unknown symbol usb_stor_access_xfer_buf
    1    depmod: WARNING: /home/buildslave/workspace/kernel-build/linux/build/_modules_/lib/modules/5.4.0-rc4-next-20191021/kernel/drivers/usb/storage/ums-sddr55.ko needs unknown symbol fill_inquiry_response
    1    depmod: WARNING: /home/buildslave/workspace/kernel-build/linux/build/_modules_/lib/modules/5.4.0-rc4-next-20191021/kernel/drivers/usb/storage/ums-sddr09.ko needs unknown symbol usb_stor_suspend
    1    depmod: WARNING: /home/buildslave/workspace/kernel-build/linux/build/_modules_/lib/modules/5.4.0-rc4-next-20191021/kernel/drivers/usb/storage/ums-sddr09.ko needs unknown symbol usb_stor_set_xfer_buf
    1    depmod: WARNING: /home/buildslave/workspace/kernel-build/linux/build/_modules_/lib/modules/5.4.0-rc4-next-20191021/kernel/drivers/usb/storage/ums-sddr09.ko needs unknown symbol usb_stor_resume
    1    depmod: WARNING: /home/buildslave/workspace/kernel-build/linux/build/_modules_/lib/modules/5.4.0-rc4-next-20191021/kernel/drivers/usb/storage/ums-sddr09.ko needs unknown symbol usb_stor_reset_resume
    1    depmod: WARNING: /home/buildslave/workspace/kernel-build/linux/build/_modules_/lib/modules/5.4.0-rc4-next-20191021/kernel/drivers/usb/storage/ums-sddr09.ko needs unknown symbol usb_stor_probe2
    1    depmod: WARNING: /home/buildslave/workspace/kernel-build/linux/build/_modules_/lib/modules/5.4.0-rc4-next-20191021/kernel/drivers/usb/storage/ums-sddr09.ko needs unknown symbol usb_stor_probe1
    1    depmod: WARNING: /home/buildslave/workspace/kernel-build/linux/build/_modules_/lib/modules/5.4.0-rc4-next-20191021/kernel/drivers/usb/storage/ums-sddr09.ko needs unknown symbol usb_stor_pre_reset
    1    depmod: WARNING: /home/buildslave/workspace/kernel-build/linux/build/_modules_/lib/modules/5.4.0-rc4-next-20191021/kernel/drivers/usb/storage/ums-sddr09.ko needs unknown symbol usb_stor_post_reset
    1    depmod: WARNING: /home/buildslave/workspace/kernel-build/linux/build/_modules_/lib/modules/5.4.0-rc4-next-20191021/kernel/drivers/usb/storage/ums-sddr09.ko needs unknown symbol usb_stor_host_template_init
    1    depmod: WARNING: /home/buildslave/workspace/kernel-build/linux/build/_modules_/lib/modules/5.4.0-rc4-next-20191021/kernel/drivers/usb/storage/ums-sddr09.ko needs unknown symbol usb_stor_disconnect
    1    depmod: WARNING: /home/buildslave/workspace/kernel-build/linux/build/_modules_/lib/modules/5.4.0-rc4-next-20191021/kernel/drivers/usb/storage/ums-sddr09.ko needs unknown symbol usb_stor_ctrl_transfer
    1    depmod: WARNING: /home/buildslave/workspace/kernel-build/linux/build/_modules_/lib/modules/5.4.0-rc4-next-20191021/kernel/drivers/usb/storage/ums-sddr09.ko needs unknown symbol usb_stor_bulk_transfer_sg
    1    depmod: WARNING: /home/buildslave/workspace/kernel-build/linux/build/_modules_/lib/modules/5.4.0-rc4-next-20191021/kernel/drivers/usb/storage/ums-sddr09.ko needs unknown symbol usb_stor_bulk_transfer_buf
    1    depmod: WARNING: /home/buildslave/workspace/kernel-build/linux/build/_modules_/lib/modules/5.4.0-rc4-next-20191021/kernel/drivers/usb/storage/ums-sddr09.ko needs unknown symbol usb_stor_bulk_srb
    1    depmod: WARNING: /home/buildslave/workspace/kernel-build/linux/build/_modules_/lib/modules/5.4.0-rc4-next-20191021/kernel/drivers/usb/storage/ums-sddr09.ko needs unknown symbol usb_stor_access_xfer_buf
    1    depmod: WARNING: /home/buildslave/workspace/kernel-build/linux/build/_modules_/lib/modules/5.4.0-rc4-next-20191021/kernel/drivers/usb/storage/ums-sddr09.ko needs unknown symbol usb_stor_CB_transport
    1    depmod: WARNING: /home/buildslave/workspace/kernel-build/linux/build/_modules_/lib/modules/5.4.0-rc4-next-20191021/kernel/drivers/usb/storage/ums-sddr09.ko needs unknown symbol usb_stor_CB_reset
    1    depmod: WARNING: /home/buildslave/workspace/kernel-build/linux/build/_modules_/lib/modules/5.4.0-rc4-next-20191021/kernel/drivers/usb/storage/ums-sddr09.ko needs unknown symbol fill_inquiry_response
    1    depmod: WARNING: /home/buildslave/workspace/kernel-build/linux/build/_modules_/lib/modules/5.4.0-rc4-next-20191021/kernel/drivers/usb/storage/ums-realtek.ko needs unknown symbol usb_stor_reset_resume
    1    depmod: WARNING: /home/buildslave/workspace/kernel-build/linux/build/_modules_/lib/modules/5.4.0-rc4-next-20191021/kernel/drivers/usb/storage/ums-realtek.ko needs unknown symbol usb_stor_probe2
    1    depmod: WARNING: /home/buildslave/workspace/kernel-build/linux/build/_modules_/lib/modules/5.4.0-rc4-next-20191021/kernel/drivers/usb/storage/ums-realtek.ko needs unknown symbol usb_stor_probe1
    1    depmod: WARNING: /home/buildslave/workspace/kernel-build/linux/build/_modules_/lib/modules/5.4.0-rc4-next-20191021/kernel/drivers/usb/storage/ums-realtek.ko needs unknown symbol usb_stor_pre_reset
    1    depmod: WARNING: /home/buildslave/workspace/kernel-build/linux/build/_modules_/lib/modules/5.4.0-rc4-next-20191021/kernel/drivers/usb/storage/ums-realtek.ko needs unknown symbol usb_stor_post_reset
    1    depmod: WARNING: /home/buildslave/workspace/kernel-build/linux/build/_modules_/lib/modules/5.4.0-rc4-next-20191021/kernel/drivers/usb/storage/ums-realtek.ko needs unknown symbol usb_stor_host_template_init
    1    depmod: WARNING: /home/buildslave/workspace/kernel-build/linux/build/_modules_/lib/modules/5.4.0-rc4-next-20191021/kernel/drivers/usb/storage/ums-realtek.ko needs unknown symbol usb_stor_disconnect
    1    depmod: WARNING: /home/buildslave/workspace/kernel-build/linux/build/_modules_/lib/modules/5.4.0-rc4-next-20191021/kernel/drivers/usb/storage/ums-realtek.ko needs unknown symbol usb_stor_control_msg
    1    depmod: WARNING: /home/buildslave/workspace/kernel-build/linux/build/_modules_/lib/modules/5.4.0-rc4-next-20191021/kernel/drivers/usb/storage/ums-realtek.ko needs unknown symbol usb_stor_bulk_transfer_buf
    1    depmod: WARNING: /home/buildslave/workspace/kernel-build/linux/build/_modules_/lib/modules/5.4.0-rc4-next-20191021/kernel/drivers/usb/storage/ums-onetouch.ko needs unknown symbol usb_stor_suspend
    1    depmod: WARNING: /home/buildslave/workspace/kernel-build/linux/build/_modules_/lib/modules/5.4.0-rc4-next-20191021/kernel/drivers/usb/storage/ums-onetouch.ko needs unknown symbol usb_stor_resume
    1    depmod: WARNING: /home/buildslave/workspace/kernel-build/linux/build/_modules_/lib/modules/5.4.0-rc4-next-20191021/kernel/drivers/usb/storage/ums-onetouch.ko needs unknown symbol usb_stor_reset_resume
    1    depmod: WARNING: /home/buildslave/workspace/kernel-build/linux/build/_modules_/lib/modules/5.4.0-rc4-next-20191021/kernel/drivers/usb/storage/ums-onetouch.ko needs unknown symbol usb_stor_probe2
    1    depmod: WARNING: /home/buildslave/workspace/kernel-build/linux/build/_modules_/lib/modules/5.4.0-rc4-next-20191021/kernel/drivers/usb/storage/ums-onetouch.ko needs unknown symbol usb_stor_probe1
    1    depmod: WARNING: /home/buildslave/workspace/kernel-build/linux/build/_modules_/lib/modules/5.4.0-rc4-next-20191021/kernel/drivers/usb/storage/ums-onetouch.ko needs unknown symbol usb_stor_pre_reset
    1    depmod: WARNING: /home/buildslave/workspace/kernel-build/linux/build/_modules_/lib/modules/5.4.0-rc4-next-20191021/kernel/drivers/usb/storage/ums-onetouch.ko needs unknown symbol usb_stor_post_reset
    1    depmod: WARNING: /home/buildslave/workspace/kernel-build/linux/build/_modules_/lib/modules/5.4.0-rc4-next-20191021/kernel/drivers/usb/storage/ums-onetouch.ko needs unknown symbol usb_stor_host_template_init
    1    depmod: WARNING: /home/buildslave/workspace/kernel-build/linux/build/_modules_/lib/modules/5.4.0-rc4-next-20191021/kernel/drivers/usb/storage/ums-onetouch.ko needs unknown symbol usb_stor_disconnect
    1    depmod: WARNING: /home/buildslave/workspace/kernel-build/linux/build/_modules_/lib/modules/5.4.0-rc4-next-20191021/kernel/drivers/usb/storage/ums-karma.ko needs unknown symbol usb_stor_suspend
    1    depmod: WARNING: /home/buildslave/workspace/kernel-build/linux/build/_modules_/lib/modules/5.4.0-rc4-next-20191021/kernel/drivers/usb/storage/ums-karma.ko needs unknown symbol usb_stor_resume
    1    depmod: WARNING: /home/buildslave/workspace/kernel-build/linux/build/_modules_/lib/modules/5.4.0-rc4-next-20191021/kernel/drivers/usb/storage/ums-karma.ko needs unknown symbol usb_stor_reset_resume
    1    depmod: WARNING: /home/buildslave/workspace/kernel-build/linux/build/_modules_/lib/modules/5.4.0-rc4-next-20191021/kernel/drivers/usb/storage/ums-karma.ko needs unknown symbol usb_stor_probe2
    1    depmod: WARNING: /home/buildslave/workspace/kernel-build/linux/build/_modules_/lib/modules/5.4.0-rc4-next-20191021/kernel/drivers/usb/storage/ums-karma.ko needs unknown symbol usb_stor_probe1
    1    depmod: WARNING: /home/buildslave/workspace/kernel-build/linux/build/_modules_/lib/modules/5.4.0-rc4-next-20191021/kernel/drivers/usb/storage/ums-karma.ko needs unknown symbol usb_stor_pre_reset
    1    depmod: WARNING: /home/buildslave/workspace/kernel-build/linux/build/_modules_/lib/modules/5.4.0-rc4-next-20191021/kernel/drivers/usb/storage/ums-karma.ko needs unknown symbol usb_stor_post_reset
    1    depmod: WARNING: /home/buildslave/workspace/kernel-build/linux/build/_modules_/lib/modules/5.4.0-rc4-next-20191021/kernel/drivers/usb/storage/ums-karma.ko needs unknown symbol usb_stor_host_template_init
    1    depmod: WARNING: /home/buildslave/workspace/kernel-build/linux/build/_modules_/lib/modules/5.4.0-rc4-next-20191021/kernel/drivers/usb/storage/ums-karma.ko needs unknown symbol usb_stor_disconnect
    1    depmod: WARNING: /home/buildslave/workspace/kernel-build/linux/build/_modules_/lib/modules/5.4.0-rc4-next-20191021/kernel/drivers/usb/storage/ums-karma.ko needs unknown symbol usb_stor_bulk_transfer_buf
    1    depmod: WARNING: /home/buildslave/workspace/kernel-build/linux/build/_modules_/lib/modules/5.4.0-rc4-next-20191021/kernel/drivers/usb/storage/ums-karma.ko needs unknown symbol usb_stor_Bulk_transport
    1    depmod: WARNING: /home/buildslave/workspace/kernel-build/linux/build/_modules_/lib/modules/5.4.0-rc4-next-20191021/kernel/drivers/usb/storage/ums-karma.ko needs unknown symbol usb_stor_Bulk_reset
    1    depmod: WARNING: /home/buildslave/workspace/kernel-build/linux/build/_modules_/lib/modules/5.4.0-rc4-next-20191021/kernel/drivers/usb/storage/ums-jumpshot.ko needs unknown symbol usb_stor_suspend
    1    depmod: WARNING: /home/buildslave/workspace/kernel-build/linux/build/_modules_/lib/modules/5.4.0-rc4-next-20191021/kernel/drivers/usb/storage/ums-jumpshot.ko needs unknown symbol usb_stor_set_xfer_buf
    1    depmod: WARNING: /home/buildslave/workspace/kernel-build/linux/build/_modules_/lib/modules/5.4.0-rc4-next-20191021/kernel/drivers/usb/storage/ums-jumpshot.ko needs unknown symbol usb_stor_resume
    1    depmod: WARNING: /home/buildslave/workspace/kernel-build/linux/build/_modules_/lib/modules/5.4.0-rc4-next-20191021/kernel/drivers/usb/storage/ums-jumpshot.ko needs unknown symbol usb_stor_reset_resume
    1    depmod: WARNING: /home/buildslave/workspace/kernel-build/linux/build/_modules_/lib/modules/5.4.0-rc4-next-20191021/kernel/drivers/usb/storage/ums-jumpshot.ko needs unknown symbol usb_stor_probe2
    1    depmod: WARNING: /home/buildslave/workspace/kernel-build/linux/build/_modules_/lib/modules/5.4.0-rc4-next-20191021/kernel/drivers/usb/storage/ums-jumpshot.ko needs unknown symbol usb_stor_probe1
    1    depmod: WARNING: /home/buildslave/workspace/kernel-build/linux/build/_modules_/lib/modules/5.4.0-rc4-next-20191021/kernel/drivers/usb/storage/ums-jumpshot.ko needs unknown symbol usb_stor_pre_reset
    1    depmod: WARNING: /home/buildslave/workspace/kernel-build/linux/build/_modules_/lib/modules/5.4.0-rc4-next-20191021/kernel/drivers/usb/storage/ums-jumpshot.ko needs unknown symbol usb_stor_post_reset
    1    depmod: WARNING: /home/buildslave/workspace/kernel-build/linux/build/_modules_/lib/modules/5.4.0-rc4-next-20191021/kernel/drivers/usb/storage/ums-jumpshot.ko needs unknown symbol usb_stor_host_template_init
    1    depmod: WARNING: /home/buildslave/workspace/kernel-build/linux/build/_modules_/lib/modules/5.4.0-rc4-next-20191021/kernel/drivers/usb/storage/ums-jumpshot.ko needs unknown symbol usb_stor_disconnect
    1    depmod: WARNING: /home/buildslave/workspace/kernel-build/linux/build/_modules_/lib/modules/5.4.0-rc4-next-20191021/kernel/drivers/usb/storage/ums-jumpshot.ko needs unknown symbol usb_stor_ctrl_transfer
    1    depmod: WARNING: /home/buildslave/workspace/kernel-build/linux/build/_modules_/lib/modules/5.4.0-rc4-next-20191021/kernel/drivers/usb/storage/ums-jumpshot.ko needs unknown symbol usb_stor_bulk_transfer_buf
    1    depmod: WARNING: /home/buildslave/workspace/kernel-build/linux/build/_modules_/lib/modules/5.4.0-rc4-next-20191021/kernel/drivers/usb/storage/ums-jumpshot.ko needs unknown symbol usb_stor_access_xfer_buf
    1    depmod: WARNING: /home/buildslave/workspace/kernel-build/linux/build/_modules_/lib/modules/5.4.0-rc4-next-20191021/kernel/drivers/usb/storage/ums-jumpshot.ko needs unknown symbol usb_stor_Bulk_reset
    1    depmod: WARNING: /home/buildslave/workspace/kernel-build/linux/build/_modules_/lib/modules/5.4.0-rc4-next-20191021/kernel/drivers/usb/storage/ums-jumpshot.ko needs unknown symbol fill_inquiry_response
    1    depmod: WARNING: /home/buildslave/workspace/kernel-build/linux/build/_modules_/lib/modules/5.4.0-rc4-next-20191021/kernel/drivers/usb/storage/ums-isd200.ko needs unknown symbol usb_stor_transparent_scsi_command
    1    depmod: WARNING: /home/buildslave/workspace/kernel-build/linux/build/_modules_/lib/modules/5.4.0-rc4-next-20191021/kernel/drivers/usb/storage/ums-isd200.ko needs unknown symbol usb_stor_suspend
    1    depmod: WARNING: /home/buildslave/workspace/kernel-build/linux/build/_modules_/lib/modules/5.4.0-rc4-next-20191021/kernel/drivers/usb/storage/ums-isd200.ko needs unknown symbol usb_stor_set_xfer_buf
    1    depmod: WARNING: /home/buildslave/workspace/kernel-build/linux/build/_modules_/lib/modules/5.4.0-rc4-next-20191021/kernel/drivers/usb/storage/ums-isd200.ko needs unknown symbol usb_stor_resume
    1    depmod: WARNING: /home/buildslave/workspace/kernel-build/linux/build/_modules_/lib/modules/5.4.0-rc4-next-20191021/kernel/drivers/usb/storage/ums-isd200.ko needs unknown symbol usb_stor_reset_resume
    1    depmod: WARNING: /home/buildslave/workspace/kernel-build/linux/build/_modules_/lib/modules/5.4.0-rc4-next-20191021/kernel/drivers/usb/storage/ums-isd200.ko needs unknown symbol usb_stor_probe2
    1    depmod: WARNING: /home/buildslave/workspace/kernel-build/linux/build/_modules_/lib/modules/5.4.0-rc4-next-20191021/kernel/drivers/usb/storage/ums-isd200.ko needs unknown symbol usb_stor_probe1
    1    depmod: WARNING: /home/buildslave/workspace/kernel-build/linux/build/_modules_/lib/modules/5.4.0-rc4-next-20191021/kernel/drivers/usb/storage/ums-isd200.ko needs unknown symbol usb_stor_pre_reset
    1    depmod: WARNING: /home/buildslave/workspace/kernel-build/linux/build/_modules_/lib/modules/5.4.0-rc4-next-20191021/kernel/drivers/usb/storage/ums-isd200.ko needs unknown symbol usb_stor_post_reset
    1    depmod: WARNING: /home/buildslave/workspace/kernel-build/linux/build/_modules_/lib/modules/5.4.0-rc4-next-20191021/kernel/drivers/usb/storage/ums-isd200.ko needs unknown symbol usb_stor_host_template_init
    1    depmod: WARNING: /home/buildslave/workspace/kernel-build/linux/build/_modules_/lib/modules/5.4.0-rc4-next-20191021/kernel/drivers/usb/storage/ums-isd200.ko needs unknown symbol usb_stor_disconnect
    1    depmod: WARNING: /home/buildslave/workspace/kernel-build/linux/build/_modules_/lib/modules/5.4.0-rc4-next-20191021/kernel/drivers/usb/storage/ums-isd200.ko needs unknown symbol usb_stor_ctrl_transfer
    1    depmod: WARNING: /home/buildslave/workspace/kernel-build/linux/build/_modules_/lib/modules/5.4.0-rc4-next-20191021/kernel/drivers/usb/storage/ums-isd200.ko needs unknown symbol usb_stor_Bulk_transport
    1    depmod: WARNING: /home/buildslave/workspace/kernel-build/linux/build/_modules_/lib/modules/5.4.0-rc4-next-20191021/kernel/drivers/usb/storage/ums-freecom.ko needs unknown symbol usb_stor_suspend
    1    depmod: WARNING: /home/buildslave/workspace/kernel-build/linux/build/_modules_/lib/modules/5.4.0-rc4-next-20191021/kernel/drivers/usb/storage/ums-freecom.ko needs unknown symbol usb_stor_resume
    1    depmod: WARNING: /home/buildslave/workspace/kernel-build/linux/build/_modules_/lib/modules/5.4.0-rc4-next-20191021/kernel/drivers/usb/storage/ums-freecom.ko needs unknown symbol usb_stor_reset_resume
    1    depmod: WARNING: /home/buildslave/workspace/kernel-build/linux/build/_modules_/lib/modules/5.4.0-rc4-next-20191021/kernel/drivers/usb/storage/ums-freecom.ko needs unknown symbol usb_stor_probe2
    1    depmod: WARNING: /home/buildslave/workspace/kernel-build/linux/build/_modules_/lib/modules/5.4.0-rc4-next-20191021/kernel/drivers/usb/storage/ums-freecom.ko needs unknown symbol usb_stor_probe1
    1    depmod: WARNING: /home/buildslave/workspace/kernel-build/linux/build/_modules_/lib/modules/5.4.0-rc4-next-20191021/kernel/drivers/usb/storage/ums-freecom.ko needs unknown symbol usb_stor_pre_reset
    1    depmod: WARNING: /home/buildslave/workspace/kernel-build/linux/build/_modules_/lib/modules/5.4.0-rc4-next-20191021/kernel/drivers/usb/storage/ums-freecom.ko needs unknown symbol usb_stor_post_reset
    1    depmod: WARNING: /home/buildslave/workspace/kernel-build/linux/build/_modules_/lib/modules/5.4.0-rc4-next-20191021/kernel/drivers/usb/storage/ums-freecom.ko needs unknown symbol usb_stor_host_template_init
    1    depmod: WARNING: /home/buildslave/workspace/kernel-build/linux/build/_modules_/lib/modules/5.4.0-rc4-next-20191021/kernel/drivers/usb/storage/ums-freecom.ko needs unknown symbol usb_stor_disconnect
    1    depmod: WARNING: /home/buildslave/workspace/kernel-build/linux/build/_modules_/lib/modules/5.4.0-rc4-next-20191021/kernel/drivers/usb/storage/ums-freecom.ko needs unknown symbol usb_stor_control_msg
    1    depmod: WARNING: /home/buildslave/workspace/kernel-build/linux/build/_modules_/lib/modules/5.4.0-rc4-next-20191021/kernel/drivers/usb/storage/ums-freecom.ko needs unknown symbol usb_stor_bulk_transfer_buf
    1    depmod: WARNING: /home/buildslave/workspace/kernel-build/linux/build/_modules_/lib/modules/5.4.0-rc4-next-20191021/kernel/drivers/usb/storage/ums-freecom.ko needs unknown symbol usb_stor_bulk_srb
    1    depmod: WARNING: /home/buildslave/workspace/kernel-build/linux/build/_modules_/lib/modules/5.4.0-rc4-next-20191021/kernel/drivers/usb/storage/ums-eneub6250.ko needs unknown symbol usb_stor_suspend
    1    depmod: WARNING: /home/buildslave/workspace/kernel-build/linux/build/_modules_/lib/modules/5.4.0-rc4-next-20191021/kernel/drivers/usb/storage/ums-eneub6250.ko needs unknown symbol usb_stor_set_xfer_buf
    1    depmod: WARNING: /home/buildslave/workspace/kernel-build/linux/build/_modules_/lib/modules/5.4.0-rc4-next-20191021/kernel/drivers/usb/storage/ums-eneub6250.ko needs unknown symbol usb_stor_reset_resume
    1    depmod: WARNING: /home/buildslave/workspace/kernel-build/linux/build/_modules_/lib/modules/5.4.0-rc4-next-20191021/kernel/drivers/usb/storage/ums-eneub6250.ko needs unknown symbol usb_stor_probe2
    1    depmod: WARNING: /home/buildslave/workspace/kernel-build/linux/build/_modules_/lib/modules/5.4.0-rc4-next-20191021/kernel/drivers/usb/storage/ums-eneub6250.ko needs unknown symbol usb_stor_probe1
    1    depmod: WARNING: /home/buildslave/workspace/kernel-build/linux/build/_modules_/lib/modules/5.4.0-rc4-next-20191021/kernel/drivers/usb/storage/ums-eneub6250.ko needs unknown symbol usb_stor_pre_reset
    1    depmod: WARNING: /home/buildslave/workspace/kernel-build/linux/build/_modules_/lib/modules/5.4.0-rc4-next-20191021/kernel/drivers/usb/storage/ums-eneub6250.ko needs unknown symbol usb_stor_post_reset
    1    depmod: WARNING: /home/buildslave/workspace/kernel-build/linux/build/_modules_/lib/modules/5.4.0-rc4-next-20191021/kernel/drivers/usb/storage/ums-eneub6250.ko needs unknown symbol usb_stor_host_template_init
    1    depmod: WARNING: /home/buildslave/workspace/kernel-build/linux/build/_modules_/lib/modules/5.4.0-rc4-next-20191021/kernel/drivers/usb/storage/ums-eneub6250.ko needs unknown symbol usb_stor_disconnect
    1    depmod: WARNING: /home/buildslave/workspace/kernel-build/linux/build/_modules_/lib/modules/5.4.0-rc4-next-20191021/kernel/drivers/usb/storage/ums-eneub6250.ko needs unknown symbol usb_stor_bulk_transfer_sg
    1    depmod: WARNING: /home/buildslave/workspace/kernel-build/linux/build/_modules_/lib/modules/5.4.0-rc4-next-20191021/kernel/drivers/usb/storage/ums-eneub6250.ko needs unknown symbol usb_stor_bulk_transfer_buf
    1    depmod: WARNING: /home/buildslave/workspace/kernel-build/linux/build/_modules_/lib/modules/5.4.0-rc4-next-20191021/kernel/drivers/usb/storage/ums-eneub6250.ko needs unknown symbol usb_stor_bulk_srb
    1    depmod: WARNING: /home/buildslave/workspace/kernel-build/linux/build/_modules_/lib/modules/5.4.0-rc4-next-20191021/kernel/drivers/usb/storage/ums-eneub6250.ko needs unknown symbol usb_stor_access_xfer_buf
    1    depmod: WARNING: /home/buildslave/workspace/kernel-build/linux/build/_modules_/lib/modules/5.4.0-rc4-next-20191021/kernel/drivers/usb/storage/ums-datafab.ko needs unknown symbol usb_stor_suspend
    1    depmod: WARNING: /home/buildslave/workspace/kernel-build/linux/build/_modules_/lib/modules/5.4.0-rc4-next-20191021/kernel/drivers/usb/storage/ums-datafab.ko needs unknown symbol usb_stor_set_xfer_buf
    1    depmod: WARNING: /home/buildslave/workspace/kernel-build/linux/build/_modules_/lib/modules/5.4.0-rc4-next-20191021/kernel/drivers/usb/storage/ums-datafab.ko needs unknown symbol usb_stor_resume
    1    depmod: WARNING: /home/buildslave/workspace/kernel-build/linux/build/_modules_/lib/modules/5.4.0-rc4-next-20191021/kernel/drivers/usb/storage/ums-datafab.ko needs unknown symbol usb_stor_reset_resume
    1    depmod: WARNING: /home/buildslave/workspace/kernel-build/linux/build/_modules_/lib/modules/5.4.0-rc4-next-20191021/kernel/drivers/usb/storage/ums-datafab.ko needs unknown symbol usb_stor_probe2
    1    depmod: WARNING: /home/buildslave/workspace/kernel-build/linux/build/_modules_/lib/modules/5.4.0-rc4-next-20191021/kernel/drivers/usb/storage/ums-datafab.ko needs unknown symbol usb_stor_probe1
    1    depmod: WARNING: /home/buildslave/workspace/kernel-build/linux/build/_modules_/lib/modules/5.4.0-rc4-next-20191021/kernel/drivers/usb/storage/ums-datafab.ko needs unknown symbol usb_stor_pre_reset
    1    depmod: WARNING: /home/buildslave/workspace/kernel-build/linux/build/_modules_/lib/modules/5.4.0-rc4-next-20191021/kernel/drivers/usb/storage/ums-datafab.ko needs unknown symbol usb_stor_post_reset
    1    depmod: WARNING: /home/buildslave/workspace/kernel-build/linux/build/_modules_/lib/modules/5.4.0-rc4-next-20191021/kernel/drivers/usb/storage/ums-datafab.ko needs unknown symbol usb_stor_host_template_init
    1    depmod: WARNING: /home/buildslave/workspace/kernel-build/linux/build/_modules_/lib/modules/5.4.0-rc4-next-20191021/kernel/drivers/usb/storage/ums-datafab.ko needs unknown symbol usb_stor_disconnect
    1    depmod: WARNING: /home/buildslave/workspace/kernel-build/linux/build/_modules_/lib/modules/5.4.0-rc4-next-20191021/kernel/drivers/usb/storage/ums-datafab.ko needs unknown symbol usb_stor_bulk_transfer_buf
    1    depmod: WARNING: /home/buildslave/workspace/kernel-build/linux/build/_modules_/lib/modules/5.4.0-rc4-next-20191021/kernel/drivers/usb/storage/ums-datafab.ko needs unknown symbol usb_stor_access_xfer_buf
    1    depmod: WARNING: /home/buildslave/workspace/kernel-build/linux/build/_modules_/lib/modules/5.4.0-rc4-next-20191021/kernel/drivers/usb/storage/ums-datafab.ko needs unknown symbol usb_stor_Bulk_reset
    1    depmod: WARNING: /home/buildslave/workspace/kernel-build/linux/build/_modules_/lib/modules/5.4.0-rc4-next-20191021/kernel/drivers/usb/storage/ums-datafab.ko needs unknown symbol fill_inquiry_response
    1    depmod: WARNING: /home/buildslave/workspace/kernel-build/linux/build/_modules_/lib/modules/5.4.0-rc4-next-20191021/kernel/drivers/usb/storage/ums-cypress.ko needs unknown symbol usb_stor_transparent_scsi_command
    1    depmod: WARNING: /home/buildslave/workspace/kernel-build/linux/build/_modules_/lib/modules/5.4.0-rc4-next-20191021/kernel/drivers/usb/storage/ums-cypress.ko needs unknown symbol usb_stor_suspend
    1    depmod: WARNING: /home/buildslave/workspace/kernel-build/linux/build/_modules_/lib/modules/5.4.0-rc4-next-20191021/kernel/drivers/usb/storage/ums-cypress.ko needs unknown symbol usb_stor_sense_invalidCDB
    1    depmod: WARNING: /home/buildslave/workspace/kernel-build/linux/build/_modules_/lib/modules/5.4.0-rc4-next-20191021/kernel/drivers/usb/storage/ums-cypress.ko needs unknown symbol usb_stor_resume
    1    depmod: WARNING: /home/buildslave/workspace/kernel-build/linux/build/_modules_/lib/modules/5.4.0-rc4-next-20191021/kernel/drivers/usb/storage/ums-cypress.ko needs unknown symbol usb_stor_reset_resume
    1    depmod: WARNING: /home/buildslave/workspace/kernel-build/linux/build/_modules_/lib/modules/5.4.0-rc4-next-20191021/kernel/drivers/usb/storage/ums-cypress.ko needs unknown symbol usb_stor_probe2
    1    depmod: WARNING: /home/buildslave/workspace/kernel-build/linux/build/_modules_/lib/modules/5.4.0-rc4-next-20191021/kernel/drivers/usb/storage/ums-cypress.ko needs unknown symbol usb_stor_probe1
    1    depmod: WARNING: /home/buildslave/workspace/kernel-build/linux/build/_modules_/lib/modules/5.4.0-rc4-next-20191021/kernel/drivers/usb/storage/ums-cypress.ko needs unknown symbol usb_stor_pre_reset
    1    depmod: WARNING: /home/buildslave/workspace/kernel-build/linux/build/_modules_/lib/modules/5.4.0-rc4-next-20191021/kernel/drivers/usb/storage/ums-cypress.ko needs unknown symbol usb_stor_post_reset
    1    depmod: WARNING: /home/buildslave/workspace/kernel-build/linux/build/_modules_/lib/modules/5.4.0-rc4-next-20191021/kernel/drivers/usb/storage/ums-cypress.ko needs unknown symbol usb_stor_host_template_init
    1    depmod: WARNING: /home/buildslave/workspace/kernel-build/linux/build/_modules_/lib/modules/5.4.0-rc4-next-20191021/kernel/drivers/usb/storage/ums-cypress.ko needs unknown symbol usb_stor_disconnect
    1    depmod: WARNING: /home/buildslave/workspace/kernel-build/linux/build/_modules_/lib/modules/5.4.0-rc4-next-20191021/kernel/drivers/usb/storage/ums-alauda.ko needs unknown symbol usb_stor_suspend
    1    depmod: WARNING: /home/buildslave/workspace/kernel-build/linux/build/_modules_/lib/modules/5.4.0-rc4-next-20191021/kernel/drivers/usb/storage/ums-alauda.ko needs unknown symbol usb_stor_set_xfer_buf
    1    depmod: WARNING: /home/buildslave/workspace/kernel-build/linux/build/_modules_/lib/modules/5.4.0-rc4-next-20191021/kernel/drivers/usb/storage/ums-alauda.ko needs unknown symbol usb_stor_resume
    1    depmod: WARNING: /home/buildslave/workspace/kernel-build/linux/build/_modules_/lib/modules/5.4.0-rc4-next-20191021/kernel/drivers/usb/storage/ums-alauda.ko needs unknown symbol usb_stor_reset_resume
    1    depmod: WARNING: /home/buildslave/workspace/kernel-build/linux/build/_modules_/lib/modules/5.4.0-rc4-next-20191021/kernel/drivers/usb/storage/ums-alauda.ko needs unknown symbol usb_stor_probe2
    1    depmod: WARNING: /home/buildslave/workspace/kernel-build/linux/build/_modules_/lib/modules/5.4.0-rc4-next-20191021/kernel/drivers/usb/storage/ums-alauda.ko needs unknown symbol usb_stor_probe1
    1    depmod: WARNING: /home/buildslave/workspace/kernel-build/linux/build/_modules_/lib/modules/5.4.0-rc4-next-20191021/kernel/drivers/usb/storage/ums-alauda.ko needs unknown symbol usb_stor_pre_reset
    1    depmod: WARNING: /home/buildslave/workspace/kernel-build/linux/build/_modules_/lib/modules/5.4.0-rc4-next-20191021/kernel/drivers/usb/storage/ums-alauda.ko needs unknown symbol usb_stor_post_reset
    1    depmod: WARNING: /home/buildslave/workspace/kernel-build/linux/build/_modules_/lib/modules/5.4.0-rc4-next-20191021/kernel/drivers/usb/storage/ums-alauda.ko needs unknown symbol usb_stor_host_template_init
    1    depmod: WARNING: /home/buildslave/workspace/kernel-build/linux/build/_modules_/lib/modules/5.4.0-rc4-next-20191021/kernel/drivers/usb/storage/ums-alauda.ko needs unknown symbol usb_stor_disconnect
    1    depmod: WARNING: /home/buildslave/workspace/kernel-build/linux/build/_modules_/lib/modules/5.4.0-rc4-next-20191021/kernel/drivers/usb/storage/ums-alauda.ko needs unknown symbol usb_stor_ctrl_transfer
    1    depmod: WARNING: /home/buildslave/workspace/kernel-build/linux/build/_modules_/lib/modules/5.4.0-rc4-next-20191021/kernel/drivers/usb/storage/ums-alauda.ko needs unknown symbol usb_stor_bulk_transfer_buf
    1    depmod: WARNING: /home/buildslave/workspace/kernel-build/linux/build/_modules_/lib/modules/5.4.0-rc4-next-20191021/kernel/drivers/usb/storage/ums-alauda.ko needs unknown symbol usb_stor_access_xfer_buf
    1    depmod: WARNING: /home/buildslave/workspace/kernel-build/linux/build/_modules_/lib/modules/5.4.0-rc4-next-20191021/kernel/drivers/usb/storage/ums-alauda.ko needs unknown symbol usb_stor_Bulk_reset
    1    depmod: WARNING: /home/buildslave/workspace/kernel-build/linux/build/_modules_/lib/modules/5.4.0-rc4-next-20191021/kernel/drivers/usb/storage/ums-alauda.ko needs unknown symbol fill_inquiry_response
    1    /tmp/ccb67aGj.s:18191: Warning: using r15 results in unpredictable behaviour
    1    /tmp/ccb67aGj.s:18119: Warning: using r15 results in unpredictable behaviour
    1    .config:1165:warning: override: UNWINDER_GUESS changes choice state
    1    ./.tmp.config.vw3mCjUfBG:1745:warning: override: reassigning to symbol USER_NS
    1    ./.tmp.config.vw3mCjUfBG:1728:warning: override: reassigning to symbol ANDROID
    1    ./.tmp.config.vw3mCjUfBG:1727:warning: override: reassigning to symbol STAGING
    1    ./.tmp.config.vw3mCjUfBG:1723:warning: override: reassigning to symbol SECURITYFS
    1    ./.tmp.config.vw3mCjUfBG:1703:warning: override: reassigning to symbol IPV6_GRE
    1    ./.tmp.config.vw3mCjUfBG:1697:warning: override: reassigning to symbol NET_CLS_FLOWER
    1    ./.tmp.config.vw3mCjUfBG:1688:warning: override: reassigning to symbol IPV6
    1    ./.tmp.config.vw3mCjUfBG:1686:warning: override: reassigning to symbol NET_SCH_INGRESS
    1    ./.tmp.config.vw3mCjUfBG:1685:warning: override: reassigning to symbol NET_SCHED
    1    ./.tmp.config.vw3mCjUfBG:1684:warning: override: reassigning to symbol NET_CLS_ACT
    1    ./.tmp.config.vw3mCjUfBG:1682:warning: override: reassigning to symbol CGROUP_BPF
    1    ./.tmp.config.vw3mCjUfBG:1681:warning: override: reassigning to symbol TEST_BPF
    1    ./.tmp.config.vw3mCjUfBG:1678:warning: override: reassigning to symbol BPF_SYSCALL
    1    ./.tmp.config.vw3mCjUfBG:1671:warning: override: reassigning to symbol ANDROID
    1    ./.tmp.config.vw3mCjUfBG:1661:warning: override: reassigning to symbol NOTIFIER_ERROR_INJECTION
    1    ./.tmp.config.vw3mCjUfBG:1650:warning: override: reassigning to symbol USER_NS
    1    ./.tmp.config.vw3mCjUfBG:1542:warning: override: reassigning to symbol NET_NS
    1    ./.tmp.config.vw3mCjUfBG:1538:warning: override: reassigning to symbol USER_NS
    1    ./.tmp.config.vw3mCjUfBG:1513:warning: override: reassigning to symbol NET_ACT_GACT
    1    ./.tmp.config.vw3mCjUfBG:1492:warning: override: reassigning to symbol NET_SCH_INGRESS
    1    ./.tmp.config.vw3mCjUfBG:1434:warning: override: reassigning to symbol VLAN_8021Q
    1    ./.tmp.config.vw3mCjUfBG:1433:warning: override: reassigning to symbol BRIDGE
    1    ./.tmp.config.vw3mCjUfBG:1429:warning: override: reassigning to symbol VETH
    1    ./.tmp.config.vw3mCjUfBG:1428:warning: override: reassigning to symbol IPV6_MULTIPLE_TABLES
    1    ./.tmp.config.vw3mCjUfBG:1426:warning: override: reassigning to symbol NET_L3_MASTER_DEV
    1    ./.tmp.config.vw3mCjUfBG:1425:warning: override: reassigning to symbol NET_VRF
    1    ./.tmp.config.vw3mCjUfBG:1422:warning: override: reassigning to symbol BPF_SYSCALL
    1    ./.tmp.config.vGhEl8Wvl4:4889:warning: override: reassigning to symbol USER_NS
    1    ./.tmp.config.vGhEl8Wvl4:4872:warning: override: reassigning to symbol ANDROID
    1    ./.tmp.config.vGhEl8Wvl4:4871:warning: override: reassigning to symbol STAGING
    1    ./.tmp.config.vGhEl8Wvl4:4867:warning: override: reassigning to symbol SECURITYFS
    1    ./.tmp.config.vGhEl8Wvl4:4847:warning: override: reassigning to symbol IPV6_GRE
    1    ./.tmp.config.vGhEl8Wvl4:4841:warning: override: reassigning to symbol NET_CLS_FLOWER
    1    ./.tmp.config.vGhEl8Wvl4:4832:warning: override: reassigning to symbol IPV6
    1    ./.tmp.config.vGhEl8Wvl4:4830:warning: override: reassigning to symbol NET_SCH_INGRESS
    1    ./.tmp.config.vGhEl8Wvl4:4829:warning: override: reassigning to symbol NET_SCHED
    1    ./.tmp.config.vGhEl8Wvl4:4828:warning: override: reassigning to symbol NET_CLS_ACT
    1    ./.tmp.config.vGhEl8Wvl4:4826:warning: override: reassigning to symbol CGROUP_BPF
    1    ./.tmp.config.vGhEl8Wvl4:4825:warning: override: reassigning to symbol TEST_BPF
    1    ./.tmp.config.vGhEl8Wvl4:4822:warning: override: reassigning to symbol BPF_SYSCALL
    1    ./.tmp.config.vGhEl8Wvl4:4815:warning: override: reassigning to symbol ANDROID
    1    ./.tmp.config.vGhEl8Wvl4:4805:warning: override: reassigning to symbol NOTIFIER_ERROR_INJECTION
    1    ./.tmp.config.vGhEl8Wvl4:4794:warning: override: reassigning to symbol USER_NS
    1    ./.tmp.config.vGhEl8Wvl4:4686:warning: override: reassigning to symbol NET_NS
    1    ./.tmp.config.vGhEl8Wvl4:4682:warning: override: reassigning to symbol USER_NS
    1    ./.tmp.config.vGhEl8Wvl4:4657:warning: override: reassigning to symbol NET_ACT_GACT
    1    ./.tmp.config.vGhEl8Wvl4:4636:warning: override: reassigning to symbol NET_SCH_INGRESS
    1    ./.tmp.config.vGhEl8Wvl4:4578:warning: override: reassigning to symbol VLAN_8021Q
    1    ./.tmp.config.vGhEl8Wvl4:4577:warning: override: reassigning to symbol BRIDGE
    1    ./.tmp.config.vGhEl8Wvl4:4573:warning: override: reassigning to symbol VETH
    1    ./.tmp.config.vGhEl8Wvl4:4572:warning: override: reassigning to symbol IPV6_MULTIPLE_TABLES
    1    ./.tmp.config.vGhEl8Wvl4:4570:warning: override: reassigning to symbol NET_L3_MASTER_DEV
    1    ./.tmp.config.vGhEl8Wvl4:4569:warning: override: reassigning to symbol NET_VRF
    1    ./.tmp.config.vGhEl8Wvl4:4566:warning: override: reassigning to symbol BPF_SYSCALL
    1    ./.tmp.config.nmz1DceE9X:7953:warning: override: reassigning to symbol USER_NS
    1    ./.tmp.config.nmz1DceE9X:7936:warning: override: reassigning to symbol ANDROID
    1    ./.tmp.config.nmz1DceE9X:7935:warning: override: reassigning to symbol STAGING
    1    ./.tmp.config.nmz1DceE9X:7931:warning: override: reassigning to symbol SECURITYFS
    1    ./.tmp.config.nmz1DceE9X:7911:warning: override: reassigning to symbol IPV6_GRE
    1    ./.tmp.config.nmz1DceE9X:7905:warning: override: reassigning to symbol NET_CLS_FLOWER
    1    ./.tmp.config.nmz1DceE9X:7896:warning: override: reassigning to symbol IPV6
    1    ./.tmp.config.nmz1DceE9X:7894:warning: override: reassigning to symbol NET_SCH_INGRESS
    1    ./.tmp.config.nmz1DceE9X:7893:warning: override: reassigning to symbol NET_SCHED
    1    ./.tmp.config.nmz1DceE9X:7892:warning: override: reassigning to symbol NET_CLS_ACT
    1    ./.tmp.config.nmz1DceE9X:7890:warning: override: reassigning to symbol CGROUP_BPF
    1    ./.tmp.config.nmz1DceE9X:7889:warning: override: reassigning to symbol TEST_BPF
    1    ./.tmp.config.nmz1DceE9X:7886:warning: override: reassigning to symbol BPF_SYSCALL
    1    ./.tmp.config.nmz1DceE9X:7879:warning: override: reassigning to symbol ANDROID
    1    ./.tmp.config.nmz1DceE9X:7869:warning: override: reassigning to symbol NOTIFIER_ERROR_INJECTION
    1    ./.tmp.config.nmz1DceE9X:7858:warning: override: reassigning to symbol USER_NS
    1    ./.tmp.config.nmz1DceE9X:7750:warning: override: reassigning to symbol NET_NS
    1    ./.tmp.config.nmz1DceE9X:7746:warning: override: reassigning to symbol USER_NS
    1    ./.tmp.config.nmz1DceE9X:7721:warning: override: reassigning to symbol NET_ACT_GACT
    1    ./.tmp.config.nmz1DceE9X:7700:warning: override: reassigning to symbol NET_SCH_INGRESS
    1    ./.tmp.config.nmz1DceE9X:7642:warning: override: reassigning to symbol VLAN_8021Q
    1    ./.tmp.config.nmz1DceE9X:7641:warning: override: reassigning to symbol BRIDGE
    1    ./.tmp.config.nmz1DceE9X:7637:warning: override: reassigning to symbol VETH
    1    ./.tmp.config.nmz1DceE9X:7636:warning: override: reassigning to symbol IPV6_MULTIPLE_TABLES
    1    ./.tmp.config.nmz1DceE9X:7634:warning: override: reassigning to symbol NET_L3_MASTER_DEV
    1    ./.tmp.config.nmz1DceE9X:7633:warning: override: reassigning to symbol NET_VRF
    1    ./.tmp.config.nmz1DceE9X:7630:warning: override: reassigning to symbol BPF_SYSCALL
    1    ./.tmp.config.iSnOR7bhNw:3365:warning: override: reassigning to symbol USER_NS
    1    ./.tmp.config.iSnOR7bhNw:3348:warning: override: reassigning to symbol ANDROID
    1    ./.tmp.config.iSnOR7bhNw:3347:warning: override: reassigning to symbol STAGING
    1    ./.tmp.config.iSnOR7bhNw:3343:warning: override: reassigning to symbol SECURITYFS
    1    ./.tmp.config.iSnOR7bhNw:3323:warning: override: reassigning to symbol IPV6_GRE
    1    ./.tmp.config.iSnOR7bhNw:3317:warning: override: reassigning to symbol NET_CLS_FLOWER
    1    ./.tmp.config.iSnOR7bhNw:3308:warning: override: reassigning to symbol IPV6
    1    ./.tmp.config.iSnOR7bhNw:3306:warning: override: reassigning to symbol NET_SCH_INGRESS
    1    ./.tmp.config.iSnOR7bhNw:3305:warning: override: reassigning to symbol NET_SCHED
    1    ./.tmp.config.iSnOR7bhNw:3304:warning: override: reassigning to symbol NET_CLS_ACT
    1    ./.tmp.config.iSnOR7bhNw:3302:warning: override: reassigning to symbol CGROUP_BPF
    1    ./.tmp.config.iSnOR7bhNw:3301:warning: override: reassigning to symbol TEST_BPF
    1    ./.tmp.config.iSnOR7bhNw:3298:warning: override: reassigning to symbol BPF_SYSCALL
    1    ./.tmp.config.iSnOR7bhNw:3291:warning: override: reassigning to symbol ANDROID
    1    ./.tmp.config.iSnOR7bhNw:3281:warning: override: reassigning to symbol NOTIFIER_ERROR_INJECTION
    1    ./.tmp.config.iSnOR7bhNw:3270:warning: override: reassigning to symbol USER_NS
    1    ./.tmp.config.iSnOR7bhNw:3162:warning: override: reassigning to symbol NET_NS
    1    ./.tmp.config.iSnOR7bhNw:3158:warning: override: reassigning to symbol USER_NS
    1    ./.tmp.config.iSnOR7bhNw:3133:warning: override: reassigning to symbol NET_ACT_GACT
    1    ./.tmp.config.iSnOR7bhNw:3112:warning: override: reassigning to symbol NET_SCH_INGRESS
    1    ./.tmp.config.iSnOR7bhNw:3054:warning: override: reassigning to symbol VLAN_8021Q
    1    ./.tmp.config.iSnOR7bhNw:3053:warning: override: reassigning to symbol BRIDGE
    1    ./.tmp.config.iSnOR7bhNw:3049:warning: override: reassigning to symbol VETH
    1    ./.tmp.config.iSnOR7bhNw:3048:warning: override: reassigning to symbol IPV6_MULTIPLE_TABLES
    1    ./.tmp.config.iSnOR7bhNw:3046:warning: override: reassigning to symbol NET_L3_MASTER_DEV
    1    ./.tmp.config.iSnOR7bhNw:3045:warning: override: reassigning to symbol NET_VRF
    1    ./.tmp.config.iSnOR7bhNw:3042:warning: override: reassigning to symbol BPF_SYSCALL
    1    ./.tmp.config.QC0gDOAXVp:3979:warning: override: reassigning to symbol USER_NS
    1    ./.tmp.config.QC0gDOAXVp:3962:warning: override: reassigning to symbol ANDROID
    1    ./.tmp.config.QC0gDOAXVp:3961:warning: override: reassigning to symbol STAGING
    1    ./.tmp.config.QC0gDOAXVp:3957:warning: override: reassigning to symbol SECURITYFS
    1    ./.tmp.config.QC0gDOAXVp:3937:warning: override: reassigning to symbol IPV6_GRE
    1    ./.tmp.config.QC0gDOAXVp:3931:warning: override: reassigning to symbol NET_CLS_FLOWER
    1    ./.tmp.config.QC0gDOAXVp:3922:warning: override: reassigning to symbol IPV6
    1    ./.tmp.config.QC0gDOAXVp:3920:warning: override: reassigning to symbol NET_SCH_INGRESS
    1    ./.tmp.config.QC0gDOAXVp:3919:warning: override: reassigning to symbol NET_SCHED
    1    ./.tmp.config.QC0gDOAXVp:3918:warning: override: reassigning to symbol NET_CLS_ACT
    1    ./.tmp.config.QC0gDOAXVp:3916:warning: override: reassigning to symbol CGROUP_BPF
    1    ./.tmp.config.QC0gDOAXVp:3915:warning: override: reassigning to symbol TEST_BPF
    1    ./.tmp.config.QC0gDOAXVp:3912:warning: override: reassigning to symbol BPF_SYSCALL
    1    ./.tmp.config.QC0gDOAXVp:3905:warning: override: reassigning to symbol ANDROID
    1    ./.tmp.config.QC0gDOAXVp:3895:warning: override: reassigning to symbol NOTIFIER_ERROR_INJECTION
    1    ./.tmp.config.QC0gDOAXVp:3884:warning: override: reassigning to symbol USER_NS
    1    ./.tmp.config.QC0gDOAXVp:3776:warning: override: reassigning to symbol NET_NS
    1    ./.tmp.config.QC0gDOAXVp:3772:warning: override: reassigning to symbol USER_NS
    1    ./.tmp.config.QC0gDOAXVp:3747:warning: override: reassigning to symbol NET_ACT_GACT
    1    ./.tmp.config.QC0gDOAXVp:3726:warning: override: reassigning to symbol NET_SCH_INGRESS
    1    ./.tmp.config.QC0gDOAXVp:3668:warning: override: reassigning to symbol VLAN_8021Q
    1    ./.tmp.config.QC0gDOAXVp:3667:warning: override: reassigning to symbol BRIDGE
    1    ./.tmp.config.QC0gDOAXVp:3663:warning: override: reassigning to symbol VETH
    1    ./.tmp.config.QC0gDOAXVp:3662:warning: override: reassigning to symbol IPV6_MULTIPLE_TABLES
    1    ./.tmp.config.QC0gDOAXVp:3660:warning: override: reassigning to symbol NET_L3_MASTER_DEV
    1    ./.tmp.config.QC0gDOAXVp:3659:warning: override: reassigning to symbol NET_VRF
    1    ./.tmp.config.QC0gDOAXVp:3656:warning: override: reassigning to symbol BPF_SYSCALL
    1    ./.tmp.config.Q89c87CZ76:4826:warning: override: reassigning to symbol USER_NS
    1    ./.tmp.config.Q89c87CZ76:4809:warning: override: reassigning to symbol ANDROID
    1    ./.tmp.config.Q89c87CZ76:4808:warning: override: reassigning to symbol STAGING
    1    ./.tmp.config.Q89c87CZ76:4804:warning: override: reassigning to symbol SECURITYFS
    1    ./.tmp.config.Q89c87CZ76:4784:warning: override: reassigning to symbol IPV6_GRE
    1    ./.tmp.config.Q89c87CZ76:4778:warning: override: reassigning to symbol NET_CLS_FLOWER
    1    ./.tmp.config.Q89c87CZ76:4769:warning: override: reassigning to symbol IPV6
    1    ./.tmp.config.Q89c87CZ76:4767:warning: override: reassigning to symbol NET_SCH_INGRESS
    1    ./.tmp.config.Q89c87CZ76:4766:warning: override: reassigning to symbol NET_SCHED
    1    ./.tmp.config.Q89c87CZ76:4765:warning: override: reassigning to symbol NET_CLS_ACT
    1    ./.tmp.config.Q89c87CZ76:4763:warning: override: reassigning to symbol CGROUP_BPF
    1    ./.tmp.config.Q89c87CZ76:4762:warning: override: reassigning to symbol TEST_BPF
    1    ./.tmp.config.Q89c87CZ76:4759:warning: override: reassigning to symbol BPF_SYSCALL
    1    ./.tmp.config.Q89c87CZ76:4752:warning: override: reassigning to symbol ANDROID
    1    ./.tmp.config.Q89c87CZ76:4742:warning: override: reassigning to symbol NOTIFIER_ERROR_INJECTION
    1    ./.tmp.config.Q89c87CZ76:4731:warning: override: reassigning to symbol USER_NS
    1    ./.tmp.config.Q89c87CZ76:4623:warning: override: reassigning to symbol NET_NS
    1    ./.tmp.config.Q89c87CZ76:4619:warning: override: reassigning to symbol USER_NS
    1    ./.tmp.config.Q89c87CZ76:4594:warning: override: reassigning to symbol NET_ACT_GACT
    1    ./.tmp.config.Q89c87CZ76:4573:warning: override: reassigning to symbol NET_SCH_INGRESS
    1    ./.tmp.config.Q89c87CZ76:4515:warning: override: reassigning to symbol VLAN_8021Q
    1    ./.tmp.config.Q89c87CZ76:4514:warning: override: reassigning to symbol BRIDGE
    1    ./.tmp.config.Q89c87CZ76:4510:warning: override: reassigning to symbol VETH
    1    ./.tmp.config.Q89c87CZ76:4509:warning: override: reassigning to symbol IPV6_MULTIPLE_TABLES
    1    ./.tmp.config.Q89c87CZ76:4507:warning: override: reassigning to symbol NET_L3_MASTER_DEV
    1    ./.tmp.config.Q89c87CZ76:4506:warning: override: reassigning to symbol NET_VRF
    1    ./.tmp.config.Q89c87CZ76:4503:warning: override: reassigning to symbol BPF_SYSCALL
    1    ./.tmp.config.Lg4nl5GY7B:8529:warning: override: reassigning to symbol USER_NS
    1    ./.tmp.config.Lg4nl5GY7B:8512:warning: override: reassigning to symbol ANDROID
    1    ./.tmp.config.Lg4nl5GY7B:8511:warning: override: reassigning to symbol STAGING
    1    ./.tmp.config.Lg4nl5GY7B:8507:warning: override: reassigning to symbol SECURITYFS
    1    ./.tmp.config.Lg4nl5GY7B:8487:warning: override: reassigning to symbol IPV6_GRE
    1    ./.tmp.config.Lg4nl5GY7B:8481:warning: override: reassigning to symbol NET_CLS_FLOWER
    1    ./.tmp.config.Lg4nl5GY7B:8472:warning: override: reassigning to symbol IPV6
    1    ./.tmp.config.Lg4nl5GY7B:8470:warning: override: reassigning to symbol NET_SCH_INGRESS
    1    ./.tmp.config.Lg4nl5GY7B:8469:warning: override: reassigning to symbol NET_SCHED
    1    ./.tmp.config.Lg4nl5GY7B:8468:warning: override: reassigning to symbol NET_CLS_ACT
    1    ./.tmp.config.Lg4nl5GY7B:8466:warning: override: reassigning to symbol CGROUP_BPF
    1    ./.tmp.config.Lg4nl5GY7B:8465:warning: override: reassigning to symbol TEST_BPF
    1    ./.tmp.config.Lg4nl5GY7B:8462:warning: override: reassigning to symbol BPF_SYSCALL
    1    ./.tmp.config.Lg4nl5GY7B:8455:warning: override: reassigning to symbol ANDROID
    1    ./.tmp.config.Lg4nl5GY7B:8445:warning: override: reassigning to symbol NOTIFIER_ERROR_INJECTION
    1    ./.tmp.config.Lg4nl5GY7B:8434:warning: override: reassigning to symbol USER_NS
    1    ./.tmp.config.Lg4nl5GY7B:8326:warning: override: reassigning to symbol NET_NS
    1    ./.tmp.config.Lg4nl5GY7B:8322:warning: override: reassigning to symbol USER_NS
    1    ./.tmp.config.Lg4nl5GY7B:8297:warning: override: reassigning to symbol NET_ACT_GACT
    1    ./.tmp.config.Lg4nl5GY7B:8276:warning: override: reassigning to symbol NET_SCH_INGRESS
    1    ./.tmp.config.Lg4nl5GY7B:8218:warning: override: reassigning to symbol VLAN_8021Q
    1    ./.tmp.config.Lg4nl5GY7B:8217:warning: override: reassigning to symbol BRIDGE
    1    ./.tmp.config.Lg4nl5GY7B:8213:warning: override: reassigning to symbol VETH
    1    ./.tmp.config.Lg4nl5GY7B:8212:warning: override: reassigning to symbol IPV6_MULTIPLE_TABLES
    1    ./.tmp.config.Lg4nl5GY7B:8210:warning: override: reassigning to symbol NET_L3_MASTER_DEV
    1    ./.tmp.config.Lg4nl5GY7B:8209:warning: override: reassigning to symbol NET_VRF
    1    ./.tmp.config.Lg4nl5GY7B:8206:warning: override: reassigning to symbol BPF_SYSCALL

Section mismatches summary:

    5    WARNING: vmlinux.o(.text.unlikely+0x8c4): Section mismatch in reference from the function free_memmap() to the function .meminit.text:memblock_free()
    3    WARNING: vmlinux.o(.text.unlikely+0x84c): Section mismatch in reference from the function free_memmap() to the function .meminit.text:memblock_free()
    3    WARNING: vmlinux.o(.text.unlikely+0x840): Section mismatch in reference from the function free_memmap() to the function .meminit.text:memblock_free()
    1    WARNING: vmlinux.o(.text.unlikely+0x8e4): Section mismatch in reference from the function free_memmap() to the function .meminit.text:memblock_free()
    1    WARNING: vmlinux.o(.text.unlikely+0x7c8): Section mismatch in reference from the function free_memmap() to the function .meminit.text:memblock_free()
    1    WARNING: vmlinux.o(.text.unlikely+0x710): Section mismatch in reference from the function free_memmap() to the function .meminit.text:memblock_free()
    1    WARNING: vmlinux.o(.text.unlikely+0x3630): Section mismatch in reference from the function pmax_setup_memory_region() to the function .init.text:add_memory_region()
    1    WARNING: vmlinux.o(.text.unlikely+0x3320): Section mismatch in reference from the function pmax_setup_memory_region() to the function .init.text:add_memory_region()

================================================================================

Detailed per-defconfig build reports:

--------------------------------------------------------------------------------
32r2el_defconfig (mips, gcc-8) — PASS, 0 errors, 0 warnings, 0 section mismatches

--------------------------------------------------------------------------------
32r2el_defconfig+kselftest (mips, gcc-8) — PASS, 0 errors, 28 warnings, 0 section mismatches

Warnings:
    ./.tmp.config.QC0gDOAXVp:3656:warning: override: reassigning to symbol BPF_SYSCALL
    ./.tmp.config.QC0gDOAXVp:3659:warning: override: reassigning to symbol NET_VRF
    ./.tmp.config.QC0gDOAXVp:3660:warning: override: reassigning to symbol NET_L3_MASTER_DEV
    ./.tmp.config.QC0gDOAXVp:3662:warning: override: reassigning to symbol IPV6_MULTIPLE_TABLES
    ./.tmp.config.QC0gDOAXVp:3663:warning: override: reassigning to symbol VETH
    ./.tmp.config.QC0gDOAXVp:3667:warning: override: reassigning to symbol BRIDGE
    ./.tmp.config.QC0gDOAXVp:3668:warning: override: reassigning to symbol VLAN_8021Q
    ./.tmp.config.QC0gDOAXVp:3726:warning: override: reassigning to symbol NET_SCH_INGRESS
    ./.tmp.config.QC0gDOAXVp:3747:warning: override: reassigning to symbol NET_ACT_GACT
    ./.tmp.config.QC0gDOAXVp:3772:warning: override: reassigning to symbol USER_NS
    ./.tmp.config.QC0gDOAXVp:3776:warning: override: reassigning to symbol NET_NS
    ./.tmp.config.QC0gDOAXVp:3884:warning: override: reassigning to symbol USER_NS
    ./.tmp.config.QC0gDOAXVp:3895:warning: override: reassigning to symbol NOTIFIER_ERROR_INJECTION
    ./.tmp.config.QC0gDOAXVp:3905:warning: override: reassigning to symbol ANDROID
    ./.tmp.config.QC0gDOAXVp:3912:warning: override: reassigning to symbol BPF_SYSCALL
    ./.tmp.config.QC0gDOAXVp:3915:warning: override: reassigning to symbol TEST_BPF
    ./.tmp.config.QC0gDOAXVp:3916:warning: override: reassigning to symbol CGROUP_BPF
    ./.tmp.config.QC0gDOAXVp:3918:warning: override: reassigning to symbol NET_CLS_ACT
    ./.tmp.config.QC0gDOAXVp:3919:warning: override: reassigning to symbol NET_SCHED
    ./.tmp.config.QC0gDOAXVp:3920:warning: override: reassigning to symbol NET_SCH_INGRESS
    ./.tmp.config.QC0gDOAXVp:3922:warning: override: reassigning to symbol IPV6
    ./.tmp.config.QC0gDOAXVp:3931:warning: override: reassigning to symbol NET_CLS_FLOWER
    ./.tmp.config.QC0gDOAXVp:3937:warning: override: reassigning to symbol IPV6_GRE
    ./.tmp.config.QC0gDOAXVp:3957:warning: override: reassigning to symbol SECURITYFS
    ./.tmp.config.QC0gDOAXVp:3961:warning: override: reassigning to symbol STAGING
    ./.tmp.config.QC0gDOAXVp:3962:warning: override: reassigning to symbol ANDROID
    ./.tmp.config.QC0gDOAXVp:3979:warning: override: reassigning to symbol USER_NS
    include/linux/kern_levels.h:5:18: warning: format '%lu' expects argument of type 'long unsigned int', but argument 8 has type 'unsigned int' [-Wformat=]

--------------------------------------------------------------------------------
allmodconfig (arm64, clang-8) — FAIL, 9 errors, 46 warnings, 0 section mismatches

Errors:
    ERROR: "dpdmai_reset" [drivers/dma/fsl-dpaa2-qdma/dpaa2-qdma.ko] undefined!
    ERROR: "dpdmai_set_rx_queue" [drivers/dma/fsl-dpaa2-qdma/dpaa2-qdma.ko] undefined!
    ERROR: "dpdmai_get_tx_queue" [drivers/dma/fsl-dpaa2-qdma/dpaa2-qdma.ko] undefined!
    ERROR: "dpdmai_get_rx_queue" [drivers/dma/fsl-dpaa2-qdma/dpaa2-qdma.ko] undefined!
    ERROR: "dpdmai_get_attributes" [drivers/dma/fsl-dpaa2-qdma/dpaa2-qdma.ko] undefined!
    ERROR: "dpdmai_open" [drivers/dma/fsl-dpaa2-qdma/dpaa2-qdma.ko] undefined!
    ERROR: "dpdmai_disable" [drivers/dma/fsl-dpaa2-qdma/dpaa2-qdma.ko] undefined!
    ERROR: "dpdmai_close" [drivers/dma/fsl-dpaa2-qdma/dpaa2-qdma.ko] undefined!
    ERROR: "dpdmai_enable" [drivers/dma/fsl-dpaa2-qdma/dpaa2-qdma.ko] undefined!

Warnings:
    mm/shmem.c:2737:35: warning: variable 'shmem_falloc_waitq' is uninitialized when used within its own initialization [-Wuninitialized]
    1 warning generated.
    fs/proc/base.c:1894:35: warning: variable 'wq' is uninitialized when used within its own initialization [-Wuninitialized]
    1 warning generated.
    fs/proc/proc_sysctl.c:705:35: warning: variable 'wq' is uninitialized when used within its own initialization [-Wuninitialized]
    1 warning generated.
    fs/namei.c:1644:34: warning: variable 'wq' is uninitialized when used within its own initialization [-Wuninitialized]
    fs/namei.c:3132:34: warning: variable 'wq' is uninitialized when used within its own initialization [-Wuninitialized]
    2 warnings generated.
    drivers/android/binderfs.c:657:41: warning: suggest braces around initialization of subobject [-Wmissing-braces]
    1 warning generated.
    fs/afs/dir_silly.c:205:34: warning: variable 'wq' is uninitialized when used within its own initialization [-Wuninitialized]
    1 warning generated.
    drivers/bluetooth/bluecard_cs.c:282:36: warning: variable 'wq' is uninitialized when used within its own initialization [-Wuninitialized]
    1 warning generated.
    fs/cifs/readdir.c:83:34: warning: variable 'wq' is uninitialized when used within its own initialization [-Wuninitialized]
    1 warning generated.
    fs/fuse/readdir.c:161:34: warning: variable 'wq' is uninitialized when used within its own initialization [-Wuninitialized]
    1 warning generated.
    drivers/dma/fsl-dpaa2-qdma/dpdmai.c:148:20: warning: variable 'cmd' is uninitialized when used within its own initialization [-Wuninitialized]
    drivers/dma/fsl-dpaa2-qdma/dpdmai.c:148:25: warning: variable 'cfg' is uninitialized when used within its own initialization [-Wuninitialized]
    2 warnings generated.
    fs/nfs/dir.c:448:34: warning: variable 'wq' is uninitialized when used within its own initialization [-Wuninitialized]
    fs/nfs/dir.c:1499:34: warning: variable 'wq' is uninitialized when used within its own initialization [-Wuninitialized]
    2 warnings generated.
    drivers/gpu/drm/amd/amdgpu/../powerplay/renoir_ppt.c:182:26: warning: suggest braces around initialization of subobject [-Wmissing-braces]
    1 warning generated.
    drivers/gpu/host1x/syncpt.c:208:34: warning: variable 'wq' is uninitialized when used within its own initialization [-Wuninitialized]
    1 warning generated.
    net/nfc/hci/command.c:59:34: warning: variable 'ew_wq' is uninitialized when used within its own initialization [-Wuninitialized]
    1 warning generated.
    net/nfc/hci/llc_shdlc.c:687:34: warning: variable 'connect_wq' is uninitialized when used within its own initialization [-Wuninitialized]
    1 warning generated.
    drivers/misc/mic/vop/vop_vringh.c:155:34: warning: variable 'wake' is uninitialized when used within its own initialization [-Wuninitialized]
    drivers/misc/mic/vop/vop_vringh.c:399:34: warning: variable 'wake' is uninitialized when used within its own initialization [-Wuninitialized]
    2 warnings generated.
    drivers/net/usb/lan78xx.c:2662:34: warning: variable 'unlink_wakeup' is uninitialized when used within its own initialization [-Wuninitialized]
    1 warning generated.
    drivers/scsi/bfa/bfad_im.c:301:34: warning: variable 'wq' is uninitialized when used within its own initialization [-Wuninitialized]
    drivers/scsi/bfa/bfad_im.c:378:34: warning: variable 'wq' is uninitialized when used within its own initialization [-Wuninitialized]
    2 warnings generated.
    drivers/scsi/lpfc/lpfc_sli.c:11855:34: warning: variable 'done_q' is uninitialized when used within its own initialization [-Wuninitialized]
    1 warning generated.
    drivers/scsi/lpfc/lpfc_scsi.c:4722:34: warning: variable 'waitq' is uninitialized when used within its own initialization [-Wuninitialized]
    1 warning generated.
    WARNING: modpost: missing MODULE_LICENSE() in drivers/dma/fsl-dpaa2-qdma/dpdmai.o

--------------------------------------------------------------------------------
allmodconfig (arm, gcc-8) — PASS, 0 errors, 18 warnings, 0 section mismatches

Warnings:
    /tmp/ccb67aGj.s:18119: Warning: using r15 results in unpredictable behaviour
    /tmp/ccb67aGj.s:18191: Warning: using r15 results in unpredictable behaviour
    include/linux/kern_levels.h:5:18: warning: format '%lu' expects argument of type 'long unsigned int', but argument 8 has type 'unsigned int' [-Wformat=]
    drivers/net/phy/mdio-cavium.h:114:37: warning: cast to pointer from integer of different size [-Wint-to-pointer-cast]
    drivers/net/phy/mdio-cavium.h:113:48: warning: cast to pointer from integer of different size [-Wint-to-pointer-cast]
    drivers/net/phy/mdio-cavium.h:113:48: warning: cast to pointer from integer of different size [-Wint-to-pointer-cast]
    drivers/net/phy/mdio-cavium.h:113:48: warning: cast to pointer from integer of different size [-Wint-to-pointer-cast]
    drivers/net/phy/mdio-cavium.h:114:37: warning: cast to pointer from integer of different size [-Wint-to-pointer-cast]
    drivers/net/phy/mdio-cavium.h:113:48: warning: cast to pointer from integer of different size [-Wint-to-pointer-cast]
    drivers/net/phy/mdio-cavium.h:114:37: warning: cast to pointer from integer of different size [-Wint-to-pointer-cast]
    drivers/net/phy/mdio-cavium.h:113:48: warning: cast to pointer from integer of different size [-Wint-to-pointer-cast]
    drivers/net/phy/mdio-cavium.h:113:48: warning: cast to pointer from integer of different size [-Wint-to-pointer-cast]
    drivers/net/phy/mdio-cavium.h:114:37: warning: cast to pointer from integer of different size [-Wint-to-pointer-cast]
    drivers/net/phy/mdio-octeon.c:48:3: warning: cast from pointer to integer of different size [-Wpointer-to-int-cast]
    drivers/net/phy/mdio-cavium.h:113:48: warning: cast to pointer from integer of different size [-Wint-to-pointer-cast]
    drivers/net/phy/mdio-cavium.h:113:48: warning: cast to pointer from integer of different size [-Wint-to-pointer-cast]
    drivers/net/phy/mdio-cavium.h:113:48: warning: cast to pointer from integer of different size [-Wint-to-pointer-cast]
    warning: same module names found:

--------------------------------------------------------------------------------
allmodconfig (x86_64, gcc-8) — PASS, 0 errors, 0 warnings, 0 section mismatches

--------------------------------------------------------------------------------
allmodconfig (arm64, gcc-8) — FAIL, 9 errors, 1 warning, 0 section mismatches

Errors:
    ERROR: "dpdmai_enable" [drivers/dma/fsl-dpaa2-qdma/dpaa2-qdma.ko] undefined!
    ERROR: "dpdmai_set_rx_queue" [drivers/dma/fsl-dpaa2-qdma/dpaa2-qdma.ko] undefined!
    ERROR: "dpdmai_get_tx_queue" [drivers/dma/fsl-dpaa2-qdma/dpaa2-qdma.ko] undefined!
    ERROR: "dpdmai_get_rx_queue" [drivers/dma/fsl-dpaa2-qdma/dpaa2-qdma.ko] undefined!
    ERROR: "dpdmai_get_attributes" [drivers/dma/fsl-dpaa2-qdma/dpaa2-qdma.ko] undefined!
    ERROR: "dpdmai_open" [drivers/dma/fsl-dpaa2-qdma/dpaa2-qdma.ko] undefined!
    ERROR: "dpdmai_close" [drivers/dma/fsl-dpaa2-qdma/dpaa2-qdma.ko] undefined!
    ERROR: "dpdmai_disable" [drivers/dma/fsl-dpaa2-qdma/dpaa2-qdma.ko] undefined!
    ERROR: "dpdmai_reset" [drivers/dma/fsl-dpaa2-qdma/dpaa2-qdma.ko] undefined!

Warnings:
    WARNING: modpost: missing MODULE_LICENSE() in drivers/dma/fsl-dpaa2-qdma/dpdmai.o

--------------------------------------------------------------------------------
allnoconfig (arc, gcc-8) — PASS, 0 errors, 1 warning, 0 section mismatches

Warnings:
    <stdin>:1511:2: warning: #warning syscall clone3 not implemented [-Wcpp]

--------------------------------------------------------------------------------
allnoconfig (arm64, gcc-8) — PASS, 0 errors, 0 warnings, 0 section mismatches

--------------------------------------------------------------------------------
allnoconfig (arm, gcc-8) — PASS, 0 errors, 0 warnings, 0 section mismatches

--------------------------------------------------------------------------------
allnoconfig (mips, gcc-8) — PASS, 0 errors, 0 warnings, 0 section mismatches

--------------------------------------------------------------------------------
allnoconfig (riscv, gcc-8) — PASS, 0 errors, 0 warnings, 0 section mismatches

--------------------------------------------------------------------------------
allnoconfig (arm64, clang-8) — PASS, 0 errors, 0 warnings, 0 section mismatches

--------------------------------------------------------------------------------
allnoconfig (i386, gcc-8) — PASS, 0 errors, 0 warnings, 0 section mismatches

--------------------------------------------------------------------------------
allnoconfig (x86_64, gcc-8) — PASS, 0 errors, 0 warnings, 0 section mismatches

--------------------------------------------------------------------------------
am200epdkit_defconfig (arm, gcc-8) — PASS, 0 errors, 1 warning, 0 section mismatches

Warnings:
    WARNING: "return_address" [vmlinux] is a static EXPORT_SYMBOL_GPL

--------------------------------------------------------------------------------
ar7_defconfig (mips, gcc-8) — PASS, 0 errors, 0 warnings, 0 section mismatches

--------------------------------------------------------------------------------
aspeed_g4_defconfig (arm, gcc-8) — PASS, 0 errors, 0 warnings, 0 section mismatches

--------------------------------------------------------------------------------
aspeed_g5_defconfig (arm, gcc-8) — PASS, 0 errors, 0 warnings, 0 section mismatches

--------------------------------------------------------------------------------
assabet_defconfig (arm, gcc-8) — PASS, 0 errors, 0 warnings, 0 section mismatches

Section mismatches:
    WARNING: vmlinux.o(.text.unlikely+0x8c4): Section mismatch in reference from the function free_memmap() to the function .meminit.text:memblock_free()

--------------------------------------------------------------------------------
at91_dt_defconfig (arm, gcc-8) — PASS, 0 errors, 1 warning, 0 section mismatches

Warnings:
    WARNING: "return_address" [vmlinux] is a static EXPORT_SYMBOL_GPL

--------------------------------------------------------------------------------
ath25_defconfig (mips, gcc-8) — PASS, 0 errors, 0 warnings, 0 section mismatches

--------------------------------------------------------------------------------
ath79_defconfig (mips, gcc-8) — PASS, 0 errors, 0 warnings, 0 section mismatches

--------------------------------------------------------------------------------
axm55xx_defconfig (arm, gcc-8) — PASS, 0 errors, 1 warning, 0 section mismatches

Warnings:
    WARNING: "return_address" [vmlinux] is a static EXPORT_SYMBOL_GPL

--------------------------------------------------------------------------------
axs103_defconfig (arc, gcc-8) — PASS, 0 errors, 2 warnings, 0 section mismatches

Warnings:
    <stdin>:1511:2: warning: #warning syscall clone3 not implemented [-Wcpp]
    <stdin>:1511:2: warning: #warning syscall clone3 not implemented [-Wcpp]

--------------------------------------------------------------------------------
axs103_smp_defconfig (arc, gcc-8) — PASS, 0 errors, 2 warnings, 0 section mismatches

Warnings:
    <stdin>:1511:2: warning: #warning syscall clone3 not implemented [-Wcpp]
    <stdin>:1511:2: warning: #warning syscall clone3 not implemented [-Wcpp]

--------------------------------------------------------------------------------
badge4_defconfig (arm, gcc-8) — PASS, 0 errors, 0 warnings, 0 section mismatches

Section mismatches:
    WARNING: vmlinux.o(.text.unlikely+0x84c): Section mismatch in reference from the function free_memmap() to the function .meminit.text:memblock_free()

--------------------------------------------------------------------------------
bcm2835_defconfig (arm, gcc-8) — PASS, 0 errors, 3 warnings, 0 section mismatches

Warnings:
    kernel/debug/debug_core.c:452:17: warning: array subscript [0, 0] is outside array bounds of 'struct debuggerinfo_struct[1]' [-Warray-bounds]
    kernel/debug/debug_core.c:469:33: warning: array subscript [0, 0] is outside array bounds of 'struct debuggerinfo_struct[1]' [-Warray-bounds]
    kernel/debug/debug_core.c:470:18: warning: array subscript [0, 0] is outside array bounds of 'struct debuggerinfo_struct[1]' [-Warray-bounds]

--------------------------------------------------------------------------------
bcm47xx_defconfig (mips, gcc-8) — PASS, 0 errors, 0 warnings, 0 section mismatches

--------------------------------------------------------------------------------
bcm63xx_defconfig (mips, gcc-8) — PASS, 0 errors, 0 warnings, 0 section mismatches

--------------------------------------------------------------------------------
bigsur_defconfig (mips, gcc-8) — PASS, 0 errors, 0 warnings, 0 section mismatches

--------------------------------------------------------------------------------
bmips_be_defconfig (mips, gcc-8) — PASS, 0 errors, 0 warnings, 0 section mismatches

--------------------------------------------------------------------------------
bmips_stb_defconfig (mips, gcc-8) — PASS, 0 errors, 0 warnings, 0 section mismatches

--------------------------------------------------------------------------------
capcella_defconfig (mips, gcc-8) — PASS, 0 errors, 0 warnings, 0 section mismatches

--------------------------------------------------------------------------------
cavium_octeon_defconfig (mips, gcc-8) — FAIL, 4 errors, 3 warnings, 0 section mismatches

Errors:
    drivers/staging/octeon/ethernet.c:177:21: error: dereferencing pointer to incomplete type 'struct cvmx_wqe'
    drivers/staging/octeon/ethernet.c:463:30: error: storage size of 'link_info' isn't known
    drivers/staging/octeon/ethernet.c:499:30: error: storage size of 'link_info' isn't known
    drivers/staging/octeon/ethernet.c:516:29: error: type of formal parameter 2 is incomplete

Warnings:
    drivers/staging/octeon/octeon-ethernet.h:94:12: warning: 'union cvmx_helper_link_info' declared inside parameter list will not be visible outside of this definition or declaration
    drivers/staging/octeon/ethernet.c:463:30: warning: unused variable 'link_info' [-Wunused-variable]
    drivers/staging/octeon/ethernet.c:499:30: warning: unused variable 'link_info' [-Wunused-variable]

--------------------------------------------------------------------------------
cerfcube_defconfig (arm, gcc-8) — PASS, 0 errors, 0 warnings, 0 section mismatches

Section mismatches:
    WARNING: vmlinux.o(.text.unlikely+0x84c): Section mismatch in reference from the function free_memmap() to the function .meminit.text:memblock_free()

--------------------------------------------------------------------------------
ci20_defconfig (mips, gcc-8) — FAIL, 1 error, 0 warnings, 0 section mismatches

Errors:
    include/linux/compiler.h:350:38: error: call to '__compiletime_assert_1659' declared with attribute error: BUILD_BUG_ON failed: stat_items_size != ARRAY_SIZE(vmstat_text) * sizeof(unsigned long)

--------------------------------------------------------------------------------
clps711x_defconfig (arm, gcc-8) — PASS, 0 errors, 0 warnings, 0 section mismatches

--------------------------------------------------------------------------------
cm_x2xx_defconfig (arm, gcc-8) — PASS, 0 errors, 1 warning, 0 section mismatches

Warnings:
    WARNING: "return_address" [vmlinux] is a static EXPORT_SYMBOL_GPL

--------------------------------------------------------------------------------
cm_x300_defconfig (arm, gcc-8) — PASS, 0 errors, 1 warning, 0 section mismatches

Warnings:
    WARNING: "return_address" [vmlinux] is a static EXPORT_SYMBOL_GPL

--------------------------------------------------------------------------------
cns3420vb_defconfig (arm, gcc-8) — PASS, 0 errors, 1 warning, 0 section mismatches

Warnings:
    WARNING: "return_address" [vmlinux] is a static EXPORT_SYMBOL_GPL

--------------------------------------------------------------------------------
cobalt_defconfig (mips, gcc-8) — PASS, 0 errors, 0 warnings, 0 section mismatches

--------------------------------------------------------------------------------
colibri_pxa270_defconfig (arm, gcc-8) — PASS, 0 errors, 1 warning, 0 section mismatches

Warnings:
    WARNING: "return_address" [vmlinux] is a static EXPORT_SYMBOL_GPL

--------------------------------------------------------------------------------
colibri_pxa300_defconfig (arm, gcc-8) — PASS, 0 errors, 1 warning, 0 section mismatches

Warnings:
    WARNING: "return_address" [vmlinux] is a static EXPORT_SYMBOL_GPL

--------------------------------------------------------------------------------
collie_defconfig (arm, gcc-8) — PASS, 0 errors, 0 warnings, 0 section mismatches

Section mismatches:
    WARNING: vmlinux.o(.text.unlikely+0x840): Section mismatch in reference from the function free_memmap() to the function .meminit.text:memblock_free()

--------------------------------------------------------------------------------
corgi_defconfig (arm, gcc-8) — PASS, 0 errors, 0 warnings, 0 section mismatches

--------------------------------------------------------------------------------
davinci_all_defconfig (arm, gcc-8) — PASS, 0 errors, 1 warning, 0 section mismatches

Warnings:
    WARNING: "return_address" [vmlinux] is a static EXPORT_SYMBOL_GPL

--------------------------------------------------------------------------------
db1xxx_defconfig (mips, gcc-8) — PASS, 0 errors, 1 warning, 0 section mismatches

Warnings:
    sound/soc/soc-pcm.c:1207:8: warning: unused variable 'name' [-Wunused-variable]

--------------------------------------------------------------------------------
decstation_64_defconfig (mips, gcc-8) — PASS, 0 errors, 0 warnings, 0 section mismatches

--------------------------------------------------------------------------------
decstation_defconfig (mips, gcc-8) — PASS, 0 errors, 0 warnings, 0 section mismatches

Section mismatches:
    WARNING: vmlinux.o(.text.unlikely+0x3630): Section mismatch in reference from the function pmax_setup_memory_region() to the function .init.text:add_memory_region()

--------------------------------------------------------------------------------
decstation_r4k_defconfig (mips, gcc-8) — PASS, 0 errors, 0 warnings, 0 section mismatches

Section mismatches:
    WARNING: vmlinux.o(.text.unlikely+0x3320): Section mismatch in reference from the function pmax_setup_memory_region() to the function .init.text:add_memory_region()

--------------------------------------------------------------------------------
defconfig (riscv, gcc-8) — PASS, 0 errors, 0 warnings, 0 section mismatches

--------------------------------------------------------------------------------
defconfig (arm64, gcc-8) — PASS, 0 errors, 0 warnings, 0 section mismatches

--------------------------------------------------------------------------------
defconfig (arm64, clang-8) — PASS, 0 errors, 0 warnings, 0 section mismatches

--------------------------------------------------------------------------------
defconfig+CONFIG_CPU_BIG_ENDIAN=y (arm64, gcc-8) — PASS, 0 errors, 0 warnings, 0 section mismatches

--------------------------------------------------------------------------------
defconfig+CONFIG_RANDOMIZE_BASE=y (arm64, gcc-8) — PASS, 0 errors, 0 warnings, 0 section mismatches

--------------------------------------------------------------------------------
defconfig+kselftest (riscv, gcc-8) — PASS, 0 errors, 27 warnings, 0 section mismatches

Warnings:
    ./.tmp.config.iSnOR7bhNw:3042:warning: override: reassigning to symbol BPF_SYSCALL
    ./.tmp.config.iSnOR7bhNw:3045:warning: override: reassigning to symbol NET_VRF
    ./.tmp.config.iSnOR7bhNw:3046:warning: override: reassigning to symbol NET_L3_MASTER_DEV
    ./.tmp.config.iSnOR7bhNw:3048:warning: override: reassigning to symbol IPV6_MULTIPLE_TABLES
    ./.tmp.config.iSnOR7bhNw:3049:warning: override: reassigning to symbol VETH
    ./.tmp.config.iSnOR7bhNw:3053:warning: override: reassigning to symbol BRIDGE
    ./.tmp.config.iSnOR7bhNw:3054:warning: override: reassigning to symbol VLAN_8021Q
    ./.tmp.config.iSnOR7bhNw:3112:warning: override: reassigning to symbol NET_SCH_INGRESS
    ./.tmp.config.iSnOR7bhNw:3133:warning: override: reassigning to symbol NET_ACT_GACT
    ./.tmp.config.iSnOR7bhNw:3158:warning: override: reassigning to symbol USER_NS
    ./.tmp.config.iSnOR7bhNw:3162:warning: override: reassigning to symbol NET_NS
    ./.tmp.config.iSnOR7bhNw:3270:warning: override: reassigning to symbol USER_NS
    ./.tmp.config.iSnOR7bhNw:3281:warning: override: reassigning to symbol NOTIFIER_ERROR_INJECTION
    ./.tmp.config.iSnOR7bhNw:3291:warning: override: reassigning to symbol ANDROID
    ./.tmp.config.iSnOR7bhNw:3298:warning: override: reassigning to symbol BPF_SYSCALL
    ./.tmp.config.iSnOR7bhNw:3301:warning: override: reassigning to symbol TEST_BPF
    ./.tmp.config.iSnOR7bhNw:3302:warning: override: reassigning to symbol CGROUP_BPF
    ./.tmp.config.iSnOR7bhNw:3304:warning: override: reassigning to symbol NET_CLS_ACT
    ./.tmp.config.iSnOR7bhNw:3305:warning: override: reassigning to symbol NET_SCHED
    ./.tmp.config.iSnOR7bhNw:3306:warning: override: reassigning to symbol NET_SCH_INGRESS
    ./.tmp.config.iSnOR7bhNw:3308:warning: override: reassigning to symbol IPV6
    ./.tmp.config.iSnOR7bhNw:3317:warning: override: reassigning to symbol NET_CLS_FLOWER
    ./.tmp.config.iSnOR7bhNw:3323:warning: override: reassigning to symbol IPV6_GRE
    ./.tmp.config.iSnOR7bhNw:3343:warning: override: reassigning to symbol SECURITYFS
    ./.tmp.config.iSnOR7bhNw:3347:warning: override: reassigning to symbol STAGING
    ./.tmp.config.iSnOR7bhNw:3348:warning: override: reassigning to symbol ANDROID
    ./.tmp.config.iSnOR7bhNw:3365:warning: override: reassigning to symbol USER_NS

--------------------------------------------------------------------------------
defconfig+kselftest (arm64, gcc-8) — PASS, 0 errors, 27 warnings, 0 section mismatches

Warnings:
    ./.tmp.config.nmz1DceE9X:7630:warning: override: reassigning to symbol BPF_SYSCALL
    ./.tmp.config.nmz1DceE9X:7633:warning: override: reassigning to symbol NET_VRF
    ./.tmp.config.nmz1DceE9X:7634:warning: override: reassigning to symbol NET_L3_MASTER_DEV
    ./.tmp.config.nmz1DceE9X:7636:warning: override: reassigning to symbol IPV6_MULTIPLE_TABLES
    ./.tmp.config.nmz1DceE9X:7637:warning: override: reassigning to symbol VETH
    ./.tmp.config.nmz1DceE9X:7641:warning: override: reassigning to symbol BRIDGE
    ./.tmp.config.nmz1DceE9X:7642:warning: override: reassigning to symbol VLAN_8021Q
    ./.tmp.config.nmz1DceE9X:7700:warning: override: reassigning to symbol NET_SCH_INGRESS
    ./.tmp.config.nmz1DceE9X:7721:warning: override: reassigning to symbol NET_ACT_GACT
    ./.tmp.config.nmz1DceE9X:7746:warning: override: reassigning to symbol USER_NS
    ./.tmp.config.nmz1DceE9X:7750:warning: override: reassigning to symbol NET_NS
    ./.tmp.config.nmz1DceE9X:7858:warning: override: reassigning to symbol USER_NS
    ./.tmp.config.nmz1DceE9X:7869:warning: override: reassigning to symbol NOTIFIER_ERROR_INJECTION
    ./.tmp.config.nmz1DceE9X:7879:warning: override: reassigning to symbol ANDROID
    ./.tmp.config.nmz1DceE9X:7886:warning: override: reassigning to symbol BPF_SYSCALL
    ./.tmp.config.nmz1DceE9X:7889:warning: override: reassigning to symbol TEST_BPF
    ./.tmp.config.nmz1DceE9X:7890:warning: override: reassigning to symbol CGROUP_BPF
    ./.tmp.config.nmz1DceE9X:7892:warning: override: reassigning to symbol NET_CLS_ACT
    ./.tmp.config.nmz1DceE9X:7893:warning: override: reassigning to symbol NET_SCHED
    ./.tmp.config.nmz1DceE9X:7894:warning: override: reassigning to symbol NET_SCH_INGRESS
    ./.tmp.config.nmz1DceE9X:7896:warning: override: reassigning to symbol IPV6
    ./.tmp.config.nmz1DceE9X:7905:warning: override: reassigning to symbol NET_CLS_FLOWER
    ./.tmp.config.nmz1DceE9X:7911:warning: override: reassigning to symbol IPV6_GRE
    ./.tmp.config.nmz1DceE9X:7931:warning: override: reassigning to symbol SECURITYFS
    ./.tmp.config.nmz1DceE9X:7935:warning: override: reassigning to symbol STAGING
    ./.tmp.config.nmz1DceE9X:7936:warning: override: reassigning to symbol ANDROID
    ./.tmp.config.nmz1DceE9X:7953:warning: override: reassigning to symbol USER_NS

--------------------------------------------------------------------------------
dove_defconfig (arm, gcc-8) — PASS, 0 errors, 1 warning, 0 section mismatches

Warnings:
    WARNING: "return_address" [vmlinux] is a static EXPORT_SYMBOL_GPL

--------------------------------------------------------------------------------
e55_defconfig (mips, gcc-8) — PASS, 0 errors, 0 warnings, 0 section mismatches

--------------------------------------------------------------------------------
ebsa110_defconfig (arm, gcc-8) — PASS, 0 errors, 0 warnings, 0 section mismatches

--------------------------------------------------------------------------------
efm32_defconfig (arm, gcc-8) — PASS, 0 errors, 0 warnings, 0 section mismatches

--------------------------------------------------------------------------------
em_x270_defconfig (arm, gcc-8) — PASS, 0 errors, 1 warning, 0 section mismatches

Warnings:
    WARNING: "return_address" [vmlinux] is a static EXPORT_SYMBOL_GPL

--------------------------------------------------------------------------------
ep93xx_defconfig (arm, gcc-8) — PASS, 0 errors, 1 warning, 0 section mismatches

Warnings:
    WARNING: "return_address" [vmlinux] is a static EXPORT_SYMBOL_GPL

Section mismatches:
    WARNING: vmlinux.o(.text.unlikely+0x710): Section mismatch in reference from the function free_memmap() to the function .meminit.text:memblock_free()

--------------------------------------------------------------------------------
eseries_pxa_defconfig (arm, gcc-8) — PASS, 0 errors, 2 warnings, 0 section mismatches

Warnings:
    WARNING: "return_address" [vmlinux] is a static EXPORT_SYMBOL_GPL
    sound/soc/soc-pcm.c:1207:8: warning: unused variable 'name' [-Wunused-variable]

--------------------------------------------------------------------------------
exynos_defconfig (arm, gcc-8) — PASS, 0 errors, 171 warnings, 0 section mismatches

Warnings:
    WARNING: "return_address" [vmlinux] is a static EXPORT_SYMBOL_GPL
    depmod: WARNING: /home/buildslave/workspace/kernel-build/linux/build/_modules_/lib/modules/5.4.0-rc4-next-20191021/kernel/drivers/usb/storage/ums-alauda.ko needs unknown symbol usb_stor_Bulk_reset
    depmod: WARNING: /home/buildslave/workspace/kernel-build/linux/build/_modules_/lib/modules/5.4.0-rc4-next-20191021/kernel/drivers/usb/storage/ums-alauda.ko needs unknown symbol usb_stor_resume
    depmod: WARNING: /home/buildslave/workspace/kernel-build/linux/build/_modules_/lib/modules/5.4.0-rc4-next-20191021/kernel/drivers/usb/storage/ums-alauda.ko needs unknown symbol usb_stor_probe1
    depmod: WARNING: /home/buildslave/workspace/kernel-build/linux/build/_modules_/lib/modules/5.4.0-rc4-next-20191021/kernel/drivers/usb/storage/ums-alauda.ko needs unknown symbol usb_stor_suspend
    depmod: WARNING: /home/buildslave/workspace/kernel-build/linux/build/_modules_/lib/modules/5.4.0-rc4-next-20191021/kernel/drivers/usb/storage/ums-alauda.ko needs unknown symbol usb_stor_ctrl_transfer
    depmod: WARNING: /home/buildslave/workspace/kernel-build/linux/build/_modules_/lib/modules/5.4.0-rc4-next-20191021/kernel/drivers/usb/storage/ums-alauda.ko needs unknown symbol usb_stor_reset_resume
    depmod: WARNING: /home/buildslave/workspace/kernel-build/linux/build/_modules_/lib/modules/5.4.0-rc4-next-20191021/kernel/drivers/usb/storage/ums-alauda.ko needs unknown symbol usb_stor_pre_reset
    depmod: WARNING: /home/buildslave/workspace/kernel-build/linux/build/_modules_/lib/modules/5.4.0-rc4-next-20191021/kernel/drivers/usb/storage/ums-alauda.ko needs unknown symbol usb_stor_host_template_init
    depmod: WARNING: /home/buildslave/workspace/kernel-build/linux/build/_modules_/lib/modules/5.4.0-rc4-next-20191021/kernel/drivers/usb/storage/ums-alauda.ko needs unknown symbol fill_inquiry_response
    depmod: WARNING: /home/buildslave/workspace/kernel-build/linux/build/_modules_/lib/modules/5.4.0-rc4-next-20191021/kernel/drivers/usb/storage/ums-alauda.ko needs unknown symbol usb_stor_probe2
    depmod: WARNING: /home/buildslave/workspace/kernel-build/linux/build/_modules_/lib/modules/5.4.0-rc4-next-20191021/kernel/drivers/usb/storage/ums-alauda.ko needs unknown symbol usb_stor_disconnect
    depmod: WARNING: /home/buildslave/workspace/kernel-build/linux/build/_modules_/lib/modules/5.4.0-rc4-next-20191021/kernel/drivers/usb/storage/ums-alauda.ko needs unknown symbol usb_stor_post_reset
    depmod: WARNING: /home/buildslave/workspace/kernel-build/linux/build/_modules_/lib/modules/5.4.0-rc4-next-20191021/kernel/drivers/usb/storage/ums-alauda.ko needs unknown symbol usb_stor_access_xfer_buf
    depmod: WARNING: /home/buildslave/workspace/kernel-build/linux/build/_modules_/lib/modules/5.4.0-rc4-next-20191021/kernel/drivers/usb/storage/ums-alauda.ko needs unknown symbol usb_stor_bulk_transfer_buf
    depmod: WARNING: /home/buildslave/workspace/kernel-build/linux/build/_modules_/lib/modules/5.4.0-rc4-next-20191021/kernel/drivers/usb/storage/ums-alauda.ko needs unknown symbol usb_stor_set_xfer_buf
    depmod: WARNING: /home/buildslave/workspace/kernel-build/linux/build/_modules_/lib/modules/5.4.0-rc4-next-20191021/kernel/drivers/usb/storage/ums-cypress.ko needs unknown symbol usb_stor_resume
    depmod: WARNING: /home/buildslave/workspace/kernel-build/linux/build/_modules_/lib/modules/5.4.0-rc4-next-20191021/kernel/drivers/usb/storage/ums-cypress.ko needs unknown symbol usb_stor_probe1
    depmod: WARNING: /home/buildslave/workspace/kernel-build/linux/build/_modules_/lib/modules/5.4.0-rc4-next-20191021/kernel/drivers/usb/storage/ums-cypress.ko needs unknown symbol usb_stor_suspend
    depmod: WARNING: /home/buildslave/workspace/kernel-build/linux/build/_modules_/lib/modules/5.4.0-rc4-next-20191021/kernel/drivers/usb/storage/ums-cypress.ko needs unknown symbol usb_stor_reset_resume
    depmod: WARNING: /home/buildslave/workspace/kernel-build/linux/build/_modules_/lib/modules/5.4.0-rc4-next-20191021/kernel/drivers/usb/storage/ums-cypress.ko needs unknown symbol usb_stor_pre_reset
    depmod: WARNING: /home/buildslave/workspace/kernel-build/linux/build/_modules_/lib/modules/5.4.0-rc4-next-20191021/kernel/drivers/usb/storage/ums-cypress.ko needs unknown symbol usb_stor_host_template_init
    depmod: WARNING: /home/buildslave/workspace/kernel-build/linux/build/_modules_/lib/modules/5.4.0-rc4-next-20191021/kernel/drivers/usb/storage/ums-cypress.ko needs unknown symbol usb_stor_transparent_scsi_command
    depmod: WARNING: /home/buildslave/workspace/kernel-build/linux/build/_modules_/lib/modules/5.4.0-rc4-next-20191021/kernel/drivers/usb/storage/ums-cypress.ko needs unknown symbol usb_stor_probe2
    depmod: WARNING: /home/buildslave/workspace/kernel-build/linux/build/_modules_/lib/modules/5.4.0-rc4-next-20191021/kernel/drivers/usb/storage/ums-cypress.ko needs unknown symbol usb_stor_disconnect
    depmod: WARNING: /home/buildslave/workspace/kernel-build/linux/build/_modules_/lib/modules/5.4.0-rc4-next-20191021/kernel/drivers/usb/storage/ums-cypress.ko needs unknown symbol usb_stor_sense_invalidCDB
    depmod: WARNING: /home/buildslave/workspace/kernel-build/linux/build/_modules_/lib/modules/5.4.0-rc4-next-20191021/kernel/drivers/usb/storage/ums-cypress.ko needs unknown symbol usb_stor_post_reset
    depmod: WARNING: /home/buildslave/workspace/kernel-build/linux/build/_modules_/lib/modules/5.4.0-rc4-next-20191021/kernel/drivers/usb/storage/ums-datafab.ko needs unknown symbol usb_stor_Bulk_reset
    depmod: WARNING: /home/buildslave/workspace/kernel-build/linux/build/_modules_/lib/modules/5.4.0-rc4-next-20191021/kernel/drivers/usb/storage/ums-datafab.ko needs unknown symbol usb_stor_resume
    depmod: WARNING: /home/buildslave/workspace/kernel-build/linux/build/_modules_/lib/modules/5.4.0-rc4-next-20191021/kernel/drivers/usb/storage/ums-datafab.ko needs unknown symbol usb_stor_probe1
    depmod: WARNING: /home/buildslave/workspace/kernel-build/linux/build/_modules_/lib/modules/5.4.0-rc4-next-20191021/kernel/drivers/usb/storage/ums-datafab.ko needs unknown symbol usb_stor_suspend
    depmod: WARNING: /home/buildslave/workspace/kernel-build/linux/build/_modules_/lib/modules/5.4.0-rc4-next-20191021/kernel/drivers/usb/storage/ums-datafab.ko needs unknown symbol usb_stor_reset_resume
    depmod: WARNING: /home/buildslave/workspace/kernel-build/linux/build/_modules_/lib/modules/5.4.0-rc4-next-20191021/kernel/drivers/usb/storage/ums-datafab.ko needs unknown symbol usb_stor_pre_reset
    depmod: WARNING: /home/buildslave/workspace/kernel-build/linux/build/_modules_/lib/modules/5.4.0-rc4-next-20191021/kernel/drivers/usb/storage/ums-datafab.ko needs unknown symbol usb_stor_host_template_init
    depmod: WARNING: /home/buildslave/workspace/kernel-build/linux/build/_modules_/lib/modules/5.4.0-rc4-next-20191021/kernel/drivers/usb/storage/ums-datafab.ko needs unknown symbol fill_inquiry_response
    depmod: WARNING: /home/buildslave/workspace/kernel-build/linux/build/_modules_/lib/modules/5.4.0-rc4-next-20191021/kernel/drivers/usb/storage/ums-datafab.ko needs unknown symbol usb_stor_probe2
    depmod: WARNING: /home/buildslave/workspace/kernel-build/linux/build/_modules_/lib/modules/5.4.0-rc4-next-20191021/kernel/drivers/usb/storage/ums-datafab.ko needs unknown symbol usb_stor_disconnect
    depmod: WARNING: /home/buildslave/workspace/kernel-build/linux/build/_modules_/lib/modules/5.4.0-rc4-next-20191021/kernel/drivers/usb/storage/ums-datafab.ko needs unknown symbol usb_stor_post_reset
    depmod: WARNING: /home/buildslave/workspace/kernel-build/linux/build/_modules_/lib/modules/5.4.0-rc4-next-20191021/kernel/drivers/usb/storage/ums-datafab.ko needs unknown symbol usb_stor_access_xfer_buf
    depmod: WARNING: /home/buildslave/workspace/kernel-build/linux/build/_modules_/lib/modules/5.4.0-rc4-next-20191021/kernel/drivers/usb/storage/ums-datafab.ko needs unknown symbol usb_stor_bulk_transfer_buf
    depmod: WARNING: /home/buildslave/workspace/kernel-build/linux/build/_modules_/lib/modules/5.4.0-rc4-next-20191021/kernel/drivers/usb/storage/ums-datafab.ko needs unknown symbol usb_stor_set_xfer_buf
    depmod: WARNING: /home/buildslave/workspace/kernel-build/linux/build/_modules_/lib/modules/5.4.0-rc4-next-20191021/kernel/drivers/usb/storage/ums-eneub6250.ko needs unknown symbol usb_stor_bulk_srb
    depmod: WARNING: /home/buildslave/workspace/kernel-build/linux/build/_modules_/lib/modules/5.4.0-rc4-next-20191021/kernel/drivers/usb/storage/ums-eneub6250.ko needs unknown symbol usb_stor_bulk_transfer_sg
    depmod: WARNING: /home/buildslave/workspace/kernel-build/linux/build/_modules_/lib/modules/5.4.0-rc4-next-20191021/kernel/drivers/usb/storage/ums-eneub6250.ko needs unknown symbol usb_stor_probe1
    depmod: WARNING: /home/buildslave/workspace/kernel-build/linux/build/_modules_/lib/modules/5.4.0-rc4-next-20191021/kernel/drivers/usb/storage/ums-eneub6250.ko needs unknown symbol usb_stor_suspend
    depmod: WARNING: /home/buildslave/workspace/kernel-build/linux/build/_modules_/lib/modules/5.4.0-rc4-next-20191021/kernel/drivers/usb/storage/ums-eneub6250.ko needs unknown symbol usb_stor_reset_resume
    depmod: WARNING: /home/buildslave/workspace/kernel-build/linux/build/_modules_/lib/modules/5.4.0-rc4-next-20191021/kernel/drivers/usb/storage/ums-eneub6250.ko needs unknown symbol usb_stor_pre_reset
    depmod: WARNING: /home/buildslave/workspace/kernel-build/linux/build/_modules_/lib/modules/5.4.0-rc4-next-20191021/kernel/drivers/usb/storage/ums-eneub6250.ko needs unknown symbol usb_stor_host_template_init
    depmod: WARNING: /home/buildslave/workspace/kernel-build/linux/build/_modules_/lib/modules/5.4.0-rc4-next-20191021/kernel/drivers/usb/storage/ums-eneub6250.ko needs unknown symbol usb_stor_probe2
    depmod: WARNING: /home/buildslave/workspace/kernel-build/linux/build/_modules_/lib/modules/5.4.0-rc4-next-20191021/kernel/drivers/usb/storage/ums-eneub6250.ko needs unknown symbol usb_stor_disconnect
    depmod: WARNING: /home/buildslave/workspace/kernel-build/linux/build/_modules_/lib/modules/5.4.0-rc4-next-20191021/kernel/drivers/usb/storage/ums-eneub6250.ko needs unknown symbol usb_stor_post_reset
    depmod: WARNING: /home/buildslave/workspace/kernel-build/linux/build/_modules_/lib/modules/5.4.0-rc4-next-20191021/kernel/drivers/usb/storage/ums-eneub6250.ko needs unknown symbol usb_stor_access_xfer_buf
    depmod: WARNING: /home/buildslave/workspace/kernel-build/linux/build/_modules_/lib/modules/5.4.0-rc4-next-20191021/kernel/drivers/usb/storage/ums-eneub6250.ko needs unknown symbol usb_stor_bulk_transfer_buf
    depmod: WARNING: /home/buildslave/workspace/kernel-build/linux/build/_modules_/lib/modules/5.4.0-rc4-next-20191021/kernel/drivers/usb/storage/ums-eneub6250.ko needs unknown symbol usb_stor_set_xfer_buf
    depmod: WARNING: /home/buildslave/workspace/kernel-build/linux/build/_modules_/lib/modules/5.4.0-rc4-next-20191021/kernel/drivers/usb/storage/ums-freecom.ko needs unknown symbol usb_stor_bulk_srb
    depmod: WARNING: /home/buildslave/workspace/kernel-build/linux/build/_modules_/lib/modules/5.4.0-rc4-next-20191021/kernel/drivers/usb/storage/ums-freecom.ko needs unknown symbol usb_stor_resume
    depmod: WARNING: /home/buildslave/workspace/kernel-build/linux/build/_modules_/lib/modules/5.4.0-rc4-next-20191021/kernel/drivers/usb/storage/ums-freecom.ko needs unknown symbol usb_stor_probe1
    depmod: WARNING: /home/buildslave/workspace/kernel-build/linux/build/_modules_/lib/modules/5.4.0-rc4-next-20191021/kernel/drivers/usb/storage/ums-freecom.ko needs unknown symbol usb_stor_suspend
    depmod: WARNING: /home/buildslave/workspace/kernel-build/linux/build/_modules_/lib/modules/5.4.0-rc4-next-20191021/kernel/drivers/usb/storage/ums-freecom.ko needs unknown symbol usb_stor_reset_resume
    depmod: WARNING: /home/buildslave/workspace/kernel-build/linux/build/_modules_/lib/modules/5.4.0-rc4-next-20191021/kernel/drivers/usb/storage/ums-freecom.ko needs unknown symbol usb_stor_pre_reset
    depmod: WARNING: /home/buildslave/workspace/kernel-build/linux/build/_modules_/lib/modules/5.4.0-rc4-next-20191021/kernel/drivers/usb/storage/ums-freecom.ko needs unknown symbol usb_stor_host_template_init
    depmod: WARNING: /home/buildslave/workspace/kernel-build/linux/build/_modules_/lib/modules/5.4.0-rc4-next-20191021/kernel/drivers/usb/storage/ums-freecom.ko needs unknown symbol usb_stor_probe2
    depmod: WARNING: /home/buildslave/workspace/kernel-build/linux/build/_modules_/lib/modules/5.4.0-rc4-next-20191021/kernel/drivers/usb/storage/ums-freecom.ko needs unknown symbol usb_stor_disconnect
    depmod: WARNING: /home/buildslave/workspace/kernel-build/linux/build/_modules_/lib/modules/5.4.0-rc4-next-20191021/kernel/drivers/usb/storage/ums-freecom.ko needs unknown symbol usb_stor_control_msg
    depmod: WARNING: /home/buildslave/workspace/kernel-build/linux/build/_modules_/lib/modules/5.4.0-rc4-next-20191021/kernel/drivers/usb/storage/ums-freecom.ko needs unknown symbol usb_stor_post_reset
    depmod: WARNING: /home/buildslave/workspace/kernel-build/linux/build/_modules_/lib/modules/5.4.0-rc4-next-20191021/kernel/drivers/usb/storage/ums-freecom.ko needs unknown symbol usb_stor_bulk_transfer_buf
    depmod: WARNING: /home/buildslave/workspace/kernel-build/linux/build/_modules_/lib/modules/5.4.0-rc4-next-20191021/kernel/drivers/usb/storage/ums-isd200.ko needs unknown symbol usb_stor_resume
    depmod: WARNING: /home/buildslave/workspace/kernel-build/linux/build/_modules_/lib/modules/5.4.0-rc4-next-20191021/kernel/drivers/usb/storage/ums-isd200.ko needs unknown symbol usb_stor_probe1
    depmod: WARNING: /home/buildslave/workspace/kernel-build/linux/build/_modules_/lib/modules/5.4.0-rc4-next-20191021/kernel/drivers/usb/storage/ums-isd200.ko needs unknown symbol usb_stor_suspend
    depmod: WARNING: /home/buildslave/workspace/kernel-build/linux/build/_modules_/lib/modules/5.4.0-rc4-next-20191021/kernel/drivers/usb/storage/ums-isd200.ko needs unknown symbol usb_stor_ctrl_transfer
    depmod: WARNING: /home/buildslave/workspace/kernel-build/linux/build/_modules_/lib/modules/5.4.0-rc4-next-20191021/kernel/drivers/usb/storage/ums-isd200.ko needs unknown symbol usb_stor_reset_resume
    depmod: WARNING: /home/buildslave/workspace/kernel-build/linux/build/_modules_/lib/modules/5.4.0-rc4-next-20191021/kernel/drivers/usb/storage/ums-isd200.ko needs unknown symbol usb_stor_pre_reset
    depmod: WARNING: /home/buildslave/workspace/kernel-build/linux/build/_modules_/lib/modules/5.4.0-rc4-next-20191021/kernel/drivers/usb/storage/ums-isd200.ko needs unknown symbol usb_stor_host_template_init
    depmod: WARNING: /home/buildslave/workspace/kernel-build/linux/build/_modules_/lib/modules/5.4.0-rc4-next-20191021/kernel/drivers/usb/storage/ums-isd200.ko needs unknown symbol usb_stor_transparent_scsi_command
    depmod: WARNING: /home/buildslave/workspace/kernel-build/linux/build/_modules_/lib/modules/5.4.0-rc4-next-20191021/kernel/drivers/usb/storage/ums-isd200.ko needs unknown symbol usb_stor_probe2
    depmod: WARNING: /home/buildslave/workspace/kernel-build/linux/build/_modules_/lib/modules/5.4.0-rc4-next-20191021/kernel/drivers/usb/storage/ums-isd200.ko needs unknown symbol usb_stor_disconnect
    depmod: WARNING: /home/buildslave/workspace/kernel-build/linux/build/_modules_/lib/modules/5.4.0-rc4-next-20191021/kernel/drivers/usb/storage/ums-isd200.ko needs unknown symbol usb_stor_Bulk_transport
    depmod: WARNING: /home/buildslave/workspace/kernel-build/linux/build/_modules_/lib/modules/5.4.0-rc4-next-20191021/kernel/drivers/usb/storage/ums-isd200.ko needs unknown symbol usb_stor_post_reset
    depmod: WARNING: /home/buildslave/workspace/kernel-build/linux/build/_modules_/lib/modules/5.4.0-rc4-next-20191021/kernel/drivers/usb/storage/ums-isd200.ko needs unknown symbol usb_stor_set_xfer_buf
    depmod: WARNING: /home/buildslave/workspace/kernel-build/linux/build/_modules_/lib/modules/5.4.0-rc4-next-20191021/kernel/drivers/usb/storage/ums-jumpshot.ko needs unknown symbol usb_stor_Bulk_reset
    depmod: WARNING: /home/buildslave/workspace/kernel-build/linux/build/_modules_/lib/modules/5.4.0-rc4-next-20191021/kernel/drivers/usb/storage/ums-jumpshot.ko needs unknown symbol usb_stor_resume
    depmod: WARNING: /home/buildslave/workspace/kernel-build/linux/build/_modules_/lib/modules/5.4.0-rc4-next-20191021/kernel/drivers/usb/storage/ums-jumpshot.ko needs unknown symbol usb_stor_probe1
    depmod: WARNING: /home/buildslave/workspace/kernel-build/linux/build/_modules_/lib/modules/5.4.0-rc4-next-20191021/kernel/drivers/usb/storage/ums-jumpshot.ko needs unknown symbol usb_stor_suspend
    depmod: WARNING: /home/buildslave/workspace/kernel-build/linux/build/_modules_/lib/modules/5.4.0-rc4-next-20191021/kernel/drivers/usb/storage/ums-jumpshot.ko needs unknown symbol usb_stor_ctrl_transfer
    depmod: WARNING: /home/buildslave/workspace/kernel-build/linux/build/_modules_/lib/modules/5.4.0-rc4-next-20191021/kernel/drivers/usb/storage/ums-jumpshot.ko needs unknown symbol usb_stor_reset_resume
    depmod: WARNING: /home/buildslave/workspace/kernel-build/linux/build/_modules_/lib/modules/5.4.0-rc4-next-20191021/kernel/drivers/usb/storage/ums-jumpshot.ko needs unknown symbol usb_stor_pre_reset
    depmod: WARNING: /home/buildslave/workspace/kernel-build/linux/build/_modules_/lib/modules/5.4.0-rc4-next-20191021/kernel/drivers/usb/storage/ums-jumpshot.ko needs unknown symbol usb_stor_host_template_init
    depmod: WARNING: /home/buildslave/workspace/kernel-build/linux/build/_modules_/lib/modules/5.4.0-rc4-next-20191021/kernel/drivers/usb/storage/ums-jumpshot.ko needs unknown symbol fill_inquiry_response
    depmod: WARNING: /home/buildslave/workspace/kernel-build/linux/build/_modules_/lib/modules/5.4.0-rc4-next-20191021/kernel/drivers/usb/storage/ums-jumpshot.ko needs unknown symbol usb_stor_probe2
    depmod: WARNING: /home/buildslave/workspace/kernel-build/linux/build/_modules_/lib/modules/5.4.0-rc4-next-20191021/kernel/drivers/usb/storage/ums-jumpshot.ko needs unknown symbol usb_stor_disconnect
    depmod: WARNING: /home/buildslave/workspace/kernel-build/linux/build/_modules_/lib/modules/5.4.0-rc4-next-20191021/kernel/drivers/usb/storage/ums-jumpshot.ko needs unknown symbol usb_stor_post_reset
    depmod: WARNING: /home/buildslave/workspace/kernel-build/linux/build/_modules_/lib/modules/5.4.0-rc4-next-20191021/kernel/drivers/usb/storage/ums-jumpshot.ko needs unknown symbol usb_stor_access_xfer_buf
    depmod: WARNING: /home/buildslave/workspace/kernel-build/linux/build/_modules_/lib/modules/5.4.0-rc4-next-20191021/kernel/drivers/usb/storage/ums-jumpshot.ko needs unknown symbol usb_stor_bulk_transfer_buf
    depmod: WARNING: /home/buildslave/workspace/kernel-build/linux/build/_modules_/lib/modules/5.4.0-rc4-next-20191021/kernel/drivers/usb/storage/ums-jumpshot.ko needs unknown symbol usb_stor_set_xfer_buf
    depmod: WARNING: /home/buildslave/workspace/kernel-build/linux/build/_modules_/lib/modules/5.4.0-rc4-next-20191021/kernel/drivers/usb/storage/ums-karma.ko needs unknown symbol usb_stor_Bulk_reset
    depmod: WARNING: /home/buildslave/workspace/kernel-build/linux/build/_modules_/lib/modules/5.4.0-rc4-next-20191021/kernel/drivers/usb/storage/ums-karma.ko needs unknown symbol usb_stor_resume
    depmod: WARNING: /home/buildslave/workspace/kernel-build/linux/build/_modules_/lib/modules/5.4.0-rc4-next-20191021/kernel/drivers/usb/storage/ums-karma.ko needs unknown symbol usb_stor_probe1
    depmod: WARNING: /home/buildslave/workspace/kernel-build/linux/build/_modules_/lib/modules/5.4.0-rc4-next-20191021/kernel/drivers/usb/storage/ums-karma.ko needs unknown symbol usb_stor_suspend
    depmod: WARNING: /home/buildslave/workspace/kernel-build/linux/build/_modules_/lib/modules/5.4.0-rc4-next-20191021/kernel/drivers/usb/storage/ums-karma.ko needs unknown symbol usb_stor_reset_resume
    depmod: WARNING: /home/buildslave/workspace/kernel-build/linux/build/_modules_/lib/modules/5.4.0-rc4-next-20191021/kernel/drivers/usb/storage/ums-karma.ko needs unknown symbol usb_stor_pre_reset
    depmod: WARNING: /home/buildslave/workspace/kernel-build/linux/build/_modules_/lib/modules/5.4.0-rc4-next-20191021/kernel/drivers/usb/storage/ums-karma.ko needs unknown symbol usb_stor_host_template_init
    depmod: WARNING: /home/buildslave/workspace/kernel-build/linux/build/_modules_/lib/modules/5.4.0-rc4-next-20191021/kernel/drivers/usb/storage/ums-karma.ko needs unknown symbol usb_stor_probe2
    depmod: WARNING: /home/buildslave/workspace/kernel-build/linux/build/_modules_/lib/modules/5.4.0-rc4-next-20191021/kernel/drivers/usb/storage/ums-karma.ko needs unknown symbol usb_stor_disconnect
    depmod: WARNING: /home/buildslave/workspace/kernel-build/linux/build/_modules_/lib/modules/5.4.0-rc4-next-20191021/kernel/drivers/usb/storage/ums-karma.ko needs unknown symbol usb_stor_Bulk_transport
    depmod: WARNING: /home/buildslave/workspace/kernel-build/linux/build/_modules_/lib/modules/5.4.0-rc4-next-20191021/kernel/drivers/usb/storage/ums-karma.ko needs unknown symbol usb_stor_post_reset
    depmod: WARNING: /home/buildslave/workspace/kernel-build/linux/build/_modules_/lib/modules/5.4.0-rc4-next-20191021/kernel/drivers/usb/storage/ums-karma.ko needs unknown symbol usb_stor_bulk_transfer_buf
    depmod: WARNING: /home/buildslave/workspace/kernel-build/linux/build/_modules_/lib/modules/5.4.0-rc4-next-20191021/kernel/drivers/usb/storage/ums-onetouch.ko needs unknown symbol usb_stor_resume
    depmod: WARNING: /home/buildslave/workspace/kernel-build/linux/build/_modules_/lib/modules/5.4.0-rc4-next-20191021/kernel/drivers/usb/storage/ums-onetouch.ko needs unknown symbol usb_stor_probe1
    depmod: WARNING: /home/buildslave/workspace/kernel-build/linux/build/_modules_/lib/modules/5.4.0-rc4-next-20191021/kernel/drivers/usb/storage/ums-onetouch.ko needs unknown symbol usb_stor_suspend
    depmod: WARNING: /home/buildslave/workspace/kernel-build/linux/build/_modules_/lib/modules/5.4.0-rc4-next-20191021/kernel/drivers/usb/storage/ums-onetouch.ko needs unknown symbol usb_stor_reset_resume
    depmod: WARNING: /home/buildslave/workspace/kernel-build/linux/build/_modules_/lib/modules/5.4.0-rc4-next-20191021/kernel/drivers/usb/storage/ums-onetouch.ko needs unknown symbol usb_stor_pre_reset
    depmod: WARNING: /home/buildslave/workspace/kernel-build/linux/build/_modules_/lib/modules/5.4.0-rc4-next-20191021/kernel/drivers/usb/storage/ums-onetouch.ko needs unknown symbol usb_stor_host_template_init
    depmod: WARNING: /home/buildslave/workspace/kernel-build/linux/build/_modules_/lib/modules/5.4.0-rc4-next-20191021/kernel/drivers/usb/storage/ums-onetouch.ko needs unknown symbol usb_stor_probe2
    depmod: WARNING: /home/buildslave/workspace/kernel-build/linux/build/_modules_/lib/modules/5.4.0-rc4-next-20191021/kernel/drivers/usb/storage/ums-onetouch.ko needs unknown symbol usb_stor_disconnect
    depmod: WARNING: /home/buildslave/workspace/kernel-build/linux/build/_modules_/lib/modules/5.4.0-rc4-next-20191021/kernel/drivers/usb/storage/ums-onetouch.ko needs unknown symbol usb_stor_post_reset
    depmod: WARNING: /home/buildslave/workspace/kernel-build/linux/build/_modules_/lib/modules/5.4.0-rc4-next-20191021/kernel/drivers/usb/storage/ums-realtek.ko needs unknown symbol usb_stor_probe1
    depmod: WARNING: /home/buildslave/workspace/kernel-build/linux/build/_modules_/lib/modules/5.4.0-rc4-next-20191021/kernel/drivers/usb/storage/ums-realtek.ko needs unknown symbol usb_stor_reset_resume
    depmod: WARNING: /home/buildslave/workspace/kernel-build/linux/build/_modules_/lib/modules/5.4.0-rc4-next-20191021/kernel/drivers/usb/storage/ums-realtek.ko needs unknown symbol usb_stor_pre_reset
    depmod: WARNING: /home/buildslave/workspace/kernel-build/linux/build/_modules_/lib/modules/5.4.0-rc4-next-20191021/kernel/drivers/usb/storage/ums-realtek.ko needs unknown symbol usb_stor_host_template_init
    depmod: WARNING: /home/buildslave/workspace/kernel-build/linux/build/_modules_/lib/modules/5.4.0-rc4-next-20191021/kernel/drivers/usb/storage/ums-realtek.ko needs unknown symbol usb_stor_probe2
    depmod: WARNING: /home/buildslave/workspace/kernel-build/linux/build/_modules_/lib/modules/5.4.0-rc4-next-20191021/kernel/drivers/usb/storage/ums-realtek.ko needs unknown symbol usb_stor_disconnect
    depmod: WARNING: /home/buildslave/workspace/kernel-build/linux/build/_modules_/lib/modules/5.4.0-rc4-next-20191021/kernel/drivers/usb/storage/ums-realtek.ko needs unknown symbol usb_stor_control_msg
    depmod: WARNING: /home/buildslave/workspace/kernel-build/linux/build/_modules_/lib/modules/5.4.0-rc4-next-20191021/kernel/drivers/usb/storage/ums-realtek.ko needs unknown symbol usb_stor_post_reset
    depmod: WARNING: /home/buildslave/workspace/kernel-build/linux/build/_modules_/lib/modules/5.4.0-rc4-next-20191021/kernel/drivers/usb/storage/ums-realtek.ko needs unknown symbol usb_stor_bulk_transfer_buf
    depmod: WARNING: /home/buildslave/workspace/kernel-build/linux/build/_modules_/lib/modules/5.4.0-rc4-next-20191021/kernel/drivers/usb/storage/ums-sddr09.ko needs unknown symbol usb_stor_bulk_srb
    depmod: WARNING: /home/buildslave/workspace/kernel-build/linux/build/_modules_/lib/modules/5.4.0-rc4-next-20191021/kernel/drivers/usb/storage/ums-sddr09.ko needs unknown symbol usb_stor_bulk_transfer_sg
    depmod: WARNING: /home/buildslave/workspace/kernel-build/linux/build/_modules_/lib/modules/5.4.0-rc4-next-20191021/kernel/drivers/usb/storage/ums-sddr09.ko needs unknown symbol usb_stor_CB_transport
    depmod: WARNING: /home/buildslave/workspace/kernel-build/linux/build/_modules_/lib/modules/5.4.0-rc4-next-20191021/kernel/drivers/usb/storage/ums-sddr09.ko needs unknown symbol usb_stor_resume
    depmod: WARNING: /home/buildslave/workspace/kernel-build/linux/build/_modules_/lib/modules/5.4.0-rc4-next-20191021/kernel/drivers/usb/storage/ums-sddr09.ko needs unknown symbol usb_stor_probe1
    depmod: WARNING: /home/buildslave/workspace/kernel-build/linux/build/_modules_/lib/modules/5.4.0-rc4-next-20191021/kernel/drivers/usb/storage/ums-sddr09.ko needs unknown symbol usb_stor_CB_reset
    depmod: WARNING: /home/buildslave/workspace/kernel-build/linux/build/_modules_/lib/modules/5.4.0-rc4-next-20191021/kernel/drivers/usb/storage/ums-sddr09.ko needs unknown symbol usb_stor_suspend
    depmod: WARNING: /home/buildslave/workspace/kernel-build/linux/build/_modules_/lib/modules/5.4.0-rc4-next-20191021/kernel/drivers/usb/storage/ums-sddr09.ko needs unknown symbol usb_stor_ctrl_transfer
    depmod: WARNING: /home/buildslave/workspace/kernel-build/linux/build/_modules_/lib/modules/5.4.0-rc4-next-20191021/kernel/drivers/usb/storage/ums-sddr09.ko needs unknown symbol usb_stor_reset_resume
    depmod: WARNING: /home/buildslave/workspace/kernel-build/linux/build/_modules_/lib/modules/5.4.0-rc4-next-20191021/kernel/drivers/usb/storage/ums-sddr09.ko needs unknown symbol usb_stor_pre_reset
    depmod: WARNING: /home/buildslave/workspace/kernel-build/linux/build/_modules_/lib/modules/5.4.0-rc4-next-20191021/kernel/drivers/usb/storage/ums-sddr09.ko needs unknown symbol usb_stor_host_template_init
    depmod: WARNING: /home/buildslave/workspace/kernel-build/linux/build/_modules_/lib/modules/5.4.0-rc4-next-20191021/kernel/drivers/usb/storage/ums-sddr09.ko needs unknown symbol fill_inquiry_response
    depmod: WARNING: /home/buildslave/workspace/kernel-build/linux/build/_modules_/lib/modules/5.4.0-rc4-next-20191021/kernel/drivers/usb/storage/ums-sddr09.ko needs unknown symbol usb_stor_probe2
    depmod: WARNING: /home/buildslave/workspace/kernel-build/linux/build/_modules_/lib/modules/5.4.0-rc4-next-20191021/kernel/drivers/usb/storage/ums-sddr09.ko needs unknown symbol usb_stor_disconnect
    depmod: WARNING: /home/buildslave/workspace/kernel-build/linux/build/_modules_/lib/modules/5.4.0-rc4-next-20191021/kernel/drivers/usb/storage/ums-sddr09.ko needs unknown symbol usb_stor_post_reset
    depmod: WARNING: /home/buildslave/workspace/kernel-build/linux/build/_modules_/lib/modules/5.4.0-rc4-next-20191021/kernel/drivers/usb/storage/ums-sddr09.ko needs unknown symbol usb_stor_access_xfer_buf
    depmod: WARNING: /home/buildslave/workspace/kernel-build/linux/build/_modules_/lib/modules/5.4.0-rc4-next-20191021/kernel/drivers/usb/storage/ums-sddr09.ko needs unknown symbol usb_stor_bulk_transfer_buf
    depmod: WARNING: /home/buildslave/workspace/kernel-build/linux/build/_modules_/lib/modules/5.4.0-rc4-next-20191021/kernel/drivers/usb/storage/ums-sddr09.ko needs unknown symbol usb_stor_set_xfer_buf
    depmod: WARNING: /home/buildslave/workspace/kernel-build/linux/build/_modules_/lib/modules/5.4.0-rc4-next-20191021/kernel/drivers/usb/storage/ums-sddr55.ko needs unknown symbol usb_stor_resume
    depmod: WARNING: /home/buildslave/workspace/kernel-build/linux/build/_modules_/lib/modules/5.4.0-rc4-next-20191021/kernel/drivers/usb/storage/ums-sddr55.ko needs unknown symbol usb_stor_probe1
    depmod: WARNING: /home/buildslave/workspace/kernel-build/linux/build/_modules_/lib/modules/5.4.0-rc4-next-20191021/kernel/drivers/usb/storage/ums-sddr55.ko needs unknown symbol usb_stor_suspend
    depmod: WARNING: /home/buildslave/workspace/kernel-build/linux/build/_modules_/lib/modules/5.4.0-rc4-next-20191021/kernel/drivers/usb/storage/ums-sddr55.ko needs unknown symbol usb_stor_reset_resume
    depmod: WARNING: /home/buildslave/workspace/kernel-build/linux/build/_modules_/lib/modules/5.4.0-rc4-next-20191021/kernel/drivers/usb/storage/ums-sddr55.ko needs unknown symbol usb_stor_pre_reset
    depmod: WARNING: /home/buildslave/workspace/kernel-build/linux/build/_modules_/lib/modules/5.4.0-rc4-next-20191021/kernel/drivers/usb/storage/ums-sddr55.ko needs unknown symbol usb_stor_host_template_init
    depmod: WARNING: /home/buildslave/workspace/kernel-build/linux/build/_modules_/lib/modules/5.4.0-rc4-next-20191021/kernel/drivers/usb/storage/ums-sddr55.ko needs unknown symbol fill_inquiry_response
    depmod: WARNING: /home/buildslave/workspace/kernel-build/linux/build/_modules_/lib/modules/5.4.0-rc4-next-20191021/kernel/drivers/usb/storage/ums-sddr55.ko needs unknown symbol usb_stor_probe2
    depmod: WARNING: /home/buildslave/workspace/kernel-build/linux/build/_modules_/lib/modules/5.4.0-rc4-next-20191021/kernel/drivers/usb/storage/ums-sddr55.ko needs unknown symbol usb_stor_disconnect
    depmod: WARNING: /home/buildslave/workspace/kernel-build/linux/build/_modules_/lib/modules/5.4.0-rc4-next-20191021/kernel/drivers/usb/storage/ums-sddr55.ko needs unknown symbol usb_stor_post_reset
    depmod: WARNING: /home/buildslave/workspace/kernel-build/linux/build/_modules_/lib/modules/5.4.0-rc4-next-20191021/kernel/drivers/usb/storage/ums-sddr55.ko needs unknown symbol usb_stor_access_xfer_buf
    depmod: WARNING: /home/buildslave/workspace/kernel-build/linux/build/_modules_/lib/modules/5.4.0-rc4-next-20191021/kernel/drivers/usb/storage/ums-sddr55.ko needs unknown symbol usb_stor_bulk_transfer_buf
    depmod: WARNING: /home/buildslave/workspace/kernel-build/linux/build/_modules_/lib/modules/5.4.0-rc4-next-20191021/kernel/drivers/usb/storage/ums-sddr55.ko needs unknown symbol usb_stor_set_xfer_buf
    depmod: WARNING: /home/buildslave/workspace/kernel-build/linux/build/_modules_/lib/modules/5.4.0-rc4-next-20191021/kernel/drivers/usb/storage/ums-usbat.ko needs unknown symbol usb_stor_bulk_transfer_sg
    depmod: WARNING: /home/buildslave/workspace/kernel-build/linux/build/_modules_/lib/modules/5.4.0-rc4-next-20191021/kernel/drivers/usb/storage/ums-usbat.ko needs unknown symbol usb_stor_resume
    depmod: WARNING: /home/buildslave/workspace/kernel-build/linux/build/_modules_/lib/modules/5.4.0-rc4-next-20191021/kernel/drivers/usb/storage/ums-usbat.ko needs unknown symbol usb_stor_probe1
    depmod: WARNING: /home/buildslave/workspace/kernel-build/linux/build/_modules_/lib/modules/5.4.0-rc4-next-20191021/kernel/drivers/usb/storage/ums-usbat.ko needs unknown symbol usb_stor_clear_halt
    depmod: WARNING: /home/buildslave/workspace/kernel-build/linux/build/_modules_/lib/modules/5.4.0-rc4-next-20191021/kernel/drivers/usb/storage/ums-usbat.ko needs unknown symbol usb_stor_CB_reset
    depmod: WARNING: /home/buildslave/workspace/kernel-build/linux/build/_modules_/lib/modules/5.4.0-rc4-next-20191021/kernel/drivers/usb/storage/ums-usbat.ko needs unknown symbol usb_stor_suspend
    depmod: WARNING: /home/buildslave/workspace/kernel-build/linux/build/_modules_/lib/modules/5.4.0-rc4-next-20191021/kernel/drivers/usb/storage/ums-usbat.ko needs unknown symbol usb_stor_ctrl_transfer
    depmod: WARNING: /home/buildslave/workspace/kernel-build/linux/build/_modules_/lib/modules/5.4.0-rc4-next-20191021/kernel/drivers/usb/storage/ums-usbat.ko needs unknown symbol usb_stor_reset_resume
    depmod: WARNING: /home/buildslave/workspace/kernel-build/linux/build/_modules_/lib/modules/5.4.0-rc4-next-20191021/kernel/drivers/usb/storage/ums-usbat.ko needs unknown symbol usb_stor_pre_reset
    depmod: WARNING: /home/buildslave/workspace/kernel-build/linux/build/_modules_/lib/modules/5.4.0-rc4-next-20191021/kernel/drivers/usb/storage/ums-usbat.ko needs unknown symbol usb_stor_host_template_init
    depmod: WARNING: /home/buildslave/workspace/kernel-build/linux/build/_modules_/lib/modules/5.4.0-rc4-next-20191021/kernel/drivers/usb/storage/ums-usbat.ko needs unknown symbol fill_inquiry_response
    depmod: WARNING: /home/buildslave/workspace/kernel-build/linux/build/_modules_/lib/modules/5.4.0-rc4-next-20191021/kernel/drivers/usb/storage/ums-usbat.ko needs unknown symbol usb_stor_probe2
    depmod: WARNING: /home/buildslave/workspace/kernel-build/linux/build/_modules_/lib/modules/5.4.0-rc4-next-20191021/kernel/drivers/usb/storage/ums-usbat.ko needs unknown symbol usb_stor_disconnect
    depmod: WARNING: /home/buildslave/workspace/kernel-build/linux/build/_modules_/lib/modules/5.4.0-rc4-next-20191021/kernel/drivers/usb/storage/ums-usbat.ko needs unknown symbol usb_stor_post_reset
    depmod: WARNING: /home/buildslave/workspace/kernel-build/linux/build/_modules_/lib/modules/5.4.0-rc4-next-20191021/kernel/drivers/usb/storage/ums-usbat.ko needs unknown symbol usb_stor_access_xfer_buf
    depmod: WARNING: /home/buildslave/workspace/kernel-build/linux/build/_modules_/lib/modules/5.4.0-rc4-next-20191021/kernel/drivers/usb/storage/ums-usbat.ko needs unknown symbol usb_stor_set_xfer_buf

--------------------------------------------------------------------------------
ezx_defconfig (arm, gcc-8) — PASS, 0 errors, 1 warning, 0 section mismatches

Warnings:
    WARNING: "return_address" [vmlinux] is a static EXPORT_SYMBOL_GPL

--------------------------------------------------------------------------------
footbridge_defconfig (arm, gcc-8) — PASS, 0 errors, 0 warnings, 0 section mismatches

--------------------------------------------------------------------------------
fuloong2e_defconfig (mips, gcc-8) — PASS, 0 errors, 0 warnings, 0 section mismatches

--------------------------------------------------------------------------------
gcw0_defconfig (mips, gcc-8) — PASS, 0 errors, 0 warnings, 0 section mismatches

--------------------------------------------------------------------------------
gemini_defconfig (arm, gcc-8) — PASS, 0 errors, 0 warnings, 0 section mismatches

--------------------------------------------------------------------------------
gpr_defconfig (mips, gcc-8) — PASS, 0 errors, 0 warnings, 0 section mismatches

--------------------------------------------------------------------------------
h3600_defconfig (arm, gcc-8) — PASS, 0 errors, 0 warnings, 0 section mismatches

Section mismatches:
    WARNING: vmlinux.o(.text.unlikely+0x840): Section mismatch in reference from the function free_memmap() to the function .meminit.text:memblock_free()

--------------------------------------------------------------------------------
h5000_defconfig (arm, gcc-8) — PASS, 0 errors, 1 warning, 0 section mismatches

Warnings:
    WARNING: "return_address" [vmlinux] is a static EXPORT_SYMBOL_GPL

--------------------------------------------------------------------------------
hackkit_defconfig (arm, gcc-8) — PASS, 0 errors, 0 warnings, 0 section mismatches

Section mismatches:
    WARNING: vmlinux.o(.text.unlikely+0x8c4): Section mismatch in reference from the function free_memmap() to the function .meminit.text:memblock_free()

--------------------------------------------------------------------------------
haps_hs_defconfig (arc, gcc-8) — PASS, 0 errors, 2 warnings, 0 section mismatches

Warnings:
    <stdin>:1511:2: warning: #warning syscall clone3 not implemented [-Wcpp]
    <stdin>:1511:2: warning: #warning syscall clone3 not implemented [-Wcpp]

--------------------------------------------------------------------------------
haps_hs_smp_defconfig (arc, gcc-8) — PASS, 0 errors, 2 warnings, 0 section mismatches

Warnings:
    <stdin>:1511:2: warning: #warning syscall clone3 not implemented [-Wcpp]
    <stdin>:1511:2: warning: #warning syscall clone3 not implemented [-Wcpp]

--------------------------------------------------------------------------------
hisi_defconfig (arm, gcc-8) — PASS, 0 errors, 0 warnings, 0 section mismatches

--------------------------------------------------------------------------------
hsdk_defconfig (arc, gcc-8) — PASS, 0 errors, 2 warnings, 0 section mismatches

Warnings:
    <stdin>:1511:2: warning: #warning syscall clone3 not implemented [-Wcpp]
    <stdin>:1511:2: warning: #warning syscall clone3 not implemented [-Wcpp]

--------------------------------------------------------------------------------
i386_defconfig (i386, gcc-8) — PASS, 0 errors, 0 warnings, 0 section mismatches

--------------------------------------------------------------------------------
i386_defconfig+kselftest (i386, gcc-8) — PASS, 0 errors, 28 warnings, 0 section mismatches

Warnings:
    ./.tmp.config.Q89c87CZ76:4503:warning: override: reassigning to symbol BPF_SYSCALL
    ./.tmp.config.Q89c87CZ76:4506:warning: override: reassigning to symbol NET_VRF
    ./.tmp.config.Q89c87CZ76:4507:warning: override: reassigning to symbol NET_L3_MASTER_DEV
    ./.tmp.config.Q89c87CZ76:4509:warning: override: reassigning to symbol IPV6_MULTIPLE_TABLES
    ./.tmp.config.Q89c87CZ76:4510:warning: override: reassigning to symbol VETH
    ./.tmp.config.Q89c87CZ76:4514:warning: override: reassigning to symbol BRIDGE
    ./.tmp.config.Q89c87CZ76:4515:warning: override: reassigning to symbol VLAN_8021Q
    ./.tmp.config.Q89c87CZ76:4573:warning: override: reassigning to symbol NET_SCH_INGRESS
    ./.tmp.config.Q89c87CZ76:4594:warning: override: reassigning to symbol NET_ACT_GACT
    ./.tmp.config.Q89c87CZ76:4619:warning: override: reassigning to symbol USER_NS
    ./.tmp.config.Q89c87CZ76:4623:warning: override: reassigning to symbol NET_NS
    ./.tmp.config.Q89c87CZ76:4731:warning: override: reassigning to symbol USER_NS
    ./.tmp.config.Q89c87CZ76:4742:warning: override: reassigning to symbol NOTIFIER_ERROR_INJECTION
    ./.tmp.config.Q89c87CZ76:4752:warning: override: reassigning to symbol ANDROID
    ./.tmp.config.Q89c87CZ76:4759:warning: override: reassigning to symbol BPF_SYSCALL
    ./.tmp.config.Q89c87CZ76:4762:warning: override: reassigning to symbol TEST_BPF
    ./.tmp.config.Q89c87CZ76:4763:warning: override: reassigning to symbol CGROUP_BPF
    ./.tmp.config.Q89c87CZ76:4765:warning: override: reassigning to symbol NET_CLS_ACT
    ./.tmp.config.Q89c87CZ76:4766:warning: override: reassigning to symbol NET_SCHED
    ./.tmp.config.Q89c87CZ76:4767:warning: override: reassigning to symbol NET_SCH_INGRESS
    ./.tmp.config.Q89c87CZ76:4769:warning: override: reassigning to symbol IPV6
    ./.tmp.config.Q89c87CZ76:4778:warning: override: reassigning to symbol NET_CLS_FLOWER
    ./.tmp.config.Q89c87CZ76:4784:warning: override: reassigning to symbol IPV6_GRE
    ./.tmp.config.Q89c87CZ76:4804:warning: override: reassigning to symbol SECURITYFS
    ./.tmp.config.Q89c87CZ76:4808:warning: override: reassigning to symbol STAGING
    ./.tmp.config.Q89c87CZ76:4809:warning: override: reassigning to symbol ANDROID
    ./.tmp.config.Q89c87CZ76:4826:warning: override: reassigning to symbol USER_NS
    include/linux/kern_levels.h:5:18: warning: format '%lu' expects argument of type 'long unsigned int', but argument 8 has type 'unsigned int' [-Wformat=]

--------------------------------------------------------------------------------
imote2_defconfig (arm, gcc-8) — PASS, 0 errors, 1 warning, 0 section mismatches

Warnings:
    WARNING: "return_address" [vmlinux] is a static EXPORT_SYMBOL_GPL

--------------------------------------------------------------------------------
imx_v4_v5_defconfig (arm, gcc-8) — PASS, 0 errors, 1 warning, 0 section mismatches

Warnings:
    WARNING: "return_address" [vmlinux] is a static EXPORT_SYMBOL_GPL

--------------------------------------------------------------------------------
imx_v6_v7_defconfig (arm, gcc-8) — PASS, 0 errors, 1 warning, 0 section mismatches

Warnings:
    WARNING: "return_address" [vmlinux] is a static EXPORT_SYMBOL_GPL

--------------------------------------------------------------------------------
integrator_defconfig (arm, gcc-8) — PASS, 0 errors, 1 warning, 0 section mismatches

Warnings:
    WARNING: "return_address" [vmlinux] is a static EXPORT_SYMBOL_GPL

--------------------------------------------------------------------------------
iop32x_defconfig (arm, gcc-8) — PASS, 0 errors, 0 warnings, 0 section mismatches

--------------------------------------------------------------------------------
ip22_defconfig (mips, gcc-8) — PASS, 0 errors, 0 warnings, 0 section mismatches

--------------------------------------------------------------------------------
ip27_defconfig (mips, gcc-8) — PASS, 0 errors, 0 warnings, 0 section mismatches

--------------------------------------------------------------------------------
ip28_defconfig (mips, gcc-8) — PASS, 0 errors, 0 warnings, 0 section mismatches

--------------------------------------------------------------------------------
ip32_defconfig (mips, gcc-8) — PASS, 0 errors, 0 warnings, 0 section mismatches

--------------------------------------------------------------------------------
ixp4xx_defconfig (arm, gcc-8) — PASS, 0 errors, 1 warning, 0 section mismatches

Warnings:
    WARNING: "return_address" [vmlinux] is a static EXPORT_SYMBOL_GPL

--------------------------------------------------------------------------------
jazz_defconfig (mips, gcc-8) — PASS, 0 errors, 0 warnings, 0 section mismatches

--------------------------------------------------------------------------------
jmr3927_defconfig (mips, gcc-8) — PASS, 0 errors, 0 warnings, 0 section mismatches

--------------------------------------------------------------------------------
jornada720_defconfig (arm, gcc-8) — PASS, 0 errors, 0 warnings, 0 section mismatches

Section mismatches:
    WARNING: vmlinux.o(.text.unlikely+0x7c8): Section mismatch in reference from the function free_memmap() to the function .meminit.text:memblock_free()

--------------------------------------------------------------------------------
keystone_defconfig (arm, gcc-8) — PASS, 0 errors, 1 warning, 0 section mismatches

Warnings:
    WARNING: "return_address" [vmlinux] is a static EXPORT_SYMBOL_GPL

--------------------------------------------------------------------------------
lart_defconfig (arm, gcc-8) — PASS, 0 errors, 0 warnings, 0 section mismatches

Section mismatches:
    WARNING: vmlinux.o(.text.unlikely+0x8c4): Section mismatch in reference from the function free_memmap() to the function .meminit.text:memblock_free()

--------------------------------------------------------------------------------
lasat_defconfig (mips, gcc-8) — PASS, 0 errors, 0 warnings, 0 section mismatches

--------------------------------------------------------------------------------
lemote2f_defconfig (mips, gcc-8) — PASS, 0 errors, 0 warnings, 0 section mismatches

--------------------------------------------------------------------------------
loongson1b_defconfig (mips, gcc-8) — PASS, 0 errors, 0 warnings, 0 section mismatches

--------------------------------------------------------------------------------
loongson1c_defconfig (mips, gcc-8) — PASS, 0 errors, 0 warnings, 0 section mismatches

--------------------------------------------------------------------------------
loongson3_defconfig (mips, gcc-8) — PASS, 0 errors, 0 warnings, 0 section mismatches

--------------------------------------------------------------------------------
lpc18xx_defconfig (arm, gcc-8) — PASS, 0 errors, 0 warnings, 0 section mismatches

--------------------------------------------------------------------------------
lpc32xx_defconfig (arm, gcc-8) — PASS, 0 errors, 1 warning, 0 section mismatches

Warnings:
    WARNING: "return_address" [vmlinux] is a static EXPORT_SYMBOL_GPL

--------------------------------------------------------------------------------
lpd270_defconfig (arm, gcc-8) — PASS, 0 errors, 0 warnings, 0 section mismatches

--------------------------------------------------------------------------------
lubbock_defconfig (arm, gcc-8) — PASS, 0 errors, 0 warnings, 0 section mismatches

--------------------------------------------------------------------------------
magician_defconfig (arm, gcc-8) — PASS, 0 errors, 2 warnings, 0 section mismatches

Warnings:
    WARNING: "return_address" [vmlinux] is a static EXPORT_SYMBOL_GPL
    sound/soc/soc-pcm.c:1207:8: warning: unused variable 'name' [-Wunused-variable]

--------------------------------------------------------------------------------
mainstone_defconfig (arm, gcc-8) — PASS, 0 errors, 0 warnings, 0 section mismatches

--------------------------------------------------------------------------------
malta_defconfig (mips, gcc-8) — PASS, 0 errors, 0 warnings, 0 section mismatches

--------------------------------------------------------------------------------
malta_kvm_defconfig (mips, gcc-8) — PASS, 0 errors, 0 warnings, 0 section mismatches

--------------------------------------------------------------------------------
malta_kvm_guest_defconfig (mips, gcc-8) — PASS, 0 errors, 0 warnings, 0 section mismatches

--------------------------------------------------------------------------------
malta_qemu_32r6_defconfig (mips, gcc-8) — PASS, 0 errors, 1 warning, 0 section mismatches

Warnings:
    {standard input}:134: Warning: macro instruction expanded into multiple instructions

--------------------------------------------------------------------------------
maltaaprp_defconfig (mips, gcc-8) — PASS, 0 errors, 0 warnings, 0 section mismatches

--------------------------------------------------------------------------------
maltasmvp_defconfig (mips, gcc-8) — PASS, 0 errors, 0 warnings, 0 section mismatches

--------------------------------------------------------------------------------
maltasmvp_eva_defconfig (mips, gcc-8) — PASS, 0 errors, 0 warnings, 0 section mismatches

--------------------------------------------------------------------------------
maltaup_defconfig (mips, gcc-8) — PASS, 0 errors, 0 warnings, 0 section mismatches

--------------------------------------------------------------------------------
maltaup_xpa_defconfig (mips, gcc-8) — PASS, 0 errors, 0 warnings, 0 section mismatches

--------------------------------------------------------------------------------
markeins_defconfig (mips, gcc-8) — PASS, 0 errors, 0 warnings, 0 section mismatches

--------------------------------------------------------------------------------
milbeaut_m10v_defconfig (arm, gcc-8) — PASS, 0 errors, 1 warning, 0 section mismatches

Warnings:
    WARNING: "return_address" [vmlinux] is a static EXPORT_SYMBOL_GPL

--------------------------------------------------------------------------------
mini2440_defconfig (arm, gcc-8) — PASS, 0 errors, 1 warning, 0 section mismatches

Warnings:
    WARNING: "return_address" [vmlinux] is a static EXPORT_SYMBOL_GPL

--------------------------------------------------------------------------------
mips_paravirt_defconfig (mips, gcc-8) — PASS, 0 errors, 0 warnings, 0 section mismatches

--------------------------------------------------------------------------------
mmp2_defconfig (arm, gcc-8) — PASS, 0 errors, 1 warning, 0 section mismatches

Warnings:
    WARNING: "return_address" [vmlinux] is a static EXPORT_SYMBOL_GPL

--------------------------------------------------------------------------------
moxart_defconfig (arm, gcc-8) — PASS, 0 errors, 0 warnings, 0 section mismatches

--------------------------------------------------------------------------------
mpc30x_defconfig (mips, gcc-8) — PASS, 0 errors, 0 warnings, 0 section mismatches

--------------------------------------------------------------------------------
mps2_defconfig (arm, gcc-8) — PASS, 0 errors, 0 warnings, 0 section mismatches

--------------------------------------------------------------------------------
msp71xx_defconfig (mips, gcc-8) — PASS, 0 errors, 0 warnings, 0 section mismatches

--------------------------------------------------------------------------------
mtx1_defconfig (mips, gcc-8) — PASS, 0 errors, 0 warnings, 0 section mismatches

--------------------------------------------------------------------------------
multi_v4t_defconfig (arm, gcc-8) — PASS, 0 errors, 0 warnings, 0 section mismatches

--------------------------------------------------------------------------------
multi_v5_defconfig (arm, gcc-8) — PASS, 0 errors, 1 warning, 0 section mismatches

Warnings:
    WARNING: "return_address" [vmlinux] is a static EXPORT_SYMBOL_GPL

--------------------------------------------------------------------------------
multi_v7_defconfig (arm, gcc-8) — PASS, 0 errors, 3 warnings, 0 section mismatches

Warnings:
    WARNING: "return_address" [vmlinux] is a static EXPORT_SYMBOL_GPL
    depmod: WARNING: /home/buildslave/workspace/kernel-build@2/linux/build/_modules_/lib/modules/5.4.0-rc4-next-20191021/kernel/drivers/usb/storage/uas.ko needs unknown symbol usb_stor_sense_invalidCDB
    depmod: WARNING: /home/buildslave/workspace/kernel-build@2/linux/build/_modules_/lib/modules/5.4.0-rc4-next-20191021/kernel/drivers/usb/storage/uas.ko needs unknown symbol usb_stor_adjust_quirks

--------------------------------------------------------------------------------
multi_v7_defconfig+CONFIG_CPU_BIG_ENDIAN=y (arm, gcc-8) — PASS, 0 errors, 3 warnings, 0 section mismatches

Warnings:
    WARNING: "return_address" [vmlinux] is a static EXPORT_SYMBOL_GPL
    depmod: WARNING: /home/buildslave/workspace/workspace/kernel-build@4/linux/build/_modules_/lib/modules/5.4.0-rc4-next-20191021/kernel/drivers/usb/storage/uas.ko needs unknown symbol usb_stor_sense_invalidCDB
    depmod: WARNING: /home/buildslave/workspace/workspace/kernel-build@4/linux/build/_modules_/lib/modules/5.4.0-rc4-next-20191021/kernel/drivers/usb/storage/uas.ko needs unknown symbol usb_stor_adjust_quirks

--------------------------------------------------------------------------------
multi_v7_defconfig+CONFIG_EFI=y+CONFIG_ARM_LPAE=y (arm, gcc-8) — PASS, 0 errors, 3 warnings, 0 section mismatches

Warnings:
    WARNING: "return_address" [vmlinux] is a static EXPORT_SYMBOL_GPL
    depmod: WARNING: /home/buildslave/workspace/workspace/kernel-build@9/linux/build/_modules_/lib/modules/5.4.0-rc4-next-20191021/kernel/drivers/usb/storage/uas.ko needs unknown symbol usb_stor_sense_invalidCDB
    depmod: WARNING: /home/buildslave/workspace/workspace/kernel-build@9/linux/build/_modules_/lib/modules/5.4.0-rc4-next-20191021/kernel/drivers/usb/storage/uas.ko needs unknown symbol usb_stor_adjust_quirks

--------------------------------------------------------------------------------
multi_v7_defconfig+CONFIG_SMP=n (arm, gcc-8) — PASS, 0 errors, 3 warnings, 0 section mismatches

Warnings:
    WARNING: "return_address" [vmlinux] is a static EXPORT_SYMBOL_GPL
    depmod: WARNING: /home/buildslave/workspace/kernel-build@2/linux/build/_modules_/lib/modules/5.4.0-rc4-next-20191021/kernel/drivers/usb/storage/uas.ko needs unknown symbol usb_stor_sense_invalidCDB
    depmod: WARNING: /home/buildslave/workspace/kernel-build@2/linux/build/_modules_/lib/modules/5.4.0-rc4-next-20191021/kernel/drivers/usb/storage/uas.ko needs unknown symbol usb_stor_adjust_quirks

--------------------------------------------------------------------------------
multi_v7_defconfig+kselftest (arm, gcc-8) — PASS, 0 errors, 30 warnings, 0 section mismatches

Warnings:
    ./.tmp.config.Lg4nl5GY7B:8206:warning: override: reassigning to symbol BPF_SYSCALL
    ./.tmp.config.Lg4nl5GY7B:8209:warning: override: reassigning to symbol NET_VRF
    ./.tmp.config.Lg4nl5GY7B:8210:warning: override: reassigning to symbol NET_L3_MASTER_DEV
    ./.tmp.config.Lg4nl5GY7B:8212:warning: override: reassigning to symbol IPV6_MULTIPLE_TABLES
    ./.tmp.config.Lg4nl5GY7B:8213:warning: override: reassigning to symbol VETH
    ./.tmp.config.Lg4nl5GY7B:8217:warning: override: reassigning to symbol BRIDGE
    ./.tmp.config.Lg4nl5GY7B:8218:warning: override: reassigning to symbol VLAN_8021Q
    ./.tmp.config.Lg4nl5GY7B:8276:warning: override: reassigning to symbol NET_SCH_INGRESS
    ./.tmp.config.Lg4nl5GY7B:8297:warning: override: reassigning to symbol NET_ACT_GACT
    ./.tmp.config.Lg4nl5GY7B:8322:warning: override: reassigning to symbol USER_NS
    ./.tmp.config.Lg4nl5GY7B:8326:warning: override: reassigning to symbol NET_NS
    ./.tmp.config.Lg4nl5GY7B:8434:warning: override: reassigning to symbol USER_NS
    ./.tmp.config.Lg4nl5GY7B:8445:warning: override: reassigning to symbol NOTIFIER_ERROR_INJECTION
    ./.tmp.config.Lg4nl5GY7B:8455:warning: override: reassigning to symbol ANDROID
    ./.tmp.config.Lg4nl5GY7B:8462:warning: override: reassigning to symbol BPF_SYSCALL
    ./.tmp.config.Lg4nl5GY7B:8465:warning: override: reassigning to symbol TEST_BPF
    ./.tmp.config.Lg4nl5GY7B:8466:warning: override: reassigning to symbol CGROUP_BPF
    ./.tmp.config.Lg4nl5GY7B:8468:warning: override: reassigning to symbol NET_CLS_ACT
    ./.tmp.config.Lg4nl5GY7B:8469:warning: override: reassigning to symbol NET_SCHED
    ./.tmp.config.Lg4nl5GY7B:8470:warning: override: reassigning to symbol NET_SCH_INGRESS
    ./.tmp.config.Lg4nl5GY7B:8472:warning: override: reassigning to symbol IPV6
    ./.tmp.config.Lg4nl5GY7B:8481:warning: override: reassigning to symbol NET_CLS_FLOWER
    ./.tmp.config.Lg4nl5GY7B:8487:warning: override: reassigning to symbol IPV6_GRE
    ./.tmp.config.Lg4nl5GY7B:8507:warning: override: reassigning to symbol SECURITYFS
    ./.tmp.config.Lg4nl5GY7B:8511:warning: override: reassigning to symbol STAGING
    ./.tmp.config.Lg4nl5GY7B:8512:warning: override: reassigning to symbol ANDROID
    ./.tmp.config.Lg4nl5GY7B:8529:warning: override: reassigning to symbol USER_NS
    include/linux/kern_levels.h:5:18: warning: format '%lu' expects argument of type 'long unsigned int', but argument 8 has type 'unsigned int' [-Wformat=]
    depmod: WARNING: /home/buildslave/workspace/workspace/kernel-build@6/linux/build/_modules_/lib/modules/5.4.0-rc4-next-20191021/kernel/drivers/usb/storage/uas.ko needs unknown symbol usb_stor_sense_invalidCDB
    depmod: WARNING: /home/buildslave/workspace/workspace/kernel-build@6/linux/build/_modules_/lib/modules/5.4.0-rc4-next-20191021/kernel/drivers/usb/storage/uas.ko needs unknown symbol usb_stor_adjust_quirks

--------------------------------------------------------------------------------
mv78xx0_defconfig (arm, gcc-8) — PASS, 0 errors, 1 warning, 0 section mismatches

Warnings:
    WARNING: "return_address" [vmlinux] is a static EXPORT_SYMBOL_GPL

--------------------------------------------------------------------------------
mvebu_v5_defconfig (arm, gcc-8) — PASS, 0 errors, 1 warning, 0 section mismatches

Warnings:
    WARNING: "return_address" [vmlinux] is a static EXPORT_SYMBOL_GPL

--------------------------------------------------------------------------------
mvebu_v7_defconfig (arm, gcc-8) — PASS, 0 errors, 1 warning, 0 section mismatches

Warnings:
    WARNING: "return_address" [vmlinux] is a static EXPORT_SYMBOL_GPL

--------------------------------------------------------------------------------
mxs_defconfig (arm, gcc-8) — PASS, 0 errors, 1 warning, 0 section mismatches

Warnings:
    WARNING: "return_address" [vmlinux] is a static EXPORT_SYMBOL_GPL

--------------------------------------------------------------------------------
neponset_defconfig (arm, gcc-8) — PASS, 0 errors, 0 warnings, 0 section mismatches

Section mismatches:
    WARNING: vmlinux.o(.text.unlikely+0x8c4): Section mismatch in reference from the function free_memmap() to the function .meminit.text:memblock_free()

--------------------------------------------------------------------------------
netwinder_defconfig (arm, gcc-8) — PASS, 0 errors, 0 warnings, 0 section mismatches

--------------------------------------------------------------------------------
nhk8815_defconfig (arm, gcc-8) — PASS, 0 errors, 1 warning, 0 section mismatches

Warnings:
    WARNING: "return_address" [vmlinux] is a static EXPORT_SYMBOL_GPL

--------------------------------------------------------------------------------
nlm_xlp_defconfig (mips, gcc-8) — PASS, 0 errors, 0 warnings, 0 section mismatches

--------------------------------------------------------------------------------
nlm_xlr_defconfig (mips, gcc-8) — PASS, 0 errors, 1 warning, 0 section mismatches

Warnings:
    include/linux/kern_levels.h:5:18: warning: format '%lu' expects argument of type 'long unsigned int', but argument 8 has type 'unsigned int' [-Wformat=]

--------------------------------------------------------------------------------
nsim_hs_defconfig (arc, gcc-8) — PASS, 0 errors, 2 warnings, 0 section mismatches

Warnings:
    <stdin>:1511:2: warning: #warning syscall clone3 not implemented [-Wcpp]
    <stdin>:1511:2: warning: #warning syscall clone3 not implemented [-Wcpp]

--------------------------------------------------------------------------------
nsim_hs_defconfig+kselftest (arc, gcc-8) — PASS, 0 errors, 30 warnings, 0 section mismatches

Warnings:
    ./.tmp.config.vw3mCjUfBG:1422:warning: override: reassigning to symbol BPF_SYSCALL
    ./.tmp.config.vw3mCjUfBG:1425:warning: override: reassigning to symbol NET_VRF
    ./.tmp.config.vw3mCjUfBG:1426:warning: override: reassigning to symbol NET_L3_MASTER_DEV
    ./.tmp.config.vw3mCjUfBG:1428:warning: override: reassigning to symbol IPV6_MULTIPLE_TABLES
    ./.tmp.config.vw3mCjUfBG:1429:warning: override: reassigning to symbol VETH
    ./.tmp.config.vw3mCjUfBG:1433:warning: override: reassigning to symbol BRIDGE
    ./.tmp.config.vw3mCjUfBG:1434:warning: override: reassigning to symbol VLAN_8021Q
    ./.tmp.config.vw3mCjUfBG:1492:warning: override: reassigning to symbol NET_SCH_INGRESS
    ./.tmp.config.vw3mCjUfBG:1513:warning: override: reassigning to symbol NET_ACT_GACT
    ./.tmp.config.vw3mCjUfBG:1538:warning: override: reassigning to symbol USER_NS
    ./.tmp.config.vw3mCjUfBG:1542:warning: override: reassigning to symbol NET_NS
    ./.tmp.config.vw3mCjUfBG:1650:warning: override: reassigning to symbol USER_NS
    ./.tmp.config.vw3mCjUfBG:1661:warning: override: reassigning to symbol NOTIFIER_ERROR_INJECTION
    ./.tmp.config.vw3mCjUfBG:1671:warning: override: reassigning to symbol ANDROID
    ./.tmp.config.vw3mCjUfBG:1678:warning: override: reassigning to symbol BPF_SYSCALL
    ./.tmp.config.vw3mCjUfBG:1681:warning: override: reassigning to symbol TEST_BPF
    ./.tmp.config.vw3mCjUfBG:1682:warning: override: reassigning to symbol CGROUP_BPF
    ./.tmp.config.vw3mCjUfBG:1684:warning: override: reassigning to symbol NET_CLS_ACT
    ./.tmp.config.vw3mCjUfBG:1685:warning: override: reassigning to symbol NET_SCHED
    ./.tmp.config.vw3mCjUfBG:1686:warning: override: reassigning to symbol NET_SCH_INGRESS
    ./.tmp.config.vw3mCjUfBG:1688:warning: override: reassigning to symbol IPV6
    ./.tmp.config.vw3mCjUfBG:1697:warning: override: reassigning to symbol NET_CLS_FLOWER
    ./.tmp.config.vw3mCjUfBG:1703:warning: override: reassigning to symbol IPV6_GRE
    ./.tmp.config.vw3mCjUfBG:1723:warning: override: reassigning to symbol SECURITYFS
    ./.tmp.config.vw3mCjUfBG:1727:warning: override: reassigning to symbol STAGING
    ./.tmp.config.vw3mCjUfBG:1728:warning: override: reassigning to symbol ANDROID
    ./.tmp.config.vw3mCjUfBG:1745:warning: override: reassigning to symbol USER_NS
    <stdin>:1511:2: warning: #warning syscall clone3 not implemented [-Wcpp]
    <stdin>:1511:2: warning: #warning syscall clone3 not implemented [-Wcpp]
    include/linux/kern_levels.h:5:18: warning: format '%lu' expects argument of type 'long unsigned int', but argument 8 has type 'unsigned int' [-Wformat=]

--------------------------------------------------------------------------------
nsim_hs_smp_defconfig (arc, gcc-8) — PASS, 0 errors, 2 warnings, 0 section mismatches

Warnings:
    <stdin>:1511:2: warning: #warning syscall clone3 not implemented [-Wcpp]
    <stdin>:1511:2: warning: #warning syscall clone3 not implemented [-Wcpp]

--------------------------------------------------------------------------------
nsimosci_hs_defconfig (arc, gcc-8) — PASS, 0 errors, 2 warnings, 0 section mismatches

Warnings:
    <stdin>:1511:2: warning: #warning syscall clone3 not implemented [-Wcpp]
    <stdin>:1511:2: warning: #warning syscall clone3 not implemented [-Wcpp]

--------------------------------------------------------------------------------
nsimosci_hs_smp_defconfig (arc, gcc-8) — PASS, 0 errors, 2 warnings, 0 section mismatches

Warnings:
    <stdin>:1511:2: warning: #warning syscall clone3 not implemented [-Wcpp]
    <stdin>:1511:2: warning: #warning syscall clone3 not implemented [-Wcpp]

--------------------------------------------------------------------------------
omap1_defconfig (arm, gcc-8) — PASS, 0 errors, 1 warning, 0 section mismatches

Warnings:
    WARNING: "return_address" [vmlinux] is a static EXPORT_SYMBOL_GPL

--------------------------------------------------------------------------------
omap2plus_defconfig (arm, gcc-8) — PASS, 0 errors, 1 warning, 0 section mismatches

Warnings:
    WARNING: "return_address" [vmlinux] is a static EXPORT_SYMBOL_GPL

--------------------------------------------------------------------------------
omega2p_defconfig (mips, gcc-8) — FAIL, 1 error, 0 warnings, 0 section mismatches

Errors:
    include/linux/compiler.h:350:38: error: call to '__compiletime_assert_1659' declared with attribute error: BUILD_BUG_ON failed: stat_items_size != ARRAY_SIZE(vmstat_text) * sizeof(unsigned long)

--------------------------------------------------------------------------------
orion5x_defconfig (arm, gcc-8) — PASS, 0 errors, 1 warning, 0 section mismatches

Warnings:
    WARNING: "return_address" [vmlinux] is a static EXPORT_SYMBOL_GPL

--------------------------------------------------------------------------------
oxnas_v6_defconfig (arm, gcc-8) — PASS, 0 errors, 1 warning, 0 section mismatches

Warnings:
    WARNING: "return_address" [vmlinux] is a static EXPORT_SYMBOL_GPL

--------------------------------------------------------------------------------
palmz72_defconfig (arm, gcc-8) — PASS, 0 errors, 1 warning, 0 section mismatches

Warnings:
    WARNING: "return_address" [vmlinux] is a static EXPORT_SYMBOL_GPL

--------------------------------------------------------------------------------
pcm027_defconfig (arm, gcc-8) — PASS, 0 errors, 1 warning, 0 section mismatches

Warnings:
    WARNING: "return_address" [vmlinux] is a static EXPORT_SYMBOL_GPL

--------------------------------------------------------------------------------
pic32mzda_defconfig (mips, gcc-8) — PASS, 0 errors, 0 warnings, 0 section mismatches

--------------------------------------------------------------------------------
pistachio_defconfig (mips, gcc-8) — PASS, 0 errors, 0 warnings, 0 section mismatches

--------------------------------------------------------------------------------
pleb_defconfig (arm, gcc-8) — PASS, 0 errors, 0 warnings, 0 section mismatches

Section mismatches:
    WARNING: vmlinux.o(.text.unlikely+0x840): Section mismatch in reference from the function free_memmap() to the function .meminit.text:memblock_free()

--------------------------------------------------------------------------------
pnx8335_stb225_defconfig (mips, gcc-8) — PASS, 0 errors, 0 warnings, 0 section mismatches

--------------------------------------------------------------------------------
prima2_defconfig (arm, gcc-8) — PASS, 0 errors, 1 warning, 0 section mismatches

Warnings:
    WARNING: "return_address" [vmlinux] is a static EXPORT_SYMBOL_GPL

--------------------------------------------------------------------------------
pxa168_defconfig (arm, gcc-8) — PASS, 0 errors, 1 warning, 0 section mismatches

Warnings:
    WARNING: "return_address" [vmlinux] is a static EXPORT_SYMBOL_GPL

--------------------------------------------------------------------------------
pxa255-idp_defconfig (arm, gcc-8) — PASS, 0 errors, 0 warnings, 0 section mismatches

--------------------------------------------------------------------------------
pxa3xx_defconfig (arm, gcc-8) — PASS, 0 errors, 1 warning, 0 section mismatches

Warnings:
    WARNING: "return_address" [vmlinux] is a static EXPORT_SYMBOL_GPL

--------------------------------------------------------------------------------
pxa910_defconfig (arm, gcc-8) — PASS, 0 errors, 1 warning, 0 section mismatches

Warnings:
    WARNING: "return_address" [vmlinux] is a static EXPORT_SYMBOL_GPL

--------------------------------------------------------------------------------
pxa_defconfig (arm, gcc-8) — PASS, 0 errors, 0 warnings, 0 section mismatches

--------------------------------------------------------------------------------
qcom_defconfig (arm, gcc-8) — PASS, 0 errors, 1 warning, 0 section mismatches

Warnings:
    WARNING: "return_address" [vmlinux] is a static EXPORT_SYMBOL_GPL

--------------------------------------------------------------------------------
qi_lb60_defconfig (mips, gcc-8) — PASS, 0 errors, 0 warnings, 0 section mismatches

--------------------------------------------------------------------------------
rb532_defconfig (mips, gcc-8) — PASS, 0 errors, 0 warnings, 0 section mismatches

--------------------------------------------------------------------------------
rbtx49xx_defconfig (mips, gcc-8) — PASS, 0 errors, 1 warning, 0 section mismatches

Warnings:
    sound/soc/txx9/txx9aclc.c:54:30: warning: unused variable 'rtd' [-Wunused-variable]

--------------------------------------------------------------------------------
realview_defconfig (arm, gcc-8) — PASS, 0 errors, 1 warning, 0 section mismatches

Warnings:
    WARNING: "return_address" [vmlinux] is a static EXPORT_SYMBOL_GPL

--------------------------------------------------------------------------------
rm200_defconfig (mips, gcc-8) — PASS, 0 errors, 0 warnings, 0 section mismatches

--------------------------------------------------------------------------------
rpc_defconfig (arm, gcc-8) — PASS, 0 errors, 0 warnings, 0 section mismatches

Section mismatches:
    WARNING: vmlinux.o(.text.unlikely+0x8e4): Section mismatch in reference from the function free_memmap() to the function .meminit.text:memblock_free()

--------------------------------------------------------------------------------
rt305x_defconfig (mips, gcc-8) — PASS, 0 errors, 0 warnings, 0 section mismatches

--------------------------------------------------------------------------------
rv32_defconfig (riscv, gcc-8) — PASS, 0 errors, 6 warnings, 0 section mismatches

Warnings:
    <stdin>:830:2: warning: #warning syscall fstat64 not implemented [-Wcpp]
    <stdin>:1127:2: warning: #warning syscall fstatat64 not implemented [-Wcpp]
    <stdin>:1511:2: warning: #warning syscall clone3 not implemented [-Wcpp]
    <stdin>:830:2: warning: #warning syscall fstat64 not implemented [-Wcpp]
    <stdin>:1127:2: warning: #warning syscall fstatat64 not implemented [-Wcpp]
    <stdin>:1511:2: warning: #warning syscall clone3 not implemented [-Wcpp]

--------------------------------------------------------------------------------
s3c2410_defconfig (arm, gcc-8) — PASS, 0 errors, 1 warning, 0 section mismatches

Warnings:
    sound/soc/soc-pcm.c:1207:8: warning: unused variable 'name' [-Wunused-variable]

--------------------------------------------------------------------------------
s3c6400_defconfig (arm, gcc-8) — PASS, 0 errors, 2 warnings, 0 section mismatches

Warnings:
    WARNING: "return_address" [vmlinux] is a static EXPORT_SYMBOL_GPL
    sound/soc/soc-pcm.c:1207:8: warning: unused variable 'name' [-Wunused-variable]

--------------------------------------------------------------------------------
s5pv210_defconfig (arm, gcc-8) — PASS, 0 errors, 1 warning, 0 section mismatches

Warnings:
    WARNING: "return_address" [vmlinux] is a static EXPORT_SYMBOL_GPL

--------------------------------------------------------------------------------
sama5_defconfig (arm, gcc-8) — PASS, 0 errors, 1 warning, 0 section mismatches

Warnings:
    WARNING: "return_address" [vmlinux] is a static EXPORT_SYMBOL_GPL

--------------------------------------------------------------------------------
sb1250_swarm_defconfig (mips, gcc-8) — PASS, 0 errors, 0 warnings, 0 section mismatches

--------------------------------------------------------------------------------
shannon_defconfig (arm, gcc-8) — PASS, 0 errors, 0 warnings, 0 section mismatches

Section mismatches:
    WARNING: vmlinux.o(.text.unlikely+0x8c4): Section mismatch in reference from the function free_memmap() to the function .meminit.text:memblock_free()

--------------------------------------------------------------------------------
shmobile_defconfig (arm, gcc-8) — PASS, 0 errors, 0 warnings, 0 section mismatches

--------------------------------------------------------------------------------
simpad_defconfig (arm, gcc-8) — PASS, 0 errors, 0 warnings, 0 section mismatches

Section mismatches:
    WARNING: vmlinux.o(.text.unlikely+0x84c): Section mismatch in reference from the function free_memmap() to the function .meminit.text:memblock_free()

--------------------------------------------------------------------------------
socfpga_defconfig (arm, gcc-8) — PASS, 0 errors, 0 warnings, 0 section mismatches

--------------------------------------------------------------------------------
spear13xx_defconfig (arm, gcc-8) — PASS, 0 errors, 1 warning, 0 section mismatches

Warnings:
    WARNING: "return_address" [vmlinux] is a static EXPORT_SYMBOL_GPL

--------------------------------------------------------------------------------
spear3xx_defconfig (arm, gcc-8) — PASS, 0 errors, 0 warnings, 0 section mismatches

--------------------------------------------------------------------------------
spear6xx_defconfig (arm, gcc-8) — PASS, 0 errors, 0 warnings, 0 section mismatches

--------------------------------------------------------------------------------
spitz_defconfig (arm, gcc-8) — PASS, 0 errors, 0 warnings, 0 section mismatches

--------------------------------------------------------------------------------
stm32_defconfig (arm, gcc-8) — PASS, 0 errors, 0 warnings, 0 section mismatches

--------------------------------------------------------------------------------
sunxi_defconfig (arm, gcc-8) — PASS, 0 errors, 1 warning, 0 section mismatches

Warnings:
    WARNING: "return_address" [vmlinux] is a static EXPORT_SYMBOL_GPL

--------------------------------------------------------------------------------
tango4_defconfig (arm, gcc-8) — PASS, 0 errors, 1 warning, 0 section mismatches

Warnings:
    WARNING: "return_address" [vmlinux] is a static EXPORT_SYMBOL_GPL

--------------------------------------------------------------------------------
tb0219_defconfig (mips, gcc-8) — PASS, 0 errors, 0 warnings, 0 section mismatches

--------------------------------------------------------------------------------
tb0226_defconfig (mips, gcc-8) — PASS, 0 errors, 0 warnings, 0 section mismatches

--------------------------------------------------------------------------------
tb0287_defconfig (mips, gcc-8) — PASS, 0 errors, 0 warnings, 0 section mismatches

--------------------------------------------------------------------------------
tct_hammer_defconfig (arm, gcc-8) — PASS, 0 errors, 0 warnings, 0 section mismatches

--------------------------------------------------------------------------------
tegra_defconfig (arm, gcc-8) — PASS, 0 errors, 1 warning, 0 section mismatches

Warnings:
    WARNING: "return_address" [vmlinux] is a static EXPORT_SYMBOL_GPL

--------------------------------------------------------------------------------
tinyconfig (i386, gcc-8) — PASS, 0 errors, 0 warnings, 0 section mismatches

--------------------------------------------------------------------------------
tinyconfig (arm64, gcc-8) — PASS, 0 errors, 0 warnings, 0 section mismatches

--------------------------------------------------------------------------------
tinyconfig (x86_64, gcc-8) — PASS, 0 errors, 1 warning, 0 section mismatches

Warnings:
    .config:1165:warning: override: UNWINDER_GUESS changes choice state

--------------------------------------------------------------------------------
tinyconfig (arm, gcc-8) — PASS, 0 errors, 0 warnings, 0 section mismatches

--------------------------------------------------------------------------------
tinyconfig (mips, gcc-8) — PASS, 0 errors, 0 warnings, 0 section mismatches

--------------------------------------------------------------------------------
tinyconfig (riscv, gcc-8) — PASS, 0 errors, 0 warnings, 0 section mismatches

--------------------------------------------------------------------------------
tinyconfig (arc, gcc-8) — PASS, 0 errors, 1 warning, 0 section mismatches

Warnings:
    <stdin>:1511:2: warning: #warning syscall clone3 not implemented [-Wcpp]

--------------------------------------------------------------------------------
trizeps4_defconfig (arm, gcc-8) — PASS, 0 errors, 1 warning, 0 section mismatches

Warnings:
    WARNING: "return_address" [vmlinux] is a static EXPORT_SYMBOL_GPL

--------------------------------------------------------------------------------
u300_defconfig (arm, gcc-8) — PASS, 0 errors, 1 warning, 0 section mismatches

Warnings:
    WARNING: "return_address" [vmlinux] is a static EXPORT_SYMBOL_GPL

--------------------------------------------------------------------------------
u8500_defconfig (arm, gcc-8) — PASS, 0 errors, 1 warning, 0 section mismatches

Warnings:
    WARNING: "return_address" [vmlinux] is a static EXPORT_SYMBOL_GPL

--------------------------------------------------------------------------------
vdk_hs38_defconfig (arc, gcc-8) — PASS, 0 errors, 1 warning, 0 section mismatches

Warnings:
    <stdin>:1511:2: warning: #warning syscall clone3 not implemented [-Wcpp]

--------------------------------------------------------------------------------
vdk_hs38_smp_defconfig (arc, gcc-8) — PASS, 0 errors, 1 warning, 0 section mismatches

Warnings:
    <stdin>:1511:2: warning: #warning syscall clone3 not implemented [-Wcpp]

--------------------------------------------------------------------------------
versatile_defconfig (arm, gcc-8) — PASS, 0 errors, 1 warning, 0 section mismatches

Warnings:
    WARNING: "return_address" [vmlinux] is a static EXPORT_SYMBOL_GPL

--------------------------------------------------------------------------------
vexpress_defconfig (arm, gcc-8) — PASS, 0 errors, 1 warning, 0 section mismatches

Warnings:
    WARNING: "return_address" [vmlinux] is a static EXPORT_SYMBOL_GPL

--------------------------------------------------------------------------------
vf610m4_defconfig (arm, gcc-8) — PASS, 0 errors, 0 warnings, 0 section mismatches

--------------------------------------------------------------------------------
viper_defconfig (arm, gcc-8) — PASS, 0 errors, 1 warning, 0 section mismatches

Warnings:
    WARNING: "return_address" [vmlinux] is a static EXPORT_SYMBOL_GPL

--------------------------------------------------------------------------------
vocore2_defconfig (mips, gcc-8) — FAIL, 1 error, 0 warnings, 0 section mismatches

Errors:
    include/linux/compiler.h:350:38: error: call to '__compiletime_assert_1659' declared with attribute error: BUILD_BUG_ON failed: stat_items_size != ARRAY_SIZE(vmstat_text) * sizeof(unsigned long)

--------------------------------------------------------------------------------
vt8500_v6_v7_defconfig (arm, gcc-8) — PASS, 0 errors, 0 warnings, 0 section mismatches

--------------------------------------------------------------------------------
workpad_defconfig (mips, gcc-8) — PASS, 0 errors, 0 warnings, 0 section mismatches

--------------------------------------------------------------------------------
x86_64_defconfig (x86_64, gcc-8) — PASS, 0 errors, 0 warnings, 0 section mismatches

--------------------------------------------------------------------------------
x86_64_defconfig+kselftest (x86_64, gcc-8) — PASS, 0 errors, 27 warnings, 0 section mismatches

Warnings:
    ./.tmp.config.vGhEl8Wvl4:4566:warning: override: reassigning to symbol BPF_SYSCALL
    ./.tmp.config.vGhEl8Wvl4:4569:warning: override: reassigning to symbol NET_VRF
    ./.tmp.config.vGhEl8Wvl4:4570:warning: override: reassigning to symbol NET_L3_MASTER_DEV
    ./.tmp.config.vGhEl8Wvl4:4572:warning: override: reassigning to symbol IPV6_MULTIPLE_TABLES
    ./.tmp.config.vGhEl8Wvl4:4573:warning: override: reassigning to symbol VETH
    ./.tmp.config.vGhEl8Wvl4:4577:warning: override: reassigning to symbol BRIDGE
    ./.tmp.config.vGhEl8Wvl4:4578:warning: override: reassigning to symbol VLAN_8021Q
    ./.tmp.config.vGhEl8Wvl4:4636:warning: override: reassigning to symbol NET_SCH_INGRESS
    ./.tmp.config.vGhEl8Wvl4:4657:warning: override: reassigning to symbol NET_ACT_GACT
    ./.tmp.config.vGhEl8Wvl4:4682:warning: override: reassigning to symbol USER_NS
    ./.tmp.config.vGhEl8Wvl4:4686:warning: override: reassigning to symbol NET_NS
    ./.tmp.config.vGhEl8Wvl4:4794:warning: override: reassigning to symbol USER_NS
    ./.tmp.config.vGhEl8Wvl4:4805:warning: override: reassigning to symbol NOTIFIER_ERROR_INJECTION
    ./.tmp.config.vGhEl8Wvl4:4815:warning: override: reassigning to symbol ANDROID
    ./.tmp.config.vGhEl8Wvl4:4822:warning: override: reassigning to symbol BPF_SYSCALL
    ./.tmp.config.vGhEl8Wvl4:4825:warning: override: reassigning to symbol TEST_BPF
    ./.tmp.config.vGhEl8Wvl4:4826:warning: override: reassigning to symbol CGROUP_BPF
    ./.tmp.config.vGhEl8Wvl4:4828:warning: override: reassigning to symbol NET_CLS_ACT
    ./.tmp.config.vGhEl8Wvl4:4829:warning: override: reassigning to symbol NET_SCHED
    ./.tmp.config.vGhEl8Wvl4:4830:warning: override: reassigning to symbol NET_SCH_INGRESS
    ./.tmp.config.vGhEl8Wvl4:4832:warning: override: reassigning to symbol IPV6
    ./.tmp.config.vGhEl8Wvl4:4841:warning: override: reassigning to symbol NET_CLS_FLOWER
    ./.tmp.config.vGhEl8Wvl4:4847:warning: override: reassigning to symbol IPV6_GRE
    ./.tmp.config.vGhEl8Wvl4:4867:warning: override: reassigning to symbol SECURITYFS
    ./.tmp.config.vGhEl8Wvl4:4871:warning: override: reassigning to symbol STAGING
    ./.tmp.config.vGhEl8Wvl4:4872:warning: override: reassigning to symbol ANDROID
    ./.tmp.config.vGhEl8Wvl4:4889:warning: override: reassigning to symbol USER_NS

--------------------------------------------------------------------------------
x86_64_defconfig+kvm_guest (x86_64, gcc-8) — PASS, 0 errors, 0 warnings, 0 section mismatches

--------------------------------------------------------------------------------
xcep_defconfig (arm, gcc-8) — PASS, 0 errors, 1 warning, 0 section mismatches

Warnings:
    WARNING: "return_address" [vmlinux] is a static EXPORT_SYMBOL_GPL

--------------------------------------------------------------------------------
xway_defconfig (mips, gcc-8) — PASS, 0 errors, 0 warnings, 0 section mismatches

--------------------------------------------------------------------------------
zeus_defconfig (arm, gcc-8) — PASS, 0 errors, 2 warnings, 0 section mismatches

Warnings:
    WARNING: "return_address" [vmlinux] is a static EXPORT_SYMBOL_GPL
    sound/soc/soc-pcm.c:1207:8: warning: unused variable 'name' [-Wunused-variable]

--------------------------------------------------------------------------------
zx_defconfig (arm, gcc-8) — PASS, 0 errors, 0 warnings, 0 section mismatches

---
For more info write to <info@kernelci.org>

^ permalink raw reply	[flat|nested] only message in thread

only message in thread, back to index

Thread overview: (only message) (download: mbox.gz / follow: Atom feed)
-- links below jump to the message on this page --
2019-10-21  9:49 next/master build: 219 builds: 6 failed, 213 passed, 25 errors, 548 warnings (next-20191021) kernelci.org bot

Linux-Next Archive on lore.kernel.org

Archives are clonable:
	git clone --mirror https://lore.kernel.org/linux-next/0 linux-next/git/0.git

	# If you have public-inbox 1.1+ installed, you may
	# initialize and index your mirror using the following commands:
	public-inbox-init -V2 linux-next linux-next/ https://lore.kernel.org/linux-next \
		linux-next@vger.kernel.org
	public-inbox-index linux-next

Example config snippet for mirrors

Newsgroup available over NNTP:
	nntp://nntp.lore.kernel.org/org.kernel.vger.linux-next


AGPL code for this site: git clone https://public-inbox.org/public-inbox.git