Linux-Next Archive on lore.kernel.org
 help / color / Atom feed
* next/master build: 219 builds: 3 failed, 216 passed, 22 errors, 385 warnings (next-20191023)
@ 2019-10-23 13:38 kernelci.org bot
  0 siblings, 0 replies; only message in thread
From: kernelci.org bot @ 2019-10-23 13:38 UTC (permalink / raw)
  To: linux-next

next/master build: 219 builds: 3 failed, 216 passed, 22 errors, 385 warnings (next-20191023)

Full Build Summary: https://kernelci.org/build/next/branch/master/kernel/next-20191023/

Tree: next
Branch: master
Git Describe: next-20191023
Git Commit: f3c452cfc59c817950b150b51ec2b33409d7640b
Git URL: git://git.kernel.org/pub/scm/linux/kernel/git/next/linux-next.git
Built: 7 unique architectures

Build Failures Detected:

arm64:
    allmodconfig: (clang-8) FAIL
    allmodconfig: (gcc-8) FAIL

mips:
    cavium_octeon_defconfig: (gcc-8) FAIL

Errors and Warnings Detected:

arc:
    allnoconfig (gcc-8): 1 warning
    axs103_defconfig (gcc-8): 2 warnings
    axs103_smp_defconfig (gcc-8): 2 warnings
    haps_hs_defconfig (gcc-8): 2 warnings
    haps_hs_smp_defconfig (gcc-8): 2 warnings
    hsdk_defconfig (gcc-8): 2 warnings
    nsim_hs_defconfig (gcc-8): 2 warnings
    nsim_hs_defconfig (gcc-8): 30 warnings
    nsim_hs_smp_defconfig (gcc-8): 2 warnings
    nsimosci_hs_defconfig (gcc-8): 2 warnings
    nsimosci_hs_smp_defconfig (gcc-8): 2 warnings
    tinyconfig (gcc-8): 1 warning
    vdk_hs38_defconfig (gcc-8): 1 warning
    vdk_hs38_smp_defconfig (gcc-8): 1 warning

arm64:
    allmodconfig (clang-8): 9 errors, 48 warnings
    allmodconfig (gcc-8): 9 errors, 2 warnings
    defconfig (gcc-8): 27 warnings

arm:
    allmodconfig (gcc-8): 19 warnings
    am200epdkit_defconfig (gcc-8): 1 warning
    at91_dt_defconfig (gcc-8): 1 warning
    axm55xx_defconfig (gcc-8): 1 warning
    bcm2835_defconfig (gcc-8): 3 warnings
    cm_x2xx_defconfig (gcc-8): 1 warning
    cm_x300_defconfig (gcc-8): 1 warning
    cns3420vb_defconfig (gcc-8): 1 warning
    colibri_pxa270_defconfig (gcc-8): 1 warning
    colibri_pxa300_defconfig (gcc-8): 1 warning
    davinci_all_defconfig (gcc-8): 1 warning
    dove_defconfig (gcc-8): 1 warning
    em_x270_defconfig (gcc-8): 1 warning
    ep93xx_defconfig (gcc-8): 1 warning
    eseries_pxa_defconfig (gcc-8): 2 warnings
    exynos_defconfig (gcc-8): 1 warning
    ezx_defconfig (gcc-8): 1 warning
    h5000_defconfig (gcc-8): 1 warning
    imote2_defconfig (gcc-8): 1 warning
    imx_v4_v5_defconfig (gcc-8): 1 warning
    imx_v6_v7_defconfig (gcc-8): 1 warning
    integrator_defconfig (gcc-8): 1 warning
    ixp4xx_defconfig (gcc-8): 1 warning
    keystone_defconfig (gcc-8): 1 warning
    lpc32xx_defconfig (gcc-8): 1 warning
    magician_defconfig (gcc-8): 2 warnings
    milbeaut_m10v_defconfig (gcc-8): 1 warning
    mini2440_defconfig (gcc-8): 1 warning
    mmp2_defconfig (gcc-8): 1 warning
    multi_v5_defconfig (gcc-8): 1 warning
    multi_v7_defconfig (gcc-8): 1 warning
    multi_v7_defconfig (gcc-8): 1 warning
    multi_v7_defconfig (gcc-8): 1 warning
    multi_v7_defconfig (gcc-8): 1 warning
    multi_v7_defconfig (gcc-8): 28 warnings
    mv78xx0_defconfig (gcc-8): 1 warning
    mvebu_v5_defconfig (gcc-8): 1 warning
    mvebu_v7_defconfig (gcc-8): 1 warning
    mxs_defconfig (gcc-8): 1 warning
    nhk8815_defconfig (gcc-8): 1 warning
    omap1_defconfig (gcc-8): 1 warning
    omap2plus_defconfig (gcc-8): 1 warning
    orion5x_defconfig (gcc-8): 1 warning
    oxnas_v6_defconfig (gcc-8): 1 warning
    palmz72_defconfig (gcc-8): 1 warning
    pcm027_defconfig (gcc-8): 1 warning
    prima2_defconfig (gcc-8): 1 warning
    pxa168_defconfig (gcc-8): 1 warning
    pxa3xx_defconfig (gcc-8): 1 warning
    pxa910_defconfig (gcc-8): 1 warning
    qcom_defconfig (gcc-8): 1 warning
    realview_defconfig (gcc-8): 1 warning
    s3c2410_defconfig (gcc-8): 1 warning
    s3c6400_defconfig (gcc-8): 2 warnings
    s5pv210_defconfig (gcc-8): 1 warning
    sama5_defconfig (gcc-8): 1 warning
    spear13xx_defconfig (gcc-8): 1 warning
    sunxi_defconfig (gcc-8): 1 warning
    tango4_defconfig (gcc-8): 1 warning
    tegra_defconfig (gcc-8): 1 warning
    trizeps4_defconfig (gcc-8): 1 warning
    u300_defconfig (gcc-8): 1 warning
    u8500_defconfig (gcc-8): 1 warning
    versatile_defconfig (gcc-8): 1 warning
    vexpress_defconfig (gcc-8): 1 warning
    viper_defconfig (gcc-8): 1 warning
    xcep_defconfig (gcc-8): 1 warning
    zeus_defconfig (gcc-8): 2 warnings

i386:
    i386_defconfig (gcc-8): 28 warnings

mips:
    32r2el_defconfig (gcc-8): 28 warnings
    cavium_octeon_defconfig (gcc-8): 4 errors, 3 warnings
    db1xxx_defconfig (gcc-8): 1 warning
    ip27_defconfig (gcc-8): 2 warnings
    malta_qemu_32r6_defconfig (gcc-8): 1 warning
    nlm_xlp_defconfig (gcc-8): 2 warnings
    nlm_xlr_defconfig (gcc-8): 3 warnings
    rbtx49xx_defconfig (gcc-8): 1 warning

riscv:
    defconfig (gcc-8): 2 warnings
    defconfig (gcc-8): 29 warnings
    rv32_defconfig (gcc-8): 8 warnings

x86_64:
    allmodconfig (gcc-8): 1 warning
    tinyconfig (gcc-8): 1 warning
    x86_64_defconfig (gcc-8): 27 warnings

Errors summary:

    2    ERROR: "dpdmai_set_rx_queue" [drivers/dma/fsl-dpaa2-qdma/dpaa2-qdma.ko] undefined!
    2    ERROR: "dpdmai_reset" [drivers/dma/fsl-dpaa2-qdma/dpaa2-qdma.ko] undefined!
    2    ERROR: "dpdmai_open" [drivers/dma/fsl-dpaa2-qdma/dpaa2-qdma.ko] undefined!
    2    ERROR: "dpdmai_get_tx_queue" [drivers/dma/fsl-dpaa2-qdma/dpaa2-qdma.ko] undefined!
    2    ERROR: "dpdmai_get_rx_queue" [drivers/dma/fsl-dpaa2-qdma/dpaa2-qdma.ko] undefined!
    2    ERROR: "dpdmai_get_attributes" [drivers/dma/fsl-dpaa2-qdma/dpaa2-qdma.ko] undefined!
    2    ERROR: "dpdmai_enable" [drivers/dma/fsl-dpaa2-qdma/dpaa2-qdma.ko] undefined!
    2    ERROR: "dpdmai_disable" [drivers/dma/fsl-dpaa2-qdma/dpaa2-qdma.ko] undefined!
    2    ERROR: "dpdmai_close" [drivers/dma/fsl-dpaa2-qdma/dpaa2-qdma.ko] undefined!
    1    drivers/staging/octeon/ethernet.c:516:29: error: type of formal parameter 2 is incomplete
    1    drivers/staging/octeon/ethernet.c:499:30: error: storage size of 'link_info' isn't known
    1    drivers/staging/octeon/ethernet.c:463:30: error: storage size of 'link_info' isn't known
    1    drivers/staging/octeon/ethernet.c:177:21: error: dereferencing pointer to incomplete type 'struct cvmx_wqe'

Warnings summary:

    64   WARNING: "return_address" [vmlinux] is a static EXPORT_SYMBOL_GPL
    26   <stdin>:1511:2: warning: #warning syscall clone3 not implemented [-Wcpp]
    16   1 warning generated.
    9    drivers/net/phy/mdio-cavium.h:113:48: warning: cast to pointer from integer of different size [-Wint-to-pointer-cast]
    6    sound/soc/soc-pcm.c:1207:8: warning: unused variable 'name' [-Wunused-variable]
    6    include/linux/kern_levels.h:5:18: warning: format '%lu' expects argument of type 'long unsigned int', but argument 8 has type 'unsigned int' [-Wformat=]
    6    drivers/net/ethernet/intel/e1000e/netdev.c:6405:13: warning: 'e1000e_s0ix_exit_flow' defined but not used [-Wunused-function]
    6    drivers/net/ethernet/intel/e1000e/netdev.c:6298:13: warning: 'e1000e_s0ix_entry_flow' defined but not used [-Wunused-function]
    5    2 warnings generated.
    4    sound/soc/codecs/rt5677-spi.c:114:30: warning: unused variable 'rtd' [-Wunused-variable]
    4    drivers/net/phy/mdio-cavium.h:114:37: warning: cast to pointer from integer of different size [-Wint-to-pointer-cast]
    2    WARNING: modpost: missing MODULE_LICENSE() in drivers/dma/fsl-dpaa2-qdma/dpdmai.o
    2    <stdin>:830:2: warning: #warning syscall fstat64 not implemented [-Wcpp]
    2    <stdin>:1127:2: warning: #warning syscall fstatat64 not implemented [-Wcpp]
    1    {standard input}:134: Warning: macro instruction expanded into multiple instructions
    1    warning: same module names found:
    1    sound/soc/txx9/txx9aclc.c:54:30: warning: unused variable 'rtd' [-Wunused-variable]
    1    net/nfc/hci/llc_shdlc.c:687:34: warning: variable 'connect_wq' is uninitialized when used within its own initialization [-Wuninitialized]
    1    net/nfc/hci/command.c:59:34: warning: variable 'ew_wq' is uninitialized when used within its own initialization [-Wuninitialized]
    1    mm/shmem.c:2737:35: warning: variable 'shmem_falloc_waitq' is uninitialized when used within its own initialization [-Wuninitialized]
    1    kernel/debug/debug_core.c:470:18: warning: array subscript [0, 0] is outside array bounds of 'struct debuggerinfo_struct[1]' [-Warray-bounds]
    1    kernel/debug/debug_core.c:469:33: warning: array subscript [0, 0] is outside array bounds of 'struct debuggerinfo_struct[1]' [-Warray-bounds]
    1    kernel/debug/debug_core.c:452:17: warning: array subscript [0, 0] is outside array bounds of 'struct debuggerinfo_struct[1]' [-Warray-bounds]
    1    fs/proc/proc_sysctl.c:705:35: warning: variable 'wq' is uninitialized when used within its own initialization [-Wuninitialized]
    1    fs/proc/base.c:1894:35: warning: variable 'wq' is uninitialized when used within its own initialization [-Wuninitialized]
    1    fs/nfs/dir.c:448:34: warning: variable 'wq' is uninitialized when used within its own initialization [-Wuninitialized]
    1    fs/nfs/dir.c:1499:34: warning: variable 'wq' is uninitialized when used within its own initialization [-Wuninitialized]
    1    fs/namei.c:3132:34: warning: variable 'wq' is uninitialized when used within its own initialization [-Wuninitialized]
    1    fs/namei.c:1644:34: warning: variable 'wq' is uninitialized when used within its own initialization [-Wuninitialized]
    1    fs/fuse/readdir.c:161:34: warning: variable 'wq' is uninitialized when used within its own initialization [-Wuninitialized]
    1    fs/cifs/readdir.c:83:34: warning: variable 'wq' is uninitialized when used within its own initialization [-Wuninitialized]
    1    fs/afs/dir_silly.c:205:34: warning: variable 'wq' is uninitialized when used within its own initialization [-Wuninitialized]
    1    drivers/staging/octeon/octeon-ethernet.h:94:12: warning: 'union cvmx_helper_link_info' declared inside parameter list will not be visible outside of this definition or declaration
    1    drivers/staging/octeon/ethernet.c:499:30: warning: unused variable 'link_info' [-Wunused-variable]
    1    drivers/staging/octeon/ethernet.c:463:30: warning: unused variable 'link_info' [-Wunused-variable]
    1    drivers/scsi/lpfc/lpfc_sli.c:11855:34: warning: variable 'done_q' is uninitialized when used within its own initialization [-Wuninitialized]
    1    drivers/scsi/lpfc/lpfc_scsi.c:4722:34: warning: variable 'waitq' is uninitialized when used within its own initialization [-Wuninitialized]
    1    drivers/scsi/bfa/bfad_im.c:378:34: warning: variable 'wq' is uninitialized when used within its own initialization [-Wuninitialized]
    1    drivers/scsi/bfa/bfad_im.c:301:34: warning: variable 'wq' is uninitialized when used within its own initialization [-Wuninitialized]
    1    drivers/net/usb/lan78xx.c:2662:34: warning: variable 'unlink_wakeup' is uninitialized when used within its own initialization [-Wuninitialized]
    1    drivers/net/phy/mdio-octeon.c:48:3: warning: cast from pointer to integer of different size [-Wpointer-to-int-cast]
    1    drivers/misc/mic/vop/vop_vringh.c:399:34: warning: variable 'wake' is uninitialized when used within its own initialization [-Wuninitialized]
    1    drivers/misc/mic/vop/vop_vringh.c:155:34: warning: variable 'wake' is uninitialized when used within its own initialization [-Wuninitialized]
    1    drivers/gpu/host1x/syncpt.c:208:34: warning: variable 'wq' is uninitialized when used within its own initialization [-Wuninitialized]
    1    drivers/gpu/drm/amd/amdgpu/../powerplay/renoir_ppt.c:182:26: warning: suggest braces around initialization of subobject [-Wmissing-braces]
    1    drivers/dma/fsl-dpaa2-qdma/dpdmai.c:148:25: warning: variable 'cfg' is uninitialized when used within its own initialization [-Wuninitialized]
    1    drivers/dma/fsl-dpaa2-qdma/dpdmai.c:148:20: warning: variable 'cmd' is uninitialized when used within its own initialization [-Wuninitialized]
    1    drivers/bluetooth/bluecard_cs.c:282:36: warning: variable 'wq' is uninitialized when used within its own initialization [-Wuninitialized]
    1    drivers/android/binderfs.c:657:41: warning: suggest braces around initialization of subobject [-Wmissing-braces]
    1    /tmp/ccWqXYtW.s:18191: Warning: using r15 results in unpredictable behaviour
    1    /tmp/ccWqXYtW.s:18119: Warning: using r15 results in unpredictable behaviour
    1    .config:1165:warning: override: UNWINDER_GUESS changes choice state
    1    ./.tmp.config.xS81TWvZ7g:4889:warning: override: reassigning to symbol USER_NS
    1    ./.tmp.config.xS81TWvZ7g:4872:warning: override: reassigning to symbol ANDROID
    1    ./.tmp.config.xS81TWvZ7g:4871:warning: override: reassigning to symbol STAGING
    1    ./.tmp.config.xS81TWvZ7g:4867:warning: override: reassigning to symbol SECURITYFS
    1    ./.tmp.config.xS81TWvZ7g:4847:warning: override: reassigning to symbol IPV6_GRE
    1    ./.tmp.config.xS81TWvZ7g:4841:warning: override: reassigning to symbol NET_CLS_FLOWER
    1    ./.tmp.config.xS81TWvZ7g:4832:warning: override: reassigning to symbol IPV6
    1    ./.tmp.config.xS81TWvZ7g:4830:warning: override: reassigning to symbol NET_SCH_INGRESS
    1    ./.tmp.config.xS81TWvZ7g:4829:warning: override: reassigning to symbol NET_SCHED
    1    ./.tmp.config.xS81TWvZ7g:4828:warning: override: reassigning to symbol NET_CLS_ACT
    1    ./.tmp.config.xS81TWvZ7g:4826:warning: override: reassigning to symbol CGROUP_BPF
    1    ./.tmp.config.xS81TWvZ7g:4825:warning: override: reassigning to symbol TEST_BPF
    1    ./.tmp.config.xS81TWvZ7g:4822:warning: override: reassigning to symbol BPF_SYSCALL
    1    ./.tmp.config.xS81TWvZ7g:4815:warning: override: reassigning to symbol ANDROID
    1    ./.tmp.config.xS81TWvZ7g:4805:warning: override: reassigning to symbol NOTIFIER_ERROR_INJECTION
    1    ./.tmp.config.xS81TWvZ7g:4794:warning: override: reassigning to symbol USER_NS
    1    ./.tmp.config.xS81TWvZ7g:4686:warning: override: reassigning to symbol NET_NS
    1    ./.tmp.config.xS81TWvZ7g:4682:warning: override: reassigning to symbol USER_NS
    1    ./.tmp.config.xS81TWvZ7g:4657:warning: override: reassigning to symbol NET_ACT_GACT
    1    ./.tmp.config.xS81TWvZ7g:4636:warning: override: reassigning to symbol NET_SCH_INGRESS
    1    ./.tmp.config.xS81TWvZ7g:4578:warning: override: reassigning to symbol VLAN_8021Q
    1    ./.tmp.config.xS81TWvZ7g:4577:warning: override: reassigning to symbol BRIDGE
    1    ./.tmp.config.xS81TWvZ7g:4573:warning: override: reassigning to symbol VETH
    1    ./.tmp.config.xS81TWvZ7g:4572:warning: override: reassigning to symbol IPV6_MULTIPLE_TABLES
    1    ./.tmp.config.xS81TWvZ7g:4570:warning: override: reassigning to symbol NET_L3_MASTER_DEV
    1    ./.tmp.config.xS81TWvZ7g:4569:warning: override: reassigning to symbol NET_VRF
    1    ./.tmp.config.xS81TWvZ7g:4566:warning: override: reassigning to symbol BPF_SYSCALL
    1    ./.tmp.config.rRnaRmJqkB:7968:warning: override: reassigning to symbol USER_NS
    1    ./.tmp.config.rRnaRmJqkB:7951:warning: override: reassigning to symbol ANDROID
    1    ./.tmp.config.rRnaRmJqkB:7950:warning: override: reassigning to symbol STAGING
    1    ./.tmp.config.rRnaRmJqkB:7946:warning: override: reassigning to symbol SECURITYFS
    1    ./.tmp.config.rRnaRmJqkB:7926:warning: override: reassigning to symbol IPV6_GRE
    1    ./.tmp.config.rRnaRmJqkB:7920:warning: override: reassigning to symbol NET_CLS_FLOWER
    1    ./.tmp.config.rRnaRmJqkB:7911:warning: override: reassigning to symbol IPV6
    1    ./.tmp.config.rRnaRmJqkB:7909:warning: override: reassigning to symbol NET_SCH_INGRESS
    1    ./.tmp.config.rRnaRmJqkB:7908:warning: override: reassigning to symbol NET_SCHED
    1    ./.tmp.config.rRnaRmJqkB:7907:warning: override: reassigning to symbol NET_CLS_ACT
    1    ./.tmp.config.rRnaRmJqkB:7905:warning: override: reassigning to symbol CGROUP_BPF
    1    ./.tmp.config.rRnaRmJqkB:7904:warning: override: reassigning to symbol TEST_BPF
    1    ./.tmp.config.rRnaRmJqkB:7901:warning: override: reassigning to symbol BPF_SYSCALL
    1    ./.tmp.config.rRnaRmJqkB:7894:warning: override: reassigning to symbol ANDROID
    1    ./.tmp.config.rRnaRmJqkB:7884:warning: override: reassigning to symbol NOTIFIER_ERROR_INJECTION
    1    ./.tmp.config.rRnaRmJqkB:7873:warning: override: reassigning to symbol USER_NS
    1    ./.tmp.config.rRnaRmJqkB:7765:warning: override: reassigning to symbol NET_NS
    1    ./.tmp.config.rRnaRmJqkB:7761:warning: override: reassigning to symbol USER_NS
    1    ./.tmp.config.rRnaRmJqkB:7736:warning: override: reassigning to symbol NET_ACT_GACT
    1    ./.tmp.config.rRnaRmJqkB:7715:warning: override: reassigning to symbol NET_SCH_INGRESS
    1    ./.tmp.config.rRnaRmJqkB:7657:warning: override: reassigning to symbol VLAN_8021Q
    1    ./.tmp.config.rRnaRmJqkB:7656:warning: override: reassigning to symbol BRIDGE
    1    ./.tmp.config.rRnaRmJqkB:7652:warning: override: reassigning to symbol VETH
    1    ./.tmp.config.rRnaRmJqkB:7651:warning: override: reassigning to symbol IPV6_MULTIPLE_TABLES
    1    ./.tmp.config.rRnaRmJqkB:7649:warning: override: reassigning to symbol NET_L3_MASTER_DEV
    1    ./.tmp.config.rRnaRmJqkB:7648:warning: override: reassigning to symbol NET_VRF
    1    ./.tmp.config.rRnaRmJqkB:7645:warning: override: reassigning to symbol BPF_SYSCALL
    1    ./.tmp.config.Sh6OL8tr7w:8567:warning: override: reassigning to symbol USER_NS
    1    ./.tmp.config.Sh6OL8tr7w:8550:warning: override: reassigning to symbol ANDROID
    1    ./.tmp.config.Sh6OL8tr7w:8549:warning: override: reassigning to symbol STAGING
    1    ./.tmp.config.Sh6OL8tr7w:8545:warning: override: reassigning to symbol SECURITYFS
    1    ./.tmp.config.Sh6OL8tr7w:8525:warning: override: reassigning to symbol IPV6_GRE
    1    ./.tmp.config.Sh6OL8tr7w:8519:warning: override: reassigning to symbol NET_CLS_FLOWER
    1    ./.tmp.config.Sh6OL8tr7w:8510:warning: override: reassigning to symbol IPV6
    1    ./.tmp.config.Sh6OL8tr7w:8508:warning: override: reassigning to symbol NET_SCH_INGRESS
    1    ./.tmp.config.Sh6OL8tr7w:8507:warning: override: reassigning to symbol NET_SCHED
    1    ./.tmp.config.Sh6OL8tr7w:8506:warning: override: reassigning to symbol NET_CLS_ACT
    1    ./.tmp.config.Sh6OL8tr7w:8504:warning: override: reassigning to symbol CGROUP_BPF
    1    ./.tmp.config.Sh6OL8tr7w:8503:warning: override: reassigning to symbol TEST_BPF
    1    ./.tmp.config.Sh6OL8tr7w:8500:warning: override: reassigning to symbol BPF_SYSCALL
    1    ./.tmp.config.Sh6OL8tr7w:8493:warning: override: reassigning to symbol ANDROID
    1    ./.tmp.config.Sh6OL8tr7w:8483:warning: override: reassigning to symbol NOTIFIER_ERROR_INJECTION
    1    ./.tmp.config.Sh6OL8tr7w:8472:warning: override: reassigning to symbol USER_NS
    1    ./.tmp.config.Sh6OL8tr7w:8364:warning: override: reassigning to symbol NET_NS
    1    ./.tmp.config.Sh6OL8tr7w:8360:warning: override: reassigning to symbol USER_NS
    1    ./.tmp.config.Sh6OL8tr7w:8335:warning: override: reassigning to symbol NET_ACT_GACT
    1    ./.tmp.config.Sh6OL8tr7w:8314:warning: override: reassigning to symbol NET_SCH_INGRESS
    1    ./.tmp.config.Sh6OL8tr7w:8256:warning: override: reassigning to symbol VLAN_8021Q
    1    ./.tmp.config.Sh6OL8tr7w:8255:warning: override: reassigning to symbol BRIDGE
    1    ./.tmp.config.Sh6OL8tr7w:8251:warning: override: reassigning to symbol VETH
    1    ./.tmp.config.Sh6OL8tr7w:8250:warning: override: reassigning to symbol IPV6_MULTIPLE_TABLES
    1    ./.tmp.config.Sh6OL8tr7w:8248:warning: override: reassigning to symbol NET_L3_MASTER_DEV
    1    ./.tmp.config.Sh6OL8tr7w:8247:warning: override: reassigning to symbol NET_VRF
    1    ./.tmp.config.Sh6OL8tr7w:8244:warning: override: reassigning to symbol BPF_SYSCALL
    1    ./.tmp.config.F2JOsCoGYv:1745:warning: override: reassigning to symbol USER_NS
    1    ./.tmp.config.F2JOsCoGYv:1728:warning: override: reassigning to symbol ANDROID
    1    ./.tmp.config.F2JOsCoGYv:1727:warning: override: reassigning to symbol STAGING
    1    ./.tmp.config.F2JOsCoGYv:1723:warning: override: reassigning to symbol SECURITYFS
    1    ./.tmp.config.F2JOsCoGYv:1703:warning: override: reassigning to symbol IPV6_GRE
    1    ./.tmp.config.F2JOsCoGYv:1697:warning: override: reassigning to symbol NET_CLS_FLOWER
    1    ./.tmp.config.F2JOsCoGYv:1688:warning: override: reassigning to symbol IPV6
    1    ./.tmp.config.F2JOsCoGYv:1686:warning: override: reassigning to symbol NET_SCH_INGRESS
    1    ./.tmp.config.F2JOsCoGYv:1685:warning: override: reassigning to symbol NET_SCHED
    1    ./.tmp.config.F2JOsCoGYv:1684:warning: override: reassigning to symbol NET_CLS_ACT
    1    ./.tmp.config.F2JOsCoGYv:1682:warning: override: reassigning to symbol CGROUP_BPF
    1    ./.tmp.config.F2JOsCoGYv:1681:warning: override: reassigning to symbol TEST_BPF
    1    ./.tmp.config.F2JOsCoGYv:1678:warning: override: reassigning to symbol BPF_SYSCALL
    1    ./.tmp.config.F2JOsCoGYv:1671:warning: override: reassigning to symbol ANDROID
    1    ./.tmp.config.F2JOsCoGYv:1661:warning: override: reassigning to symbol NOTIFIER_ERROR_INJECTION
    1    ./.tmp.config.F2JOsCoGYv:1650:warning: override: reassigning to symbol USER_NS
    1    ./.tmp.config.F2JOsCoGYv:1542:warning: override: reassigning to symbol NET_NS
    1    ./.tmp.config.F2JOsCoGYv:1538:warning: override: reassigning to symbol USER_NS
    1    ./.tmp.config.F2JOsCoGYv:1513:warning: override: reassigning to symbol NET_ACT_GACT
    1    ./.tmp.config.F2JOsCoGYv:1492:warning: override: reassigning to symbol NET_SCH_INGRESS
    1    ./.tmp.config.F2JOsCoGYv:1434:warning: override: reassigning to symbol VLAN_8021Q
    1    ./.tmp.config.F2JOsCoGYv:1433:warning: override: reassigning to symbol BRIDGE
    1    ./.tmp.config.F2JOsCoGYv:1429:warning: override: reassigning to symbol VETH
    1    ./.tmp.config.F2JOsCoGYv:1428:warning: override: reassigning to symbol IPV6_MULTIPLE_TABLES
    1    ./.tmp.config.F2JOsCoGYv:1426:warning: override: reassigning to symbol NET_L3_MASTER_DEV
    1    ./.tmp.config.F2JOsCoGYv:1425:warning: override: reassigning to symbol NET_VRF
    1    ./.tmp.config.F2JOsCoGYv:1422:warning: override: reassigning to symbol BPF_SYSCALL
    1    ./.tmp.config.E7aIuocGWT:3979:warning: override: reassigning to symbol USER_NS
    1    ./.tmp.config.E7aIuocGWT:3962:warning: override: reassigning to symbol ANDROID
    1    ./.tmp.config.E7aIuocGWT:3961:warning: override: reassigning to symbol STAGING
    1    ./.tmp.config.E7aIuocGWT:3957:warning: override: reassigning to symbol SECURITYFS
    1    ./.tmp.config.E7aIuocGWT:3937:warning: override: reassigning to symbol IPV6_GRE
    1    ./.tmp.config.E7aIuocGWT:3931:warning: override: reassigning to symbol NET_CLS_FLOWER
    1    ./.tmp.config.E7aIuocGWT:3922:warning: override: reassigning to symbol IPV6
    1    ./.tmp.config.E7aIuocGWT:3920:warning: override: reassigning to symbol NET_SCH_INGRESS
    1    ./.tmp.config.E7aIuocGWT:3919:warning: override: reassigning to symbol NET_SCHED
    1    ./.tmp.config.E7aIuocGWT:3918:warning: override: reassigning to symbol NET_CLS_ACT
    1    ./.tmp.config.E7aIuocGWT:3916:warning: override: reassigning to symbol CGROUP_BPF
    1    ./.tmp.config.E7aIuocGWT:3915:warning: override: reassigning to symbol TEST_BPF
    1    ./.tmp.config.E7aIuocGWT:3912:warning: override: reassigning to symbol BPF_SYSCALL
    1    ./.tmp.config.E7aIuocGWT:3905:warning: override: reassigning to symbol ANDROID
    1    ./.tmp.config.E7aIuocGWT:3895:warning: override: reassigning to symbol NOTIFIER_ERROR_INJECTION
    1    ./.tmp.config.E7aIuocGWT:3884:warning: override: reassigning to symbol USER_NS
    1    ./.tmp.config.E7aIuocGWT:3776:warning: override: reassigning to symbol NET_NS
    1    ./.tmp.config.E7aIuocGWT:3772:warning: override: reassigning to symbol USER_NS
    1    ./.tmp.config.E7aIuocGWT:3747:warning: override: reassigning to symbol NET_ACT_GACT
    1    ./.tmp.config.E7aIuocGWT:3726:warning: override: reassigning to symbol NET_SCH_INGRESS
    1    ./.tmp.config.E7aIuocGWT:3668:warning: override: reassigning to symbol VLAN_8021Q
    1    ./.tmp.config.E7aIuocGWT:3667:warning: override: reassigning to symbol BRIDGE
    1    ./.tmp.config.E7aIuocGWT:3663:warning: override: reassigning to symbol VETH
    1    ./.tmp.config.E7aIuocGWT:3662:warning: override: reassigning to symbol IPV6_MULTIPLE_TABLES
    1    ./.tmp.config.E7aIuocGWT:3660:warning: override: reassigning to symbol NET_L3_MASTER_DEV
    1    ./.tmp.config.E7aIuocGWT:3659:warning: override: reassigning to symbol NET_VRF
    1    ./.tmp.config.E7aIuocGWT:3656:warning: override: reassigning to symbol BPF_SYSCALL
    1    ./.tmp.config.DdFVv0mEMi:4826:warning: override: reassigning to symbol USER_NS
    1    ./.tmp.config.DdFVv0mEMi:4809:warning: override: reassigning to symbol ANDROID
    1    ./.tmp.config.DdFVv0mEMi:4808:warning: override: reassigning to symbol STAGING
    1    ./.tmp.config.DdFVv0mEMi:4804:warning: override: reassigning to symbol SECURITYFS
    1    ./.tmp.config.DdFVv0mEMi:4784:warning: override: reassigning to symbol IPV6_GRE
    1    ./.tmp.config.DdFVv0mEMi:4778:warning: override: reassigning to symbol NET_CLS_FLOWER
    1    ./.tmp.config.DdFVv0mEMi:4769:warning: override: reassigning to symbol IPV6
    1    ./.tmp.config.DdFVv0mEMi:4767:warning: override: reassigning to symbol NET_SCH_INGRESS
    1    ./.tmp.config.DdFVv0mEMi:4766:warning: override: reassigning to symbol NET_SCHED
    1    ./.tmp.config.DdFVv0mEMi:4765:warning: override: reassigning to symbol NET_CLS_ACT
    1    ./.tmp.config.DdFVv0mEMi:4763:warning: override: reassigning to symbol CGROUP_BPF
    1    ./.tmp.config.DdFVv0mEMi:4762:warning: override: reassigning to symbol TEST_BPF
    1    ./.tmp.config.DdFVv0mEMi:4759:warning: override: reassigning to symbol BPF_SYSCALL
    1    ./.tmp.config.DdFVv0mEMi:4752:warning: override: reassigning to symbol ANDROID
    1    ./.tmp.config.DdFVv0mEMi:4742:warning: override: reassigning to symbol NOTIFIER_ERROR_INJECTION
    1    ./.tmp.config.DdFVv0mEMi:4731:warning: override: reassigning to symbol USER_NS
    1    ./.tmp.config.DdFVv0mEMi:4623:warning: override: reassigning to symbol NET_NS
    1    ./.tmp.config.DdFVv0mEMi:4619:warning: override: reassigning to symbol USER_NS
    1    ./.tmp.config.DdFVv0mEMi:4594:warning: override: reassigning to symbol NET_ACT_GACT
    1    ./.tmp.config.DdFVv0mEMi:4573:warning: override: reassigning to symbol NET_SCH_INGRESS
    1    ./.tmp.config.DdFVv0mEMi:4515:warning: override: reassigning to symbol VLAN_8021Q
    1    ./.tmp.config.DdFVv0mEMi:4514:warning: override: reassigning to symbol BRIDGE
    1    ./.tmp.config.DdFVv0mEMi:4510:warning: override: reassigning to symbol VETH
    1    ./.tmp.config.DdFVv0mEMi:4509:warning: override: reassigning to symbol IPV6_MULTIPLE_TABLES
    1    ./.tmp.config.DdFVv0mEMi:4507:warning: override: reassigning to symbol NET_L3_MASTER_DEV
    1    ./.tmp.config.DdFVv0mEMi:4506:warning: override: reassigning to symbol NET_VRF
    1    ./.tmp.config.DdFVv0mEMi:4503:warning: override: reassigning to symbol BPF_SYSCALL
    1    ./.tmp.config.0Dg98F3fQN:3365:warning: override: reassigning to symbol USER_NS
    1    ./.tmp.config.0Dg98F3fQN:3348:warning: override: reassigning to symbol ANDROID
    1    ./.tmp.config.0Dg98F3fQN:3347:warning: override: reassigning to symbol STAGING
    1    ./.tmp.config.0Dg98F3fQN:3343:warning: override: reassigning to symbol SECURITYFS
    1    ./.tmp.config.0Dg98F3fQN:3323:warning: override: reassigning to symbol IPV6_GRE
    1    ./.tmp.config.0Dg98F3fQN:3317:warning: override: reassigning to symbol NET_CLS_FLOWER
    1    ./.tmp.config.0Dg98F3fQN:3308:warning: override: reassigning to symbol IPV6
    1    ./.tmp.config.0Dg98F3fQN:3306:warning: override: reassigning to symbol NET_SCH_INGRESS
    1    ./.tmp.config.0Dg98F3fQN:3305:warning: override: reassigning to symbol NET_SCHED
    1    ./.tmp.config.0Dg98F3fQN:3304:warning: override: reassigning to symbol NET_CLS_ACT
    1    ./.tmp.config.0Dg98F3fQN:3302:warning: override: reassigning to symbol CGROUP_BPF
    1    ./.tmp.config.0Dg98F3fQN:3301:warning: override: reassigning to symbol TEST_BPF
    1    ./.tmp.config.0Dg98F3fQN:3298:warning: override: reassigning to symbol BPF_SYSCALL
    1    ./.tmp.config.0Dg98F3fQN:3291:warning: override: reassigning to symbol ANDROID
    1    ./.tmp.config.0Dg98F3fQN:3281:warning: override: reassigning to symbol NOTIFIER_ERROR_INJECTION
    1    ./.tmp.config.0Dg98F3fQN:3270:warning: override: reassigning to symbol USER_NS
    1    ./.tmp.config.0Dg98F3fQN:3162:warning: override: reassigning to symbol NET_NS
    1    ./.tmp.config.0Dg98F3fQN:3158:warning: override: reassigning to symbol USER_NS
    1    ./.tmp.config.0Dg98F3fQN:3133:warning: override: reassigning to symbol NET_ACT_GACT
    1    ./.tmp.config.0Dg98F3fQN:3112:warning: override: reassigning to symbol NET_SCH_INGRESS
    1    ./.tmp.config.0Dg98F3fQN:3054:warning: override: reassigning to symbol VLAN_8021Q
    1    ./.tmp.config.0Dg98F3fQN:3053:warning: override: reassigning to symbol BRIDGE
    1    ./.tmp.config.0Dg98F3fQN:3049:warning: override: reassigning to symbol VETH
    1    ./.tmp.config.0Dg98F3fQN:3048:warning: override: reassigning to symbol IPV6_MULTIPLE_TABLES
    1    ./.tmp.config.0Dg98F3fQN:3046:warning: override: reassigning to symbol NET_L3_MASTER_DEV
    1    ./.tmp.config.0Dg98F3fQN:3045:warning: override: reassigning to symbol NET_VRF
    1    ./.tmp.config.0Dg98F3fQN:3042:warning: override: reassigning to symbol BPF_SYSCALL

Section mismatches summary:

    5    WARNING: vmlinux.o(.text.unlikely+0x8c4): Section mismatch in reference from the function free_memmap() to the function .meminit.text:memblock_free()
    3    WARNING: vmlinux.o(.text.unlikely+0x84c): Section mismatch in reference from the function free_memmap() to the function .meminit.text:memblock_free()
    3    WARNING: vmlinux.o(.text.unlikely+0x840): Section mismatch in reference from the function free_memmap() to the function .meminit.text:memblock_free()
    1    WARNING: vmlinux.o(.text.unlikely+0x8e4): Section mismatch in reference from the function free_memmap() to the function .meminit.text:memblock_free()
    1    WARNING: vmlinux.o(.text.unlikely+0x7c8): Section mismatch in reference from the function free_memmap() to the function .meminit.text:memblock_free()
    1    WARNING: vmlinux.o(.text.unlikely+0x710): Section mismatch in reference from the function free_memmap() to the function .meminit.text:memblock_free()
    1    WARNING: vmlinux.o(.text.unlikely+0x3630): Section mismatch in reference from the function pmax_setup_memory_region() to the function .init.text:add_memory_region()
    1    WARNING: vmlinux.o(.text.unlikely+0x3320): Section mismatch in reference from the function pmax_setup_memory_region() to the function .init.text:add_memory_region()

================================================================================

Detailed per-defconfig build reports:

--------------------------------------------------------------------------------
32r2el_defconfig (mips, gcc-8) — PASS, 0 errors, 0 warnings, 0 section mismatches

--------------------------------------------------------------------------------
32r2el_defconfig+kselftest (mips, gcc-8) — PASS, 0 errors, 28 warnings, 0 section mismatches

Warnings:
    ./.tmp.config.E7aIuocGWT:3656:warning: override: reassigning to symbol BPF_SYSCALL
    ./.tmp.config.E7aIuocGWT:3659:warning: override: reassigning to symbol NET_VRF
    ./.tmp.config.E7aIuocGWT:3660:warning: override: reassigning to symbol NET_L3_MASTER_DEV
    ./.tmp.config.E7aIuocGWT:3662:warning: override: reassigning to symbol IPV6_MULTIPLE_TABLES
    ./.tmp.config.E7aIuocGWT:3663:warning: override: reassigning to symbol VETH
    ./.tmp.config.E7aIuocGWT:3667:warning: override: reassigning to symbol BRIDGE
    ./.tmp.config.E7aIuocGWT:3668:warning: override: reassigning to symbol VLAN_8021Q
    ./.tmp.config.E7aIuocGWT:3726:warning: override: reassigning to symbol NET_SCH_INGRESS
    ./.tmp.config.E7aIuocGWT:3747:warning: override: reassigning to symbol NET_ACT_GACT
    ./.tmp.config.E7aIuocGWT:3772:warning: override: reassigning to symbol USER_NS
    ./.tmp.config.E7aIuocGWT:3776:warning: override: reassigning to symbol NET_NS
    ./.tmp.config.E7aIuocGWT:3884:warning: override: reassigning to symbol USER_NS
    ./.tmp.config.E7aIuocGWT:3895:warning: override: reassigning to symbol NOTIFIER_ERROR_INJECTION
    ./.tmp.config.E7aIuocGWT:3905:warning: override: reassigning to symbol ANDROID
    ./.tmp.config.E7aIuocGWT:3912:warning: override: reassigning to symbol BPF_SYSCALL
    ./.tmp.config.E7aIuocGWT:3915:warning: override: reassigning to symbol TEST_BPF
    ./.tmp.config.E7aIuocGWT:3916:warning: override: reassigning to symbol CGROUP_BPF
    ./.tmp.config.E7aIuocGWT:3918:warning: override: reassigning to symbol NET_CLS_ACT
    ./.tmp.config.E7aIuocGWT:3919:warning: override: reassigning to symbol NET_SCHED
    ./.tmp.config.E7aIuocGWT:3920:warning: override: reassigning to symbol NET_SCH_INGRESS
    ./.tmp.config.E7aIuocGWT:3922:warning: override: reassigning to symbol IPV6
    ./.tmp.config.E7aIuocGWT:3931:warning: override: reassigning to symbol NET_CLS_FLOWER
    ./.tmp.config.E7aIuocGWT:3937:warning: override: reassigning to symbol IPV6_GRE
    ./.tmp.config.E7aIuocGWT:3957:warning: override: reassigning to symbol SECURITYFS
    ./.tmp.config.E7aIuocGWT:3961:warning: override: reassigning to symbol STAGING
    ./.tmp.config.E7aIuocGWT:3962:warning: override: reassigning to symbol ANDROID
    ./.tmp.config.E7aIuocGWT:3979:warning: override: reassigning to symbol USER_NS
    include/linux/kern_levels.h:5:18: warning: format '%lu' expects argument of type 'long unsigned int', but argument 8 has type 'unsigned int' [-Wformat=]

--------------------------------------------------------------------------------
allmodconfig (arm, gcc-8) — PASS, 0 errors, 19 warnings, 0 section mismatches

Warnings:
    /tmp/ccWqXYtW.s:18119: Warning: using r15 results in unpredictable behaviour
    /tmp/ccWqXYtW.s:18191: Warning: using r15 results in unpredictable behaviour
    include/linux/kern_levels.h:5:18: warning: format '%lu' expects argument of type 'long unsigned int', but argument 8 has type 'unsigned int' [-Wformat=]
    sound/soc/codecs/rt5677-spi.c:114:30: warning: unused variable 'rtd' [-Wunused-variable]
    drivers/net/phy/mdio-cavium.h:114:37: warning: cast to pointer from integer of different size [-Wint-to-pointer-cast]
    drivers/net/phy/mdio-cavium.h:113:48: warning: cast to pointer from integer of different size [-Wint-to-pointer-cast]
    drivers/net/phy/mdio-cavium.h:113:48: warning: cast to pointer from integer of different size [-Wint-to-pointer-cast]
    drivers/net/phy/mdio-cavium.h:113:48: warning: cast to pointer from integer of different size [-Wint-to-pointer-cast]
    drivers/net/phy/mdio-cavium.h:114:37: warning: cast to pointer from integer of different size [-Wint-to-pointer-cast]
    drivers/net/phy/mdio-cavium.h:113:48: warning: cast to pointer from integer of different size [-Wint-to-pointer-cast]
    drivers/net/phy/mdio-cavium.h:114:37: warning: cast to pointer from integer of different size [-Wint-to-pointer-cast]
    drivers/net/phy/mdio-cavium.h:113:48: warning: cast to pointer from integer of different size [-Wint-to-pointer-cast]
    drivers/net/phy/mdio-cavium.h:113:48: warning: cast to pointer from integer of different size [-Wint-to-pointer-cast]
    drivers/net/phy/mdio-cavium.h:114:37: warning: cast to pointer from integer of different size [-Wint-to-pointer-cast]
    drivers/net/phy/mdio-octeon.c:48:3: warning: cast from pointer to integer of different size [-Wpointer-to-int-cast]
    drivers/net/phy/mdio-cavium.h:113:48: warning: cast to pointer from integer of different size [-Wint-to-pointer-cast]
    drivers/net/phy/mdio-cavium.h:113:48: warning: cast to pointer from integer of different size [-Wint-to-pointer-cast]
    drivers/net/phy/mdio-cavium.h:113:48: warning: cast to pointer from integer of different size [-Wint-to-pointer-cast]
    warning: same module names found:

--------------------------------------------------------------------------------
allmodconfig (arm64, clang-8) — FAIL, 9 errors, 48 warnings, 0 section mismatches

Errors:
    ERROR: "dpdmai_reset" [drivers/dma/fsl-dpaa2-qdma/dpaa2-qdma.ko] undefined!
    ERROR: "dpdmai_set_rx_queue" [drivers/dma/fsl-dpaa2-qdma/dpaa2-qdma.ko] undefined!
    ERROR: "dpdmai_get_tx_queue" [drivers/dma/fsl-dpaa2-qdma/dpaa2-qdma.ko] undefined!
    ERROR: "dpdmai_get_rx_queue" [drivers/dma/fsl-dpaa2-qdma/dpaa2-qdma.ko] undefined!
    ERROR: "dpdmai_get_attributes" [drivers/dma/fsl-dpaa2-qdma/dpaa2-qdma.ko] undefined!
    ERROR: "dpdmai_open" [drivers/dma/fsl-dpaa2-qdma/dpaa2-qdma.ko] undefined!
    ERROR: "dpdmai_disable" [drivers/dma/fsl-dpaa2-qdma/dpaa2-qdma.ko] undefined!
    ERROR: "dpdmai_close" [drivers/dma/fsl-dpaa2-qdma/dpaa2-qdma.ko] undefined!
    ERROR: "dpdmai_enable" [drivers/dma/fsl-dpaa2-qdma/dpaa2-qdma.ko] undefined!

Warnings:
    mm/shmem.c:2737:35: warning: variable 'shmem_falloc_waitq' is uninitialized when used within its own initialization [-Wuninitialized]
    1 warning generated.
    fs/proc/base.c:1894:35: warning: variable 'wq' is uninitialized when used within its own initialization [-Wuninitialized]
    1 warning generated.
    fs/proc/proc_sysctl.c:705:35: warning: variable 'wq' is uninitialized when used within its own initialization [-Wuninitialized]
    1 warning generated.
    fs/namei.c:1644:34: warning: variable 'wq' is uninitialized when used within its own initialization [-Wuninitialized]
    fs/namei.c:3132:34: warning: variable 'wq' is uninitialized when used within its own initialization [-Wuninitialized]
    2 warnings generated.
    drivers/android/binderfs.c:657:41: warning: suggest braces around initialization of subobject [-Wmissing-braces]
    1 warning generated.
    fs/afs/dir_silly.c:205:34: warning: variable 'wq' is uninitialized when used within its own initialization [-Wuninitialized]
    1 warning generated.
    fs/cifs/readdir.c:83:34: warning: variable 'wq' is uninitialized when used within its own initialization [-Wuninitialized]
    1 warning generated.
    fs/fuse/readdir.c:161:34: warning: variable 'wq' is uninitialized when used within its own initialization [-Wuninitialized]
    1 warning generated.
    drivers/bluetooth/bluecard_cs.c:282:36: warning: variable 'wq' is uninitialized when used within its own initialization [-Wuninitialized]
    1 warning generated.
    fs/nfs/dir.c:448:34: warning: variable 'wq' is uninitialized when used within its own initialization [-Wuninitialized]
    fs/nfs/dir.c:1499:34: warning: variable 'wq' is uninitialized when used within its own initialization [-Wuninitialized]
    2 warnings generated.
    drivers/dma/fsl-dpaa2-qdma/dpdmai.c:148:20: warning: variable 'cmd' is uninitialized when used within its own initialization [-Wuninitialized]
    drivers/dma/fsl-dpaa2-qdma/dpdmai.c:148:25: warning: variable 'cfg' is uninitialized when used within its own initialization [-Wuninitialized]
    2 warnings generated.
    sound/soc/codecs/rt5677-spi.c:114:30: warning: unused variable 'rtd' [-Wunused-variable]
    1 warning generated.
    drivers/gpu/host1x/syncpt.c:208:34: warning: variable 'wq' is uninitialized when used within its own initialization [-Wuninitialized]
    1 warning generated.
    drivers/gpu/drm/amd/amdgpu/../powerplay/renoir_ppt.c:182:26: warning: suggest braces around initialization of subobject [-Wmissing-braces]
    1 warning generated.
    net/nfc/hci/command.c:59:34: warning: variable 'ew_wq' is uninitialized when used within its own initialization [-Wuninitialized]
    1 warning generated.
    net/nfc/hci/llc_shdlc.c:687:34: warning: variable 'connect_wq' is uninitialized when used within its own initialization [-Wuninitialized]
    1 warning generated.
    drivers/misc/mic/vop/vop_vringh.c:155:34: warning: variable 'wake' is uninitialized when used within its own initialization [-Wuninitialized]
    drivers/misc/mic/vop/vop_vringh.c:399:34: warning: variable 'wake' is uninitialized when used within its own initialization [-Wuninitialized]
    2 warnings generated.
    drivers/net/usb/lan78xx.c:2662:34: warning: variable 'unlink_wakeup' is uninitialized when used within its own initialization [-Wuninitialized]
    1 warning generated.
    drivers/scsi/bfa/bfad_im.c:301:34: warning: variable 'wq' is uninitialized when used within its own initialization [-Wuninitialized]
    drivers/scsi/bfa/bfad_im.c:378:34: warning: variable 'wq' is uninitialized when used within its own initialization [-Wuninitialized]
    2 warnings generated.
    drivers/scsi/lpfc/lpfc_sli.c:11855:34: warning: variable 'done_q' is uninitialized when used within its own initialization [-Wuninitialized]
    1 warning generated.
    drivers/scsi/lpfc/lpfc_scsi.c:4722:34: warning: variable 'waitq' is uninitialized when used within its own initialization [-Wuninitialized]
    1 warning generated.
    WARNING: modpost: missing MODULE_LICENSE() in drivers/dma/fsl-dpaa2-qdma/dpdmai.o

--------------------------------------------------------------------------------
allmodconfig (arm64, gcc-8) — FAIL, 9 errors, 2 warnings, 0 section mismatches

Errors:
    ERROR: "dpdmai_enable" [drivers/dma/fsl-dpaa2-qdma/dpaa2-qdma.ko] undefined!
    ERROR: "dpdmai_set_rx_queue" [drivers/dma/fsl-dpaa2-qdma/dpaa2-qdma.ko] undefined!
    ERROR: "dpdmai_get_tx_queue" [drivers/dma/fsl-dpaa2-qdma/dpaa2-qdma.ko] undefined!
    ERROR: "dpdmai_get_rx_queue" [drivers/dma/fsl-dpaa2-qdma/dpaa2-qdma.ko] undefined!
    ERROR: "dpdmai_get_attributes" [drivers/dma/fsl-dpaa2-qdma/dpaa2-qdma.ko] undefined!
    ERROR: "dpdmai_open" [drivers/dma/fsl-dpaa2-qdma/dpaa2-qdma.ko] undefined!
    ERROR: "dpdmai_close" [drivers/dma/fsl-dpaa2-qdma/dpaa2-qdma.ko] undefined!
    ERROR: "dpdmai_disable" [drivers/dma/fsl-dpaa2-qdma/dpaa2-qdma.ko] undefined!
    ERROR: "dpdmai_reset" [drivers/dma/fsl-dpaa2-qdma/dpaa2-qdma.ko] undefined!

Warnings:
    sound/soc/codecs/rt5677-spi.c:114:30: warning: unused variable 'rtd' [-Wunused-variable]
    WARNING: modpost: missing MODULE_LICENSE() in drivers/dma/fsl-dpaa2-qdma/dpdmai.o

--------------------------------------------------------------------------------
allmodconfig (x86_64, gcc-8) — PASS, 0 errors, 1 warning, 0 section mismatches

Warnings:
    sound/soc/codecs/rt5677-spi.c:114:30: warning: unused variable 'rtd' [-Wunused-variable]

--------------------------------------------------------------------------------
allnoconfig (arc, gcc-8) — PASS, 0 errors, 1 warning, 0 section mismatches

Warnings:
    <stdin>:1511:2: warning: #warning syscall clone3 not implemented [-Wcpp]

--------------------------------------------------------------------------------
allnoconfig (arm64, gcc-8) — PASS, 0 errors, 0 warnings, 0 section mismatches

--------------------------------------------------------------------------------
allnoconfig (arm, gcc-8) — PASS, 0 errors, 0 warnings, 0 section mismatches

--------------------------------------------------------------------------------
allnoconfig (riscv, gcc-8) — PASS, 0 errors, 0 warnings, 0 section mismatches

--------------------------------------------------------------------------------
allnoconfig (mips, gcc-8) — PASS, 0 errors, 0 warnings, 0 section mismatches

--------------------------------------------------------------------------------
allnoconfig (arm64, clang-8) — PASS, 0 errors, 0 warnings, 0 section mismatches

--------------------------------------------------------------------------------
allnoconfig (i386, gcc-8) — PASS, 0 errors, 0 warnings, 0 section mismatches

--------------------------------------------------------------------------------
allnoconfig (x86_64, gcc-8) — PASS, 0 errors, 0 warnings, 0 section mismatches

--------------------------------------------------------------------------------
am200epdkit_defconfig (arm, gcc-8) — PASS, 0 errors, 1 warning, 0 section mismatches

Warnings:
    WARNING: "return_address" [vmlinux] is a static EXPORT_SYMBOL_GPL

--------------------------------------------------------------------------------
ar7_defconfig (mips, gcc-8) — PASS, 0 errors, 0 warnings, 0 section mismatches

--------------------------------------------------------------------------------
aspeed_g4_defconfig (arm, gcc-8) — PASS, 0 errors, 0 warnings, 0 section mismatches

--------------------------------------------------------------------------------
aspeed_g5_defconfig (arm, gcc-8) — PASS, 0 errors, 0 warnings, 0 section mismatches

--------------------------------------------------------------------------------
assabet_defconfig (arm, gcc-8) — PASS, 0 errors, 0 warnings, 0 section mismatches

Section mismatches:
    WARNING: vmlinux.o(.text.unlikely+0x8c4): Section mismatch in reference from the function free_memmap() to the function .meminit.text:memblock_free()

--------------------------------------------------------------------------------
at91_dt_defconfig (arm, gcc-8) — PASS, 0 errors, 1 warning, 0 section mismatches

Warnings:
    WARNING: "return_address" [vmlinux] is a static EXPORT_SYMBOL_GPL

--------------------------------------------------------------------------------
ath25_defconfig (mips, gcc-8) — PASS, 0 errors, 0 warnings, 0 section mismatches

--------------------------------------------------------------------------------
ath79_defconfig (mips, gcc-8) — PASS, 0 errors, 0 warnings, 0 section mismatches

--------------------------------------------------------------------------------
axm55xx_defconfig (arm, gcc-8) — PASS, 0 errors, 1 warning, 0 section mismatches

Warnings:
    WARNING: "return_address" [vmlinux] is a static EXPORT_SYMBOL_GPL

--------------------------------------------------------------------------------
axs103_defconfig (arc, gcc-8) — PASS, 0 errors, 2 warnings, 0 section mismatches

Warnings:
    <stdin>:1511:2: warning: #warning syscall clone3 not implemented [-Wcpp]
    <stdin>:1511:2: warning: #warning syscall clone3 not implemented [-Wcpp]

--------------------------------------------------------------------------------
axs103_smp_defconfig (arc, gcc-8) — PASS, 0 errors, 2 warnings, 0 section mismatches

Warnings:
    <stdin>:1511:2: warning: #warning syscall clone3 not implemented [-Wcpp]
    <stdin>:1511:2: warning: #warning syscall clone3 not implemented [-Wcpp]

--------------------------------------------------------------------------------
badge4_defconfig (arm, gcc-8) — PASS, 0 errors, 0 warnings, 0 section mismatches

Section mismatches:
    WARNING: vmlinux.o(.text.unlikely+0x84c): Section mismatch in reference from the function free_memmap() to the function .meminit.text:memblock_free()

--------------------------------------------------------------------------------
bcm2835_defconfig (arm, gcc-8) — PASS, 0 errors, 3 warnings, 0 section mismatches

Warnings:
    kernel/debug/debug_core.c:452:17: warning: array subscript [0, 0] is outside array bounds of 'struct debuggerinfo_struct[1]' [-Warray-bounds]
    kernel/debug/debug_core.c:469:33: warning: array subscript [0, 0] is outside array bounds of 'struct debuggerinfo_struct[1]' [-Warray-bounds]
    kernel/debug/debug_core.c:470:18: warning: array subscript [0, 0] is outside array bounds of 'struct debuggerinfo_struct[1]' [-Warray-bounds]

--------------------------------------------------------------------------------
bcm47xx_defconfig (mips, gcc-8) — PASS, 0 errors, 0 warnings, 0 section mismatches

--------------------------------------------------------------------------------
bcm63xx_defconfig (mips, gcc-8) — PASS, 0 errors, 0 warnings, 0 section mismatches

--------------------------------------------------------------------------------
bigsur_defconfig (mips, gcc-8) — PASS, 0 errors, 0 warnings, 0 section mismatches

--------------------------------------------------------------------------------
bmips_be_defconfig (mips, gcc-8) — PASS, 0 errors, 0 warnings, 0 section mismatches

--------------------------------------------------------------------------------
bmips_stb_defconfig (mips, gcc-8) — PASS, 0 errors, 0 warnings, 0 section mismatches

--------------------------------------------------------------------------------
capcella_defconfig (mips, gcc-8) — PASS, 0 errors, 0 warnings, 0 section mismatches

--------------------------------------------------------------------------------
cavium_octeon_defconfig (mips, gcc-8) — FAIL, 4 errors, 3 warnings, 0 section mismatches

Errors:
    drivers/staging/octeon/ethernet.c:177:21: error: dereferencing pointer to incomplete type 'struct cvmx_wqe'
    drivers/staging/octeon/ethernet.c:463:30: error: storage size of 'link_info' isn't known
    drivers/staging/octeon/ethernet.c:499:30: error: storage size of 'link_info' isn't known
    drivers/staging/octeon/ethernet.c:516:29: error: type of formal parameter 2 is incomplete

Warnings:
    drivers/staging/octeon/octeon-ethernet.h:94:12: warning: 'union cvmx_helper_link_info' declared inside parameter list will not be visible outside of this definition or declaration
    drivers/staging/octeon/ethernet.c:463:30: warning: unused variable 'link_info' [-Wunused-variable]
    drivers/staging/octeon/ethernet.c:499:30: warning: unused variable 'link_info' [-Wunused-variable]

--------------------------------------------------------------------------------
cerfcube_defconfig (arm, gcc-8) — PASS, 0 errors, 0 warnings, 0 section mismatches

Section mismatches:
    WARNING: vmlinux.o(.text.unlikely+0x84c): Section mismatch in reference from the function free_memmap() to the function .meminit.text:memblock_free()

--------------------------------------------------------------------------------
ci20_defconfig (mips, gcc-8) — PASS, 0 errors, 0 warnings, 0 section mismatches

--------------------------------------------------------------------------------
clps711x_defconfig (arm, gcc-8) — PASS, 0 errors, 0 warnings, 0 section mismatches

--------------------------------------------------------------------------------
cm_x2xx_defconfig (arm, gcc-8) — PASS, 0 errors, 1 warning, 0 section mismatches

Warnings:
    WARNING: "return_address" [vmlinux] is a static EXPORT_SYMBOL_GPL

--------------------------------------------------------------------------------
cm_x300_defconfig (arm, gcc-8) — PASS, 0 errors, 1 warning, 0 section mismatches

Warnings:
    WARNING: "return_address" [vmlinux] is a static EXPORT_SYMBOL_GPL

--------------------------------------------------------------------------------
cns3420vb_defconfig (arm, gcc-8) — PASS, 0 errors, 1 warning, 0 section mismatches

Warnings:
    WARNING: "return_address" [vmlinux] is a static EXPORT_SYMBOL_GPL

--------------------------------------------------------------------------------
cobalt_defconfig (mips, gcc-8) — PASS, 0 errors, 0 warnings, 0 section mismatches

--------------------------------------------------------------------------------
colibri_pxa270_defconfig (arm, gcc-8) — PASS, 0 errors, 1 warning, 0 section mismatches

Warnings:
    WARNING: "return_address" [vmlinux] is a static EXPORT_SYMBOL_GPL

--------------------------------------------------------------------------------
colibri_pxa300_defconfig (arm, gcc-8) — PASS, 0 errors, 1 warning, 0 section mismatches

Warnings:
    WARNING: "return_address" [vmlinux] is a static EXPORT_SYMBOL_GPL

--------------------------------------------------------------------------------
collie_defconfig (arm, gcc-8) — PASS, 0 errors, 0 warnings, 0 section mismatches

Section mismatches:
    WARNING: vmlinux.o(.text.unlikely+0x840): Section mismatch in reference from the function free_memmap() to the function .meminit.text:memblock_free()

--------------------------------------------------------------------------------
corgi_defconfig (arm, gcc-8) — PASS, 0 errors, 0 warnings, 0 section mismatches

--------------------------------------------------------------------------------
davinci_all_defconfig (arm, gcc-8) — PASS, 0 errors, 1 warning, 0 section mismatches

Warnings:
    WARNING: "return_address" [vmlinux] is a static EXPORT_SYMBOL_GPL

--------------------------------------------------------------------------------
db1xxx_defconfig (mips, gcc-8) — PASS, 0 errors, 1 warning, 0 section mismatches

Warnings:
    sound/soc/soc-pcm.c:1207:8: warning: unused variable 'name' [-Wunused-variable]

--------------------------------------------------------------------------------
decstation_64_defconfig (mips, gcc-8) — PASS, 0 errors, 0 warnings, 0 section mismatches

--------------------------------------------------------------------------------
decstation_defconfig (mips, gcc-8) — PASS, 0 errors, 0 warnings, 0 section mismatches

Section mismatches:
    WARNING: vmlinux.o(.text.unlikely+0x3630): Section mismatch in reference from the function pmax_setup_memory_region() to the function .init.text:add_memory_region()

--------------------------------------------------------------------------------
decstation_r4k_defconfig (mips, gcc-8) — PASS, 0 errors, 0 warnings, 0 section mismatches

Section mismatches:
    WARNING: vmlinux.o(.text.unlikely+0x3320): Section mismatch in reference from the function pmax_setup_memory_region() to the function .init.text:add_memory_region()

--------------------------------------------------------------------------------
defconfig (riscv, gcc-8) — PASS, 0 errors, 2 warnings, 0 section mismatches

Warnings:
    drivers/net/ethernet/intel/e1000e/netdev.c:6405:13: warning: 'e1000e_s0ix_exit_flow' defined but not used [-Wunused-function]
    drivers/net/ethernet/intel/e1000e/netdev.c:6298:13: warning: 'e1000e_s0ix_entry_flow' defined but not used [-Wunused-function]

--------------------------------------------------------------------------------
defconfig (arm64, gcc-8) — PASS, 0 errors, 0 warnings, 0 section mismatches

--------------------------------------------------------------------------------
defconfig (arm64, clang-8) — PASS, 0 errors, 0 warnings, 0 section mismatches

--------------------------------------------------------------------------------
defconfig+CONFIG_CPU_BIG_ENDIAN=y (arm64, gcc-8) — PASS, 0 errors, 0 warnings, 0 section mismatches

--------------------------------------------------------------------------------
defconfig+CONFIG_RANDOMIZE_BASE=y (arm64, gcc-8) — PASS, 0 errors, 0 warnings, 0 section mismatches

--------------------------------------------------------------------------------
defconfig+kselftest (riscv, gcc-8) — PASS, 0 errors, 29 warnings, 0 section mismatches

Warnings:
    ./.tmp.config.0Dg98F3fQN:3042:warning: override: reassigning to symbol BPF_SYSCALL
    ./.tmp.config.0Dg98F3fQN:3045:warning: override: reassigning to symbol NET_VRF
    ./.tmp.config.0Dg98F3fQN:3046:warning: override: reassigning to symbol NET_L3_MASTER_DEV
    ./.tmp.config.0Dg98F3fQN:3048:warning: override: reassigning to symbol IPV6_MULTIPLE_TABLES
    ./.tmp.config.0Dg98F3fQN:3049:warning: override: reassigning to symbol VETH
    ./.tmp.config.0Dg98F3fQN:3053:warning: override: reassigning to symbol BRIDGE
    ./.tmp.config.0Dg98F3fQN:3054:warning: override: reassigning to symbol VLAN_8021Q
    ./.tmp.config.0Dg98F3fQN:3112:warning: override: reassigning to symbol NET_SCH_INGRESS
    ./.tmp.config.0Dg98F3fQN:3133:warning: override: reassigning to symbol NET_ACT_GACT
    ./.tmp.config.0Dg98F3fQN:3158:warning: override: reassigning to symbol USER_NS
    ./.tmp.config.0Dg98F3fQN:3162:warning: override: reassigning to symbol NET_NS
    ./.tmp.config.0Dg98F3fQN:3270:warning: override: reassigning to symbol USER_NS
    ./.tmp.config.0Dg98F3fQN:3281:warning: override: reassigning to symbol NOTIFIER_ERROR_INJECTION
    ./.tmp.config.0Dg98F3fQN:3291:warning: override: reassigning to symbol ANDROID
    ./.tmp.config.0Dg98F3fQN:3298:warning: override: reassigning to symbol BPF_SYSCALL
    ./.tmp.config.0Dg98F3fQN:3301:warning: override: reassigning to symbol TEST_BPF
    ./.tmp.config.0Dg98F3fQN:3302:warning: override: reassigning to symbol CGROUP_BPF
    ./.tmp.config.0Dg98F3fQN:3304:warning: override: reassigning to symbol NET_CLS_ACT
    ./.tmp.config.0Dg98F3fQN:3305:warning: override: reassigning to symbol NET_SCHED
    ./.tmp.config.0Dg98F3fQN:3306:warning: override: reassigning to symbol NET_SCH_INGRESS
    ./.tmp.config.0Dg98F3fQN:3308:warning: override: reassigning to symbol IPV6
    ./.tmp.config.0Dg98F3fQN:3317:warning: override: reassigning to symbol NET_CLS_FLOWER
    ./.tmp.config.0Dg98F3fQN:3323:warning: override: reassigning to symbol IPV6_GRE
    ./.tmp.config.0Dg98F3fQN:3343:warning: override: reassigning to symbol SECURITYFS
    ./.tmp.config.0Dg98F3fQN:3347:warning: override: reassigning to symbol STAGING
    ./.tmp.config.0Dg98F3fQN:3348:warning: override: reassigning to symbol ANDROID
    ./.tmp.config.0Dg98F3fQN:3365:warning: override: reassigning to symbol USER_NS
    drivers/net/ethernet/intel/e1000e/netdev.c:6405:13: warning: 'e1000e_s0ix_exit_flow' defined but not used [-Wunused-function]
    drivers/net/ethernet/intel/e1000e/netdev.c:6298:13: warning: 'e1000e_s0ix_entry_flow' defined but not used [-Wunused-function]

--------------------------------------------------------------------------------
defconfig+kselftest (arm64, gcc-8) — PASS, 0 errors, 27 warnings, 0 section mismatches

Warnings:
    ./.tmp.config.rRnaRmJqkB:7645:warning: override: reassigning to symbol BPF_SYSCALL
    ./.tmp.config.rRnaRmJqkB:7648:warning: override: reassigning to symbol NET_VRF
    ./.tmp.config.rRnaRmJqkB:7649:warning: override: reassigning to symbol NET_L3_MASTER_DEV
    ./.tmp.config.rRnaRmJqkB:7651:warning: override: reassigning to symbol IPV6_MULTIPLE_TABLES
    ./.tmp.config.rRnaRmJqkB:7652:warning: override: reassigning to symbol VETH
    ./.tmp.config.rRnaRmJqkB:7656:warning: override: reassigning to symbol BRIDGE
    ./.tmp.config.rRnaRmJqkB:7657:warning: override: reassigning to symbol VLAN_8021Q
    ./.tmp.config.rRnaRmJqkB:7715:warning: override: reassigning to symbol NET_SCH_INGRESS
    ./.tmp.config.rRnaRmJqkB:7736:warning: override: reassigning to symbol NET_ACT_GACT
    ./.tmp.config.rRnaRmJqkB:7761:warning: override: reassigning to symbol USER_NS
    ./.tmp.config.rRnaRmJqkB:7765:warning: override: reassigning to symbol NET_NS
    ./.tmp.config.rRnaRmJqkB:7873:warning: override: reassigning to symbol USER_NS
    ./.tmp.config.rRnaRmJqkB:7884:warning: override: reassigning to symbol NOTIFIER_ERROR_INJECTION
    ./.tmp.config.rRnaRmJqkB:7894:warning: override: reassigning to symbol ANDROID
    ./.tmp.config.rRnaRmJqkB:7901:warning: override: reassigning to symbol BPF_SYSCALL
    ./.tmp.config.rRnaRmJqkB:7904:warning: override: reassigning to symbol TEST_BPF
    ./.tmp.config.rRnaRmJqkB:7905:warning: override: reassigning to symbol CGROUP_BPF
    ./.tmp.config.rRnaRmJqkB:7907:warning: override: reassigning to symbol NET_CLS_ACT
    ./.tmp.config.rRnaRmJqkB:7908:warning: override: reassigning to symbol NET_SCHED
    ./.tmp.config.rRnaRmJqkB:7909:warning: override: reassigning to symbol NET_SCH_INGRESS
    ./.tmp.config.rRnaRmJqkB:7911:warning: override: reassigning to symbol IPV6
    ./.tmp.config.rRnaRmJqkB:7920:warning: override: reassigning to symbol NET_CLS_FLOWER
    ./.tmp.config.rRnaRmJqkB:7926:warning: override: reassigning to symbol IPV6_GRE
    ./.tmp.config.rRnaRmJqkB:7946:warning: override: reassigning to symbol SECURITYFS
    ./.tmp.config.rRnaRmJqkB:7950:warning: override: reassigning to symbol STAGING
    ./.tmp.config.rRnaRmJqkB:7951:warning: override: reassigning to symbol ANDROID
    ./.tmp.config.rRnaRmJqkB:7968:warning: override: reassigning to symbol USER_NS

--------------------------------------------------------------------------------
dove_defconfig (arm, gcc-8) — PASS, 0 errors, 1 warning, 0 section mismatches

Warnings:
    WARNING: "return_address" [vmlinux] is a static EXPORT_SYMBOL_GPL

--------------------------------------------------------------------------------
e55_defconfig (mips, gcc-8) — PASS, 0 errors, 0 warnings, 0 section mismatches

--------------------------------------------------------------------------------
ebsa110_defconfig (arm, gcc-8) — PASS, 0 errors, 0 warnings, 0 section mismatches

--------------------------------------------------------------------------------
efm32_defconfig (arm, gcc-8) — PASS, 0 errors, 0 warnings, 0 section mismatches

--------------------------------------------------------------------------------
em_x270_defconfig (arm, gcc-8) — PASS, 0 errors, 1 warning, 0 section mismatches

Warnings:
    WARNING: "return_address" [vmlinux] is a static EXPORT_SYMBOL_GPL

--------------------------------------------------------------------------------
ep93xx_defconfig (arm, gcc-8) — PASS, 0 errors, 1 warning, 0 section mismatches

Warnings:
    WARNING: "return_address" [vmlinux] is a static EXPORT_SYMBOL_GPL

Section mismatches:
    WARNING: vmlinux.o(.text.unlikely+0x710): Section mismatch in reference from the function free_memmap() to the function .meminit.text:memblock_free()

--------------------------------------------------------------------------------
eseries_pxa_defconfig (arm, gcc-8) — PASS, 0 errors, 2 warnings, 0 section mismatches

Warnings:
    WARNING: "return_address" [vmlinux] is a static EXPORT_SYMBOL_GPL
    sound/soc/soc-pcm.c:1207:8: warning: unused variable 'name' [-Wunused-variable]

--------------------------------------------------------------------------------
exynos_defconfig (arm, gcc-8) — PASS, 0 errors, 1 warning, 0 section mismatches

Warnings:
    WARNING: "return_address" [vmlinux] is a static EXPORT_SYMBOL_GPL

--------------------------------------------------------------------------------
ezx_defconfig (arm, gcc-8) — PASS, 0 errors, 1 warning, 0 section mismatches

Warnings:
    WARNING: "return_address" [vmlinux] is a static EXPORT_SYMBOL_GPL

--------------------------------------------------------------------------------
footbridge_defconfig (arm, gcc-8) — PASS, 0 errors, 0 warnings, 0 section mismatches

--------------------------------------------------------------------------------
fuloong2e_defconfig (mips, gcc-8) — PASS, 0 errors, 0 warnings, 0 section mismatches

--------------------------------------------------------------------------------
gcw0_defconfig (mips, gcc-8) — PASS, 0 errors, 0 warnings, 0 section mismatches

--------------------------------------------------------------------------------
gemini_defconfig (arm, gcc-8) — PASS, 0 errors, 0 warnings, 0 section mismatches

--------------------------------------------------------------------------------
gpr_defconfig (mips, gcc-8) — PASS, 0 errors, 0 warnings, 0 section mismatches

--------------------------------------------------------------------------------
h3600_defconfig (arm, gcc-8) — PASS, 0 errors, 0 warnings, 0 section mismatches

Section mismatches:
    WARNING: vmlinux.o(.text.unlikely+0x840): Section mismatch in reference from the function free_memmap() to the function .meminit.text:memblock_free()

--------------------------------------------------------------------------------
h5000_defconfig (arm, gcc-8) — PASS, 0 errors, 1 warning, 0 section mismatches

Warnings:
    WARNING: "return_address" [vmlinux] is a static EXPORT_SYMBOL_GPL

--------------------------------------------------------------------------------
hackkit_defconfig (arm, gcc-8) — PASS, 0 errors, 0 warnings, 0 section mismatches

Section mismatches:
    WARNING: vmlinux.o(.text.unlikely+0x8c4): Section mismatch in reference from the function free_memmap() to the function .meminit.text:memblock_free()

--------------------------------------------------------------------------------
haps_hs_defconfig (arc, gcc-8) — PASS, 0 errors, 2 warnings, 0 section mismatches

Warnings:
    <stdin>:1511:2: warning: #warning syscall clone3 not implemented [-Wcpp]
    <stdin>:1511:2: warning: #warning syscall clone3 not implemented [-Wcpp]

--------------------------------------------------------------------------------
haps_hs_smp_defconfig (arc, gcc-8) — PASS, 0 errors, 2 warnings, 0 section mismatches

Warnings:
    <stdin>:1511:2: warning: #warning syscall clone3 not implemented [-Wcpp]
    <stdin>:1511:2: warning: #warning syscall clone3 not implemented [-Wcpp]

--------------------------------------------------------------------------------
hisi_defconfig (arm, gcc-8) — PASS, 0 errors, 0 warnings, 0 section mismatches

--------------------------------------------------------------------------------
hsdk_defconfig (arc, gcc-8) — PASS, 0 errors, 2 warnings, 0 section mismatches

Warnings:
    <stdin>:1511:2: warning: #warning syscall clone3 not implemented [-Wcpp]
    <stdin>:1511:2: warning: #warning syscall clone3 not implemented [-Wcpp]

--------------------------------------------------------------------------------
i386_defconfig (i386, gcc-8) — PASS, 0 errors, 0 warnings, 0 section mismatches

--------------------------------------------------------------------------------
i386_defconfig+kselftest (i386, gcc-8) — PASS, 0 errors, 28 warnings, 0 section mismatches

Warnings:
    ./.tmp.config.DdFVv0mEMi:4503:warning: override: reassigning to symbol BPF_SYSCALL
    ./.tmp.config.DdFVv0mEMi:4506:warning: override: reassigning to symbol NET_VRF
    ./.tmp.config.DdFVv0mEMi:4507:warning: override: reassigning to symbol NET_L3_MASTER_DEV
    ./.tmp.config.DdFVv0mEMi:4509:warning: override: reassigning to symbol IPV6_MULTIPLE_TABLES
    ./.tmp.config.DdFVv0mEMi:4510:warning: override: reassigning to symbol VETH
    ./.tmp.config.DdFVv0mEMi:4514:warning: override: reassigning to symbol BRIDGE
    ./.tmp.config.DdFVv0mEMi:4515:warning: override: reassigning to symbol VLAN_8021Q
    ./.tmp.config.DdFVv0mEMi:4573:warning: override: reassigning to symbol NET_SCH_INGRESS
    ./.tmp.config.DdFVv0mEMi:4594:warning: override: reassigning to symbol NET_ACT_GACT
    ./.tmp.config.DdFVv0mEMi:4619:warning: override: reassigning to symbol USER_NS
    ./.tmp.config.DdFVv0mEMi:4623:warning: override: reassigning to symbol NET_NS
    ./.tmp.config.DdFVv0mEMi:4731:warning: override: reassigning to symbol USER_NS
    ./.tmp.config.DdFVv0mEMi:4742:warning: override: reassigning to symbol NOTIFIER_ERROR_INJECTION
    ./.tmp.config.DdFVv0mEMi:4752:warning: override: reassigning to symbol ANDROID
    ./.tmp.config.DdFVv0mEMi:4759:warning: override: reassigning to symbol BPF_SYSCALL
    ./.tmp.config.DdFVv0mEMi:4762:warning: override: reassigning to symbol TEST_BPF
    ./.tmp.config.DdFVv0mEMi:4763:warning: override: reassigning to symbol CGROUP_BPF
    ./.tmp.config.DdFVv0mEMi:4765:warning: override: reassigning to symbol NET_CLS_ACT
    ./.tmp.config.DdFVv0mEMi:4766:warning: override: reassigning to symbol NET_SCHED
    ./.tmp.config.DdFVv0mEMi:4767:warning: override: reassigning to symbol NET_SCH_INGRESS
    ./.tmp.config.DdFVv0mEMi:4769:warning: override: reassigning to symbol IPV6
    ./.tmp.config.DdFVv0mEMi:4778:warning: override: reassigning to symbol NET_CLS_FLOWER
    ./.tmp.config.DdFVv0mEMi:4784:warning: override: reassigning to symbol IPV6_GRE
    ./.tmp.config.DdFVv0mEMi:4804:warning: override: reassigning to symbol SECURITYFS
    ./.tmp.config.DdFVv0mEMi:4808:warning: override: reassigning to symbol STAGING
    ./.tmp.config.DdFVv0mEMi:4809:warning: override: reassigning to symbol ANDROID
    ./.tmp.config.DdFVv0mEMi:4826:warning: override: reassigning to symbol USER_NS
    include/linux/kern_levels.h:5:18: warning: format '%lu' expects argument of type 'long unsigned int', but argument 8 has type 'unsigned int' [-Wformat=]

--------------------------------------------------------------------------------
imote2_defconfig (arm, gcc-8) — PASS, 0 errors, 1 warning, 0 section mismatches

Warnings:
    WARNING: "return_address" [vmlinux] is a static EXPORT_SYMBOL_GPL

--------------------------------------------------------------------------------
imx_v4_v5_defconfig (arm, gcc-8) — PASS, 0 errors, 1 warning, 0 section mismatches

Warnings:
    WARNING: "return_address" [vmlinux] is a static EXPORT_SYMBOL_GPL

--------------------------------------------------------------------------------
imx_v6_v7_defconfig (arm, gcc-8) — PASS, 0 errors, 1 warning, 0 section mismatches

Warnings:
    WARNING: "return_address" [vmlinux] is a static EXPORT_SYMBOL_GPL

--------------------------------------------------------------------------------
integrator_defconfig (arm, gcc-8) — PASS, 0 errors, 1 warning, 0 section mismatches

Warnings:
    WARNING: "return_address" [vmlinux] is a static EXPORT_SYMBOL_GPL

--------------------------------------------------------------------------------
iop32x_defconfig (arm, gcc-8) — PASS, 0 errors, 0 warnings, 0 section mismatches

--------------------------------------------------------------------------------
ip22_defconfig (mips, gcc-8) — PASS, 0 errors, 0 warnings, 0 section mismatches

--------------------------------------------------------------------------------
ip27_defconfig (mips, gcc-8) — PASS, 0 errors, 2 warnings, 0 section mismatches

Warnings:
    drivers/net/ethernet/intel/e1000e/netdev.c:6405:13: warning: 'e1000e_s0ix_exit_flow' defined but not used [-Wunused-function]
    drivers/net/ethernet/intel/e1000e/netdev.c:6298:13: warning: 'e1000e_s0ix_entry_flow' defined but not used [-Wunused-function]

--------------------------------------------------------------------------------
ip28_defconfig (mips, gcc-8) — PASS, 0 errors, 0 warnings, 0 section mismatches

--------------------------------------------------------------------------------
ip32_defconfig (mips, gcc-8) — PASS, 0 errors, 0 warnings, 0 section mismatches

--------------------------------------------------------------------------------
ixp4xx_defconfig (arm, gcc-8) — PASS, 0 errors, 1 warning, 0 section mismatches

Warnings:
    WARNING: "return_address" [vmlinux] is a static EXPORT_SYMBOL_GPL

--------------------------------------------------------------------------------
jazz_defconfig (mips, gcc-8) — PASS, 0 errors, 0 warnings, 0 section mismatches

--------------------------------------------------------------------------------
jmr3927_defconfig (mips, gcc-8) — PASS, 0 errors, 0 warnings, 0 section mismatches

--------------------------------------------------------------------------------
jornada720_defconfig (arm, gcc-8) — PASS, 0 errors, 0 warnings, 0 section mismatches

Section mismatches:
    WARNING: vmlinux.o(.text.unlikely+0x7c8): Section mismatch in reference from the function free_memmap() to the function .meminit.text:memblock_free()

--------------------------------------------------------------------------------
keystone_defconfig (arm, gcc-8) — PASS, 0 errors, 1 warning, 0 section mismatches

Warnings:
    WARNING: "return_address" [vmlinux] is a static EXPORT_SYMBOL_GPL

--------------------------------------------------------------------------------
lart_defconfig (arm, gcc-8) — PASS, 0 errors, 0 warnings, 0 section mismatches

Section mismatches:
    WARNING: vmlinux.o(.text.unlikely+0x8c4): Section mismatch in reference from the function free_memmap() to the function .meminit.text:memblock_free()

--------------------------------------------------------------------------------
lasat_defconfig (mips, gcc-8) — PASS, 0 errors, 0 warnings, 0 section mismatches

--------------------------------------------------------------------------------
lemote2f_defconfig (mips, gcc-8) — PASS, 0 errors, 0 warnings, 0 section mismatches

--------------------------------------------------------------------------------
loongson1b_defconfig (mips, gcc-8) — PASS, 0 errors, 0 warnings, 0 section mismatches

--------------------------------------------------------------------------------
loongson1c_defconfig (mips, gcc-8) — PASS, 0 errors, 0 warnings, 0 section mismatches

--------------------------------------------------------------------------------
loongson3_defconfig (mips, gcc-8) — PASS, 0 errors, 0 warnings, 0 section mismatches

--------------------------------------------------------------------------------
lpc18xx_defconfig (arm, gcc-8) — PASS, 0 errors, 0 warnings, 0 section mismatches

--------------------------------------------------------------------------------
lpc32xx_defconfig (arm, gcc-8) — PASS, 0 errors, 1 warning, 0 section mismatches

Warnings:
    WARNING: "return_address" [vmlinux] is a static EXPORT_SYMBOL_GPL

--------------------------------------------------------------------------------
lpd270_defconfig (arm, gcc-8) — PASS, 0 errors, 0 warnings, 0 section mismatches

--------------------------------------------------------------------------------
lubbock_defconfig (arm, gcc-8) — PASS, 0 errors, 0 warnings, 0 section mismatches

--------------------------------------------------------------------------------
magician_defconfig (arm, gcc-8) — PASS, 0 errors, 2 warnings, 0 section mismatches

Warnings:
    WARNING: "return_address" [vmlinux] is a static EXPORT_SYMBOL_GPL
    sound/soc/soc-pcm.c:1207:8: warning: unused variable 'name' [-Wunused-variable]

--------------------------------------------------------------------------------
mainstone_defconfig (arm, gcc-8) — PASS, 0 errors, 0 warnings, 0 section mismatches

--------------------------------------------------------------------------------
malta_defconfig (mips, gcc-8) — PASS, 0 errors, 0 warnings, 0 section mismatches

--------------------------------------------------------------------------------
malta_kvm_defconfig (mips, gcc-8) — PASS, 0 errors, 0 warnings, 0 section mismatches

--------------------------------------------------------------------------------
malta_kvm_guest_defconfig (mips, gcc-8) — PASS, 0 errors, 0 warnings, 0 section mismatches

--------------------------------------------------------------------------------
malta_qemu_32r6_defconfig (mips, gcc-8) — PASS, 0 errors, 1 warning, 0 section mismatches

Warnings:
    {standard input}:134: Warning: macro instruction expanded into multiple instructions

--------------------------------------------------------------------------------
maltaaprp_defconfig (mips, gcc-8) — PASS, 0 errors, 0 warnings, 0 section mismatches

--------------------------------------------------------------------------------
maltasmvp_defconfig (mips, gcc-8) — PASS, 0 errors, 0 warnings, 0 section mismatches

--------------------------------------------------------------------------------
maltasmvp_eva_defconfig (mips, gcc-8) — PASS, 0 errors, 0 warnings, 0 section mismatches

--------------------------------------------------------------------------------
maltaup_defconfig (mips, gcc-8) — PASS, 0 errors, 0 warnings, 0 section mismatches

--------------------------------------------------------------------------------
maltaup_xpa_defconfig (mips, gcc-8) — PASS, 0 errors, 0 warnings, 0 section mismatches

--------------------------------------------------------------------------------
markeins_defconfig (mips, gcc-8) — PASS, 0 errors, 0 warnings, 0 section mismatches

--------------------------------------------------------------------------------
milbeaut_m10v_defconfig (arm, gcc-8) — PASS, 0 errors, 1 warning, 0 section mismatches

Warnings:
    WARNING: "return_address" [vmlinux] is a static EXPORT_SYMBOL_GPL

--------------------------------------------------------------------------------
mini2440_defconfig (arm, gcc-8) — PASS, 0 errors, 1 warning, 0 section mismatches

Warnings:
    WARNING: "return_address" [vmlinux] is a static EXPORT_SYMBOL_GPL

--------------------------------------------------------------------------------
mips_paravirt_defconfig (mips, gcc-8) — PASS, 0 errors, 0 warnings, 0 section mismatches

--------------------------------------------------------------------------------
mmp2_defconfig (arm, gcc-8) — PASS, 0 errors, 1 warning, 0 section mismatches

Warnings:
    WARNING: "return_address" [vmlinux] is a static EXPORT_SYMBOL_GPL

--------------------------------------------------------------------------------
moxart_defconfig (arm, gcc-8) — PASS, 0 errors, 0 warnings, 0 section mismatches

--------------------------------------------------------------------------------
mpc30x_defconfig (mips, gcc-8) — PASS, 0 errors, 0 warnings, 0 section mismatches

--------------------------------------------------------------------------------
mps2_defconfig (arm, gcc-8) — PASS, 0 errors, 0 warnings, 0 section mismatches

--------------------------------------------------------------------------------
msp71xx_defconfig (mips, gcc-8) — PASS, 0 errors, 0 warnings, 0 section mismatches

--------------------------------------------------------------------------------
mtx1_defconfig (mips, gcc-8) — PASS, 0 errors, 0 warnings, 0 section mismatches

--------------------------------------------------------------------------------
multi_v4t_defconfig (arm, gcc-8) — PASS, 0 errors, 0 warnings, 0 section mismatches

--------------------------------------------------------------------------------
multi_v5_defconfig (arm, gcc-8) — PASS, 0 errors, 1 warning, 0 section mismatches

Warnings:
    WARNING: "return_address" [vmlinux] is a static EXPORT_SYMBOL_GPL

--------------------------------------------------------------------------------
multi_v7_defconfig (arm, gcc-8) — PASS, 0 errors, 1 warning, 0 section mismatches

Warnings:
    WARNING: "return_address" [vmlinux] is a static EXPORT_SYMBOL_GPL

--------------------------------------------------------------------------------
multi_v7_defconfig+CONFIG_CPU_BIG_ENDIAN=y (arm, gcc-8) — PASS, 0 errors, 1 warning, 0 section mismatches

Warnings:
    WARNING: "return_address" [vmlinux] is a static EXPORT_SYMBOL_GPL

--------------------------------------------------------------------------------
multi_v7_defconfig+CONFIG_EFI=y+CONFIG_ARM_LPAE=y (arm, gcc-8) — PASS, 0 errors, 1 warning, 0 section mismatches

Warnings:
    WARNING: "return_address" [vmlinux] is a static EXPORT_SYMBOL_GPL

--------------------------------------------------------------------------------
multi_v7_defconfig+CONFIG_SMP=n (arm, gcc-8) — PASS, 0 errors, 1 warning, 0 section mismatches

Warnings:
    WARNING: "return_address" [vmlinux] is a static EXPORT_SYMBOL_GPL

--------------------------------------------------------------------------------
multi_v7_defconfig+kselftest (arm, gcc-8) — PASS, 0 errors, 28 warnings, 0 section mismatches

Warnings:
    ./.tmp.config.Sh6OL8tr7w:8244:warning: override: reassigning to symbol BPF_SYSCALL
    ./.tmp.config.Sh6OL8tr7w:8247:warning: override: reassigning to symbol NET_VRF
    ./.tmp.config.Sh6OL8tr7w:8248:warning: override: reassigning to symbol NET_L3_MASTER_DEV
    ./.tmp.config.Sh6OL8tr7w:8250:warning: override: reassigning to symbol IPV6_MULTIPLE_TABLES
    ./.tmp.config.Sh6OL8tr7w:8251:warning: override: reassigning to symbol VETH
    ./.tmp.config.Sh6OL8tr7w:8255:warning: override: reassigning to symbol BRIDGE
    ./.tmp.config.Sh6OL8tr7w:8256:warning: override: reassigning to symbol VLAN_8021Q
    ./.tmp.config.Sh6OL8tr7w:8314:warning: override: reassigning to symbol NET_SCH_INGRESS
    ./.tmp.config.Sh6OL8tr7w:8335:warning: override: reassigning to symbol NET_ACT_GACT
    ./.tmp.config.Sh6OL8tr7w:8360:warning: override: reassigning to symbol USER_NS
    ./.tmp.config.Sh6OL8tr7w:8364:warning: override: reassigning to symbol NET_NS
    ./.tmp.config.Sh6OL8tr7w:8472:warning: override: reassigning to symbol USER_NS
    ./.tmp.config.Sh6OL8tr7w:8483:warning: override: reassigning to symbol NOTIFIER_ERROR_INJECTION
    ./.tmp.config.Sh6OL8tr7w:8493:warning: override: reassigning to symbol ANDROID
    ./.tmp.config.Sh6OL8tr7w:8500:warning: override: reassigning to symbol BPF_SYSCALL
    ./.tmp.config.Sh6OL8tr7w:8503:warning: override: reassigning to symbol TEST_BPF
    ./.tmp.config.Sh6OL8tr7w:8504:warning: override: reassigning to symbol CGROUP_BPF
    ./.tmp.config.Sh6OL8tr7w:8506:warning: override: reassigning to symbol NET_CLS_ACT
    ./.tmp.config.Sh6OL8tr7w:8507:warning: override: reassigning to symbol NET_SCHED
    ./.tmp.config.Sh6OL8tr7w:8508:warning: override: reassigning to symbol NET_SCH_INGRESS
    ./.tmp.config.Sh6OL8tr7w:8510:warning: override: reassigning to symbol IPV6
    ./.tmp.config.Sh6OL8tr7w:8519:warning: override: reassigning to symbol NET_CLS_FLOWER
    ./.tmp.config.Sh6OL8tr7w:8525:warning: override: reassigning to symbol IPV6_GRE
    ./.tmp.config.Sh6OL8tr7w:8545:warning: override: reassigning to symbol SECURITYFS
    ./.tmp.config.Sh6OL8tr7w:8549:warning: override: reassigning to symbol STAGING
    ./.tmp.config.Sh6OL8tr7w:8550:warning: override: reassigning to symbol ANDROID
    ./.tmp.config.Sh6OL8tr7w:8567:warning: override: reassigning to symbol USER_NS
    include/linux/kern_levels.h:5:18: warning: format '%lu' expects argument of type 'long unsigned int', but argument 8 has type 'unsigned int' [-Wformat=]

--------------------------------------------------------------------------------
mv78xx0_defconfig (arm, gcc-8) — PASS, 0 errors, 1 warning, 0 section mismatches

Warnings:
    WARNING: "return_address" [vmlinux] is a static EXPORT_SYMBOL_GPL

--------------------------------------------------------------------------------
mvebu_v5_defconfig (arm, gcc-8) — PASS, 0 errors, 1 warning, 0 section mismatches

Warnings:
    WARNING: "return_address" [vmlinux] is a static EXPORT_SYMBOL_GPL

--------------------------------------------------------------------------------
mvebu_v7_defconfig (arm, gcc-8) — PASS, 0 errors, 1 warning, 0 section mismatches

Warnings:
    WARNING: "return_address" [vmlinux] is a static EXPORT_SYMBOL_GPL

--------------------------------------------------------------------------------
mxs_defconfig (arm, gcc-8) — PASS, 0 errors, 1 warning, 0 section mismatches

Warnings:
    WARNING: "return_address" [vmlinux] is a static EXPORT_SYMBOL_GPL

--------------------------------------------------------------------------------
neponset_defconfig (arm, gcc-8) — PASS, 0 errors, 0 warnings, 0 section mismatches

Section mismatches:
    WARNING: vmlinux.o(.text.unlikely+0x8c4): Section mismatch in reference from the function free_memmap() to the function .meminit.text:memblock_free()

--------------------------------------------------------------------------------
netwinder_defconfig (arm, gcc-8) — PASS, 0 errors, 0 warnings, 0 section mismatches

--------------------------------------------------------------------------------
nhk8815_defconfig (arm, gcc-8) — PASS, 0 errors, 1 warning, 0 section mismatches

Warnings:
    WARNING: "return_address" [vmlinux] is a static EXPORT_SYMBOL_GPL

--------------------------------------------------------------------------------
nlm_xlp_defconfig (mips, gcc-8) — PASS, 0 errors, 2 warnings, 0 section mismatches

Warnings:
    drivers/net/ethernet/intel/e1000e/netdev.c:6405:13: warning: 'e1000e_s0ix_exit_flow' defined but not used [-Wunused-function]
    drivers/net/ethernet/intel/e1000e/netdev.c:6298:13: warning: 'e1000e_s0ix_entry_flow' defined but not used [-Wunused-function]

--------------------------------------------------------------------------------
nlm_xlr_defconfig (mips, gcc-8) — PASS, 0 errors, 3 warnings, 0 section mismatches

Warnings:
    include/linux/kern_levels.h:5:18: warning: format '%lu' expects argument of type 'long unsigned int', but argument 8 has type 'unsigned int' [-Wformat=]
    drivers/net/ethernet/intel/e1000e/netdev.c:6405:13: warning: 'e1000e_s0ix_exit_flow' defined but not used [-Wunused-function]
    drivers/net/ethernet/intel/e1000e/netdev.c:6298:13: warning: 'e1000e_s0ix_entry_flow' defined but not used [-Wunused-function]

--------------------------------------------------------------------------------
nsim_hs_defconfig (arc, gcc-8) — PASS, 0 errors, 2 warnings, 0 section mismatches

Warnings:
    <stdin>:1511:2: warning: #warning syscall clone3 not implemented [-Wcpp]
    <stdin>:1511:2: warning: #warning syscall clone3 not implemented [-Wcpp]

--------------------------------------------------------------------------------
nsim_hs_defconfig+kselftest (arc, gcc-8) — PASS, 0 errors, 30 warnings, 0 section mismatches

Warnings:
    ./.tmp.config.F2JOsCoGYv:1422:warning: override: reassigning to symbol BPF_SYSCALL
    ./.tmp.config.F2JOsCoGYv:1425:warning: override: reassigning to symbol NET_VRF
    ./.tmp.config.F2JOsCoGYv:1426:warning: override: reassigning to symbol NET_L3_MASTER_DEV
    ./.tmp.config.F2JOsCoGYv:1428:warning: override: reassigning to symbol IPV6_MULTIPLE_TABLES
    ./.tmp.config.F2JOsCoGYv:1429:warning: override: reassigning to symbol VETH
    ./.tmp.config.F2JOsCoGYv:1433:warning: override: reassigning to symbol BRIDGE
    ./.tmp.config.F2JOsCoGYv:1434:warning: override: reassigning to symbol VLAN_8021Q
    ./.tmp.config.F2JOsCoGYv:1492:warning: override: reassigning to symbol NET_SCH_INGRESS
    ./.tmp.config.F2JOsCoGYv:1513:warning: override: reassigning to symbol NET_ACT_GACT
    ./.tmp.config.F2JOsCoGYv:1538:warning: override: reassigning to symbol USER_NS
    ./.tmp.config.F2JOsCoGYv:1542:warning: override: reassigning to symbol NET_NS
    ./.tmp.config.F2JOsCoGYv:1650:warning: override: reassigning to symbol USER_NS
    ./.tmp.config.F2JOsCoGYv:1661:warning: override: reassigning to symbol NOTIFIER_ERROR_INJECTION
    ./.tmp.config.F2JOsCoGYv:1671:warning: override: reassigning to symbol ANDROID
    ./.tmp.config.F2JOsCoGYv:1678:warning: override: reassigning to symbol BPF_SYSCALL
    ./.tmp.config.F2JOsCoGYv:1681:warning: override: reassigning to symbol TEST_BPF
    ./.tmp.config.F2JOsCoGYv:1682:warning: override: reassigning to symbol CGROUP_BPF
    ./.tmp.config.F2JOsCoGYv:1684:warning: override: reassigning to symbol NET_CLS_ACT
    ./.tmp.config.F2JOsCoGYv:1685:warning: override: reassigning to symbol NET_SCHED
    ./.tmp.config.F2JOsCoGYv:1686:warning: override: reassigning to symbol NET_SCH_INGRESS
    ./.tmp.config.F2JOsCoGYv:1688:warning: override: reassigning to symbol IPV6
    ./.tmp.config.F2JOsCoGYv:1697:warning: override: reassigning to symbol NET_CLS_FLOWER
    ./.tmp.config.F2JOsCoGYv:1703:warning: override: reassigning to symbol IPV6_GRE
    ./.tmp.config.F2JOsCoGYv:1723:warning: override: reassigning to symbol SECURITYFS
    ./.tmp.config.F2JOsCoGYv:1727:warning: override: reassigning to symbol STAGING
    ./.tmp.config.F2JOsCoGYv:1728:warning: override: reassigning to symbol ANDROID
    ./.tmp.config.F2JOsCoGYv:1745:warning: override: reassigning to symbol USER_NS
    <stdin>:1511:2: warning: #warning syscall clone3 not implemented [-Wcpp]
    <stdin>:1511:2: warning: #warning syscall clone3 not implemented [-Wcpp]
    include/linux/kern_levels.h:5:18: warning: format '%lu' expects argument of type 'long unsigned int', but argument 8 has type 'unsigned int' [-Wformat=]

--------------------------------------------------------------------------------
nsim_hs_smp_defconfig (arc, gcc-8) — PASS, 0 errors, 2 warnings, 0 section mismatches

Warnings:
    <stdin>:1511:2: warning: #warning syscall clone3 not implemented [-Wcpp]
    <stdin>:1511:2: warning: #warning syscall clone3 not implemented [-Wcpp]

--------------------------------------------------------------------------------
nsimosci_hs_defconfig (arc, gcc-8) — PASS, 0 errors, 2 warnings, 0 section mismatches

Warnings:
    <stdin>:1511:2: warning: #warning syscall clone3 not implemented [-Wcpp]
    <stdin>:1511:2: warning: #warning syscall clone3 not implemented [-Wcpp]

--------------------------------------------------------------------------------
nsimosci_hs_smp_defconfig (arc, gcc-8) — PASS, 0 errors, 2 warnings, 0 section mismatches

Warnings:
    <stdin>:1511:2: warning: #warning syscall clone3 not implemented [-Wcpp]
    <stdin>:1511:2: warning: #warning syscall clone3 not implemented [-Wcpp]

--------------------------------------------------------------------------------
omap1_defconfig (arm, gcc-8) — PASS, 0 errors, 1 warning, 0 section mismatches

Warnings:
    WARNING: "return_address" [vmlinux] is a static EXPORT_SYMBOL_GPL

--------------------------------------------------------------------------------
omap2plus_defconfig (arm, gcc-8) — PASS, 0 errors, 1 warning, 0 section mismatches

Warnings:
    WARNING: "return_address" [vmlinux] is a static EXPORT_SYMBOL_GPL

--------------------------------------------------------------------------------
omega2p_defconfig (mips, gcc-8) — PASS, 0 errors, 0 warnings, 0 section mismatches

--------------------------------------------------------------------------------
orion5x_defconfig (arm, gcc-8) — PASS, 0 errors, 1 warning, 0 section mismatches

Warnings:
    WARNING: "return_address" [vmlinux] is a static EXPORT_SYMBOL_GPL

--------------------------------------------------------------------------------
oxnas_v6_defconfig (arm, gcc-8) — PASS, 0 errors, 1 warning, 0 section mismatches

Warnings:
    WARNING: "return_address" [vmlinux] is a static EXPORT_SYMBOL_GPL

--------------------------------------------------------------------------------
palmz72_defconfig (arm, gcc-8) — PASS, 0 errors, 1 warning, 0 section mismatches

Warnings:
    WARNING: "return_address" [vmlinux] is a static EXPORT_SYMBOL_GPL

--------------------------------------------------------------------------------
pcm027_defconfig (arm, gcc-8) — PASS, 0 errors, 1 warning, 0 section mismatches

Warnings:
    WARNING: "return_address" [vmlinux] is a static EXPORT_SYMBOL_GPL

--------------------------------------------------------------------------------
pic32mzda_defconfig (mips, gcc-8) — PASS, 0 errors, 0 warnings, 0 section mismatches

--------------------------------------------------------------------------------
pistachio_defconfig (mips, gcc-8) — PASS, 0 errors, 0 warnings, 0 section mismatches

--------------------------------------------------------------------------------
pleb_defconfig (arm, gcc-8) — PASS, 0 errors, 0 warnings, 0 section mismatches

Section mismatches:
    WARNING: vmlinux.o(.text.unlikely+0x840): Section mismatch in reference from the function free_memmap() to the function .meminit.text:memblock_free()

--------------------------------------------------------------------------------
pnx8335_stb225_defconfig (mips, gcc-8) — PASS, 0 errors, 0 warnings, 0 section mismatches

--------------------------------------------------------------------------------
prima2_defconfig (arm, gcc-8) — PASS, 0 errors, 1 warning, 0 section mismatches

Warnings:
    WARNING: "return_address" [vmlinux] is a static EXPORT_SYMBOL_GPL

--------------------------------------------------------------------------------
pxa168_defconfig (arm, gcc-8) — PASS, 0 errors, 1 warning, 0 section mismatches

Warnings:
    WARNING: "return_address" [vmlinux] is a static EXPORT_SYMBOL_GPL

--------------------------------------------------------------------------------
pxa255-idp_defconfig (arm, gcc-8) — PASS, 0 errors, 0 warnings, 0 section mismatches

--------------------------------------------------------------------------------
pxa3xx_defconfig (arm, gcc-8) — PASS, 0 errors, 1 warning, 0 section mismatches

Warnings:
    WARNING: "return_address" [vmlinux] is a static EXPORT_SYMBOL_GPL

--------------------------------------------------------------------------------
pxa910_defconfig (arm, gcc-8) — PASS, 0 errors, 1 warning, 0 section mismatches

Warnings:
    WARNING: "return_address" [vmlinux] is a static EXPORT_SYMBOL_GPL

--------------------------------------------------------------------------------
pxa_defconfig (arm, gcc-8) — PASS, 0 errors, 0 warnings, 0 section mismatches

--------------------------------------------------------------------------------
qcom_defconfig (arm, gcc-8) — PASS, 0 errors, 1 warning, 0 section mismatches

Warnings:
    WARNING: "return_address" [vmlinux] is a static EXPORT_SYMBOL_GPL

--------------------------------------------------------------------------------
qi_lb60_defconfig (mips, gcc-8) — PASS, 0 errors, 0 warnings, 0 section mismatches

--------------------------------------------------------------------------------
rb532_defconfig (mips, gcc-8) — PASS, 0 errors, 0 warnings, 0 section mismatches

--------------------------------------------------------------------------------
rbtx49xx_defconfig (mips, gcc-8) — PASS, 0 errors, 1 warning, 0 section mismatches

Warnings:
    sound/soc/txx9/txx9aclc.c:54:30: warning: unused variable 'rtd' [-Wunused-variable]

--------------------------------------------------------------------------------
realview_defconfig (arm, gcc-8) — PASS, 0 errors, 1 warning, 0 section mismatches

Warnings:
    WARNING: "return_address" [vmlinux] is a static EXPORT_SYMBOL_GPL

--------------------------------------------------------------------------------
rm200_defconfig (mips, gcc-8) — PASS, 0 errors, 0 warnings, 0 section mismatches

--------------------------------------------------------------------------------
rpc_defconfig (arm, gcc-8) — PASS, 0 errors, 0 warnings, 0 section mismatches

Section mismatches:
    WARNING: vmlinux.o(.text.unlikely+0x8e4): Section mismatch in reference from the function free_memmap() to the function .meminit.text:memblock_free()

--------------------------------------------------------------------------------
rt305x_defconfig (mips, gcc-8) — PASS, 0 errors, 0 warnings, 0 section mismatches

--------------------------------------------------------------------------------
rv32_defconfig (riscv, gcc-8) — PASS, 0 errors, 8 warnings, 0 section mismatches

Warnings:
    <stdin>:830:2: warning: #warning syscall fstat64 not implemented [-Wcpp]
    <stdin>:1127:2: warning: #warning syscall fstatat64 not implemented [-Wcpp]
    <stdin>:1511:2: warning: #warning syscall clone3 not implemented [-Wcpp]
    drivers/net/ethernet/intel/e1000e/netdev.c:6405:13: warning: 'e1000e_s0ix_exit_flow' defined but not used [-Wunused-function]
    drivers/net/ethernet/intel/e1000e/netdev.c:6298:13: warning: 'e1000e_s0ix_entry_flow' defined but not used [-Wunused-function]
    <stdin>:830:2: warning: #warning syscall fstat64 not implemented [-Wcpp]
    <stdin>:1127:2: warning: #warning syscall fstatat64 not implemented [-Wcpp]
    <stdin>:1511:2: warning: #warning syscall clone3 not implemented [-Wcpp]

--------------------------------------------------------------------------------
s3c2410_defconfig (arm, gcc-8) — PASS, 0 errors, 1 warning, 0 section mismatches

Warnings:
    sound/soc/soc-pcm.c:1207:8: warning: unused variable 'name' [-Wunused-variable]

--------------------------------------------------------------------------------
s3c6400_defconfig (arm, gcc-8) — PASS, 0 errors, 2 warnings, 0 section mismatches

Warnings:
    WARNING: "return_address" [vmlinux] is a static EXPORT_SYMBOL_GPL
    sound/soc/soc-pcm.c:1207:8: warning: unused variable 'name' [-Wunused-variable]

--------------------------------------------------------------------------------
s5pv210_defconfig (arm, gcc-8) — PASS, 0 errors, 1 warning, 0 section mismatches

Warnings:
    WARNING: "return_address" [vmlinux] is a static EXPORT_SYMBOL_GPL

--------------------------------------------------------------------------------
sama5_defconfig (arm, gcc-8) — PASS, 0 errors, 1 warning, 0 section mismatches

Warnings:
    WARNING: "return_address" [vmlinux] is a static EXPORT_SYMBOL_GPL

--------------------------------------------------------------------------------
sb1250_swarm_defconfig (mips, gcc-8) — PASS, 0 errors, 0 warnings, 0 section mismatches

--------------------------------------------------------------------------------
shannon_defconfig (arm, gcc-8) — PASS, 0 errors, 0 warnings, 0 section mismatches

Section mismatches:
    WARNING: vmlinux.o(.text.unlikely+0x8c4): Section mismatch in reference from the function free_memmap() to the function .meminit.text:memblock_free()

--------------------------------------------------------------------------------
shmobile_defconfig (arm, gcc-8) — PASS, 0 errors, 0 warnings, 0 section mismatches

--------------------------------------------------------------------------------
simpad_defconfig (arm, gcc-8) — PASS, 0 errors, 0 warnings, 0 section mismatches

Section mismatches:
    WARNING: vmlinux.o(.text.unlikely+0x84c): Section mismatch in reference from the function free_memmap() to the function .meminit.text:memblock_free()

--------------------------------------------------------------------------------
socfpga_defconfig (arm, gcc-8) — PASS, 0 errors, 0 warnings, 0 section mismatches

--------------------------------------------------------------------------------
spear13xx_defconfig (arm, gcc-8) — PASS, 0 errors, 1 warning, 0 section mismatches

Warnings:
    WARNING: "return_address" [vmlinux] is a static EXPORT_SYMBOL_GPL

--------------------------------------------------------------------------------
spear3xx_defconfig (arm, gcc-8) — PASS, 0 errors, 0 warnings, 0 section mismatches

--------------------------------------------------------------------------------
spear6xx_defconfig (arm, gcc-8) — PASS, 0 errors, 0 warnings, 0 section mismatches

--------------------------------------------------------------------------------
spitz_defconfig (arm, gcc-8) — PASS, 0 errors, 0 warnings, 0 section mismatches

--------------------------------------------------------------------------------
stm32_defconfig (arm, gcc-8) — PASS, 0 errors, 0 warnings, 0 section mismatches

--------------------------------------------------------------------------------
sunxi_defconfig (arm, gcc-8) — PASS, 0 errors, 1 warning, 0 section mismatches

Warnings:
    WARNING: "return_address" [vmlinux] is a static EXPORT_SYMBOL_GPL

--------------------------------------------------------------------------------
tango4_defconfig (arm, gcc-8) — PASS, 0 errors, 1 warning, 0 section mismatches

Warnings:
    WARNING: "return_address" [vmlinux] is a static EXPORT_SYMBOL_GPL

--------------------------------------------------------------------------------
tb0219_defconfig (mips, gcc-8) — PASS, 0 errors, 0 warnings, 0 section mismatches

--------------------------------------------------------------------------------
tb0226_defconfig (mips, gcc-8) — PASS, 0 errors, 0 warnings, 0 section mismatches

--------------------------------------------------------------------------------
tb0287_defconfig (mips, gcc-8) — PASS, 0 errors, 0 warnings, 0 section mismatches

--------------------------------------------------------------------------------
tct_hammer_defconfig (arm, gcc-8) — PASS, 0 errors, 0 warnings, 0 section mismatches

--------------------------------------------------------------------------------
tegra_defconfig (arm, gcc-8) — PASS, 0 errors, 1 warning, 0 section mismatches

Warnings:
    WARNING: "return_address" [vmlinux] is a static EXPORT_SYMBOL_GPL

--------------------------------------------------------------------------------
tinyconfig (i386, gcc-8) — PASS, 0 errors, 0 warnings, 0 section mismatches

--------------------------------------------------------------------------------
tinyconfig (arm64, gcc-8) — PASS, 0 errors, 0 warnings, 0 section mismatches

--------------------------------------------------------------------------------
tinyconfig (x86_64, gcc-8) — PASS, 0 errors, 1 warning, 0 section mismatches

Warnings:
    .config:1165:warning: override: UNWINDER_GUESS changes choice state

--------------------------------------------------------------------------------
tinyconfig (arm, gcc-8) — PASS, 0 errors, 0 warnings, 0 section mismatches

--------------------------------------------------------------------------------
tinyconfig (riscv, gcc-8) — PASS, 0 errors, 0 warnings, 0 section mismatches

--------------------------------------------------------------------------------
tinyconfig (mips, gcc-8) — PASS, 0 errors, 0 warnings, 0 section mismatches

--------------------------------------------------------------------------------
tinyconfig (arc, gcc-8) — PASS, 0 errors, 1 warning, 0 section mismatches

Warnings:
    <stdin>:1511:2: warning: #warning syscall clone3 not implemented [-Wcpp]

--------------------------------------------------------------------------------
trizeps4_defconfig (arm, gcc-8) — PASS, 0 errors, 1 warning, 0 section mismatches

Warnings:
    WARNING: "return_address" [vmlinux] is a static EXPORT_SYMBOL_GPL

--------------------------------------------------------------------------------
u300_defconfig (arm, gcc-8) — PASS, 0 errors, 1 warning, 0 section mismatches

Warnings:
    WARNING: "return_address" [vmlinux] is a static EXPORT_SYMBOL_GPL

--------------------------------------------------------------------------------
u8500_defconfig (arm, gcc-8) — PASS, 0 errors, 1 warning, 0 section mismatches

Warnings:
    WARNING: "return_address" [vmlinux] is a static EXPORT_SYMBOL_GPL

--------------------------------------------------------------------------------
vdk_hs38_defconfig (arc, gcc-8) — PASS, 0 errors, 1 warning, 0 section mismatches

Warnings:
    <stdin>:1511:2: warning: #warning syscall clone3 not implemented [-Wcpp]

--------------------------------------------------------------------------------
vdk_hs38_smp_defconfig (arc, gcc-8) — PASS, 0 errors, 1 warning, 0 section mismatches

Warnings:
    <stdin>:1511:2: warning: #warning syscall clone3 not implemented [-Wcpp]

--------------------------------------------------------------------------------
versatile_defconfig (arm, gcc-8) — PASS, 0 errors, 1 warning, 0 section mismatches

Warnings:
    WARNING: "return_address" [vmlinux] is a static EXPORT_SYMBOL_GPL

--------------------------------------------------------------------------------
vexpress_defconfig (arm, gcc-8) — PASS, 0 errors, 1 warning, 0 section mismatches

Warnings:
    WARNING: "return_address" [vmlinux] is a static EXPORT_SYMBOL_GPL

--------------------------------------------------------------------------------
vf610m4_defconfig (arm, gcc-8) — PASS, 0 errors, 0 warnings, 0 section mismatches

--------------------------------------------------------------------------------
viper_defconfig (arm, gcc-8) — PASS, 0 errors, 1 warning, 0 section mismatches

Warnings:
    WARNING: "return_address" [vmlinux] is a static EXPORT_SYMBOL_GPL

--------------------------------------------------------------------------------
vocore2_defconfig (mips, gcc-8) — PASS, 0 errors, 0 warnings, 0 section mismatches

--------------------------------------------------------------------------------
vt8500_v6_v7_defconfig (arm, gcc-8) — PASS, 0 errors, 0 warnings, 0 section mismatches

--------------------------------------------------------------------------------
workpad_defconfig (mips, gcc-8) — PASS, 0 errors, 0 warnings, 0 section mismatches

--------------------------------------------------------------------------------
x86_64_defconfig (x86_64, gcc-8) — PASS, 0 errors, 0 warnings, 0 section mismatches

--------------------------------------------------------------------------------
x86_64_defconfig+kselftest (x86_64, gcc-8) — PASS, 0 errors, 27 warnings, 0 section mismatches

Warnings:
    ./.tmp.config.xS81TWvZ7g:4566:warning: override: reassigning to symbol BPF_SYSCALL
    ./.tmp.config.xS81TWvZ7g:4569:warning: override: reassigning to symbol NET_VRF
    ./.tmp.config.xS81TWvZ7g:4570:warning: override: reassigning to symbol NET_L3_MASTER_DEV
    ./.tmp.config.xS81TWvZ7g:4572:warning: override: reassigning to symbol IPV6_MULTIPLE_TABLES
    ./.tmp.config.xS81TWvZ7g:4573:warning: override: reassigning to symbol VETH
    ./.tmp.config.xS81TWvZ7g:4577:warning: override: reassigning to symbol BRIDGE
    ./.tmp.config.xS81TWvZ7g:4578:warning: override: reassigning to symbol VLAN_8021Q
    ./.tmp.config.xS81TWvZ7g:4636:warning: override: reassigning to symbol NET_SCH_INGRESS
    ./.tmp.config.xS81TWvZ7g:4657:warning: override: reassigning to symbol NET_ACT_GACT
    ./.tmp.config.xS81TWvZ7g:4682:warning: override: reassigning to symbol USER_NS
    ./.tmp.config.xS81TWvZ7g:4686:warning: override: reassigning to symbol NET_NS
    ./.tmp.config.xS81TWvZ7g:4794:warning: override: reassigning to symbol USER_NS
    ./.tmp.config.xS81TWvZ7g:4805:warning: override: reassigning to symbol NOTIFIER_ERROR_INJECTION
    ./.tmp.config.xS81TWvZ7g:4815:warning: override: reassigning to symbol ANDROID
    ./.tmp.config.xS81TWvZ7g:4822:warning: override: reassigning to symbol BPF_SYSCALL
    ./.tmp.config.xS81TWvZ7g:4825:warning: override: reassigning to symbol TEST_BPF
    ./.tmp.config.xS81TWvZ7g:4826:warning: override: reassigning to symbol CGROUP_BPF
    ./.tmp.config.xS81TWvZ7g:4828:warning: override: reassigning to symbol NET_CLS_ACT
    ./.tmp.config.xS81TWvZ7g:4829:warning: override: reassigning to symbol NET_SCHED
    ./.tmp.config.xS81TWvZ7g:4830:warning: override: reassigning to symbol NET_SCH_INGRESS
    ./.tmp.config.xS81TWvZ7g:4832:warning: override: reassigning to symbol IPV6
    ./.tmp.config.xS81TWvZ7g:4841:warning: override: reassigning to symbol NET_CLS_FLOWER
    ./.tmp.config.xS81TWvZ7g:4847:warning: override: reassigning to symbol IPV6_GRE
    ./.tmp.config.xS81TWvZ7g:4867:warning: override: reassigning to symbol SECURITYFS
    ./.tmp.config.xS81TWvZ7g:4871:warning: override: reassigning to symbol STAGING
    ./.tmp.config.xS81TWvZ7g:4872:warning: override: reassigning to symbol ANDROID
    ./.tmp.config.xS81TWvZ7g:4889:warning: override: reassigning to symbol USER_NS

--------------------------------------------------------------------------------
x86_64_defconfig+kvm_guest (x86_64, gcc-8) — PASS, 0 errors, 0 warnings, 0 section mismatches

--------------------------------------------------------------------------------
xcep_defconfig (arm, gcc-8) — PASS, 0 errors, 1 warning, 0 section mismatches

Warnings:
    WARNING: "return_address" [vmlinux] is a static EXPORT_SYMBOL_GPL

--------------------------------------------------------------------------------
xway_defconfig (mips, gcc-8) — PASS, 0 errors, 0 warnings, 0 section mismatches

--------------------------------------------------------------------------------
zeus_defconfig (arm, gcc-8) — PASS, 0 errors, 2 warnings, 0 section mismatches

Warnings:
    WARNING: "return_address" [vmlinux] is a static EXPORT_SYMBOL_GPL
    sound/soc/soc-pcm.c:1207:8: warning: unused variable 'name' [-Wunused-variable]

--------------------------------------------------------------------------------
zx_defconfig (arm, gcc-8) — PASS, 0 errors, 0 warnings, 0 section mismatches

---
For more info write to <info@kernelci.org>

^ permalink raw reply	[flat|nested] only message in thread

only message in thread, back to index

Thread overview: (only message) (download: mbox.gz / follow: Atom feed)
-- links below jump to the message on this page --
2019-10-23 13:38 next/master build: 219 builds: 3 failed, 216 passed, 22 errors, 385 warnings (next-20191023) kernelci.org bot

Linux-Next Archive on lore.kernel.org

Archives are clonable:
	git clone --mirror https://lore.kernel.org/linux-next/0 linux-next/git/0.git

	# If you have public-inbox 1.1+ installed, you may
	# initialize and index your mirror using the following commands:
	public-inbox-init -V2 linux-next linux-next/ https://lore.kernel.org/linux-next \
		linux-next@vger.kernel.org
	public-inbox-index linux-next

Example config snippet for mirrors

Newsgroup available over NNTP:
	nntp://nntp.lore.kernel.org/org.kernel.vger.linux-next


AGPL code for this site: git clone https://public-inbox.org/public-inbox.git