Linux-Next Archive on lore.kernel.org
 help / color / Atom feed
* next/master build: 216 builds: 1 failed, 215 passed, 4 errors, 349 warnings (next-20191024)
@ 2019-10-24 11:17 kernelci.org bot
  0 siblings, 0 replies; only message in thread
From: kernelci.org bot @ 2019-10-24 11:17 UTC (permalink / raw)
  To: linux-next

next/master build: 216 builds: 1 failed, 215 passed, 4 errors, 349 warnings (next-20191024)

Full Build Summary: https://kernelci.org/build/next/branch/master/kernel/next-20191024/

Tree: next
Branch: master
Git Describe: next-20191024
Git Commit: 12d61c6996999e6562cbbed5f270d572248a11c5
Git URL: git://git.kernel.org/pub/scm/linux/kernel/git/next/linux-next.git
Built: 7 unique architectures

Build Failure Detected:

mips:
    cavium_octeon_defconfig: (gcc-8) FAIL

Errors and Warnings Detected:

arc:
    allnoconfig (gcc-8): 1 warning
    axs103_defconfig (gcc-8): 2 warnings
    axs103_smp_defconfig (gcc-8): 2 warnings
    haps_hs_defconfig (gcc-8): 2 warnings
    haps_hs_smp_defconfig (gcc-8): 2 warnings
    hsdk_defconfig (gcc-8): 2 warnings
    nsimosci_hs_defconfig (gcc-8): 2 warnings
    nsimosci_hs_smp_defconfig (gcc-8): 2 warnings
    tinyconfig (gcc-8): 1 warning
    vdk_hs38_defconfig (gcc-8): 1 warning
    vdk_hs38_smp_defconfig (gcc-8): 1 warning

arm64:
    allmodconfig (gcc-8): 1 warning
    allmodconfig (clang-8): 47 warnings
    defconfig (gcc-8): 27 warnings

arm:
    allmodconfig (gcc-8): 19 warnings
    am200epdkit_defconfig (gcc-8): 1 warning
    at91_dt_defconfig (gcc-8): 1 warning
    axm55xx_defconfig (gcc-8): 1 warning
    bcm2835_defconfig (gcc-8): 3 warnings
    cm_x2xx_defconfig (gcc-8): 1 warning
    cm_x300_defconfig (gcc-8): 1 warning
    cns3420vb_defconfig (gcc-8): 1 warning
    colibri_pxa270_defconfig (gcc-8): 1 warning
    colibri_pxa300_defconfig (gcc-8): 1 warning
    davinci_all_defconfig (gcc-8): 1 warning
    dove_defconfig (gcc-8): 1 warning
    em_x270_defconfig (gcc-8): 1 warning
    ep93xx_defconfig (gcc-8): 1 warning
    eseries_pxa_defconfig (gcc-8): 2 warnings
    exynos_defconfig (gcc-8): 1 warning
    ezx_defconfig (gcc-8): 1 warning
    h5000_defconfig (gcc-8): 1 warning
    imote2_defconfig (gcc-8): 1 warning
    imx_v4_v5_defconfig (gcc-8): 1 warning
    imx_v6_v7_defconfig (gcc-8): 1 warning
    integrator_defconfig (gcc-8): 1 warning
    ixp4xx_defconfig (gcc-8): 1 warning
    keystone_defconfig (gcc-8): 1 warning
    lpc32xx_defconfig (gcc-8): 1 warning
    magician_defconfig (gcc-8): 2 warnings
    milbeaut_m10v_defconfig (gcc-8): 1 warning
    mini2440_defconfig (gcc-8): 1 warning
    mmp2_defconfig (gcc-8): 1 warning
    multi_v5_defconfig (gcc-8): 1 warning
    multi_v7_defconfig (gcc-8): 1 warning
    multi_v7_defconfig (gcc-8): 1 warning
    multi_v7_defconfig (gcc-8): 1 warning
    multi_v7_defconfig (gcc-8): 1 warning
    multi_v7_defconfig (gcc-8): 28 warnings
    mv78xx0_defconfig (gcc-8): 1 warning
    mvebu_v5_defconfig (gcc-8): 1 warning
    mvebu_v7_defconfig (gcc-8): 1 warning
    mxs_defconfig (gcc-8): 1 warning
    nhk8815_defconfig (gcc-8): 1 warning
    omap1_defconfig (gcc-8): 1 warning
    omap2plus_defconfig (gcc-8): 1 warning
    orion5x_defconfig (gcc-8): 1 warning
    oxnas_v6_defconfig (gcc-8): 1 warning
    palmz72_defconfig (gcc-8): 1 warning
    pcm027_defconfig (gcc-8): 1 warning
    prima2_defconfig (gcc-8): 1 warning
    pxa168_defconfig (gcc-8): 1 warning
    pxa3xx_defconfig (gcc-8): 1 warning
    pxa910_defconfig (gcc-8): 1 warning
    qcom_defconfig (gcc-8): 1 warning
    realview_defconfig (gcc-8): 1 warning
    s3c2410_defconfig (gcc-8): 1 warning
    s3c6400_defconfig (gcc-8): 2 warnings
    s5pv210_defconfig (gcc-8): 1 warning
    sama5_defconfig (gcc-8): 1 warning
    spear13xx_defconfig (gcc-8): 1 warning
    sunxi_defconfig (gcc-8): 1 warning
    tango4_defconfig (gcc-8): 1 warning
    tegra_defconfig (gcc-8): 1 warning
    trizeps4_defconfig (gcc-8): 1 warning
    u300_defconfig (gcc-8): 1 warning
    u8500_defconfig (gcc-8): 1 warning
    versatile_defconfig (gcc-8): 1 warning
    vexpress_defconfig (gcc-8): 1 warning
    viper_defconfig (gcc-8): 1 warning
    xcep_defconfig (gcc-8): 1 warning
    zeus_defconfig (gcc-8): 2 warnings

i386:
    i386_defconfig (gcc-8): 28 warnings

mips:
    32r2el_defconfig (gcc-8): 28 warnings
    cavium_octeon_defconfig (gcc-8): 4 errors, 3 warnings
    db1xxx_defconfig (gcc-8): 1 warning
    ip27_defconfig (gcc-8): 2 warnings
    malta_qemu_32r6_defconfig (gcc-8): 1 warning
    nlm_xlp_defconfig (gcc-8): 2 warnings
    nlm_xlr_defconfig (gcc-8): 3 warnings
    rbtx49xx_defconfig (gcc-8): 1 warning

riscv:
    defconfig (gcc-8): 2 warnings
    defconfig (gcc-8): 29 warnings
    rv32_defconfig (gcc-8): 8 warnings

x86_64:
    allmodconfig (gcc-8): 1 warning
    tinyconfig (gcc-8): 1 warning
    x86_64_defconfig (gcc-8): 27 warnings

Errors summary:

    1    drivers/staging/octeon/ethernet.c:516:29: error: type of formal parameter 2 is incomplete
    1    drivers/staging/octeon/ethernet.c:499:30: error: storage size of 'link_info' isn't known
    1    drivers/staging/octeon/ethernet.c:463:30: error: storage size of 'link_info' isn't known
    1    drivers/staging/octeon/ethernet.c:177:21: error: dereferencing pointer to incomplete type 'struct cvmx_wqe'

Warnings summary:

    64   WARNING: "return_address" [vmlinux] is a static EXPORT_SYMBOL_GPL
    20   <stdin>:1511:2: warning: #warning syscall clone3 not implemented [-Wcpp]
    16   1 warning generated.
    9    drivers/net/phy/mdio-cavium.h:113:48: warning: cast to pointer from integer of different size [-Wint-to-pointer-cast]
    6    sound/soc/soc-pcm.c:1185:8: warning: unused variable 'name' [-Wunused-variable]
    6    drivers/net/ethernet/intel/e1000e/netdev.c:6405:13: warning: 'e1000e_s0ix_exit_flow' defined but not used [-Wunused-function]
    6    drivers/net/ethernet/intel/e1000e/netdev.c:6298:13: warning: 'e1000e_s0ix_entry_flow' defined but not used [-Wunused-function]
    5    include/linux/kern_levels.h:5:18: warning: format '%lu' expects argument of type 'long unsigned int', but argument 8 has type 'unsigned int' [-Wformat=]
    5    2 warnings generated.
    4    sound/soc/codecs/rt5677-spi.c:114:30: warning: unused variable 'rtd' [-Wunused-variable]
    4    drivers/net/phy/mdio-cavium.h:114:37: warning: cast to pointer from integer of different size [-Wint-to-pointer-cast]
    2    <stdin>:830:2: warning: #warning syscall fstat64 not implemented [-Wcpp]
    2    <stdin>:1127:2: warning: #warning syscall fstatat64 not implemented [-Wcpp]
    1    {standard input}:134: Warning: macro instruction expanded into multiple instructions
    1    warning: same module names found:
    1    sound/soc/txx9/txx9aclc.c:54:30: warning: unused variable 'rtd' [-Wunused-variable]
    1    net/nfc/hci/llc_shdlc.c:687:34: warning: variable 'connect_wq' is uninitialized when used within its own initialization [-Wuninitialized]
    1    net/nfc/hci/command.c:59:34: warning: variable 'ew_wq' is uninitialized when used within its own initialization [-Wuninitialized]
    1    mm/shmem.c:2737:35: warning: variable 'shmem_falloc_waitq' is uninitialized when used within its own initialization [-Wuninitialized]
    1    kernel/debug/debug_core.c:470:18: warning: array subscript [0, 0] is outside array bounds of 'struct debuggerinfo_struct[1]' [-Warray-bounds]
    1    kernel/debug/debug_core.c:469:33: warning: array subscript [0, 0] is outside array bounds of 'struct debuggerinfo_struct[1]' [-Warray-bounds]
    1    kernel/debug/debug_core.c:452:17: warning: array subscript [0, 0] is outside array bounds of 'struct debuggerinfo_struct[1]' [-Warray-bounds]
    1    fs/proc/proc_sysctl.c:705:35: warning: variable 'wq' is uninitialized when used within its own initialization [-Wuninitialized]
    1    fs/proc/base.c:1894:35: warning: variable 'wq' is uninitialized when used within its own initialization [-Wuninitialized]
    1    fs/nfs/dir.c:448:34: warning: variable 'wq' is uninitialized when used within its own initialization [-Wuninitialized]
    1    fs/nfs/dir.c:1499:34: warning: variable 'wq' is uninitialized when used within its own initialization [-Wuninitialized]
    1    fs/namei.c:3132:34: warning: variable 'wq' is uninitialized when used within its own initialization [-Wuninitialized]
    1    fs/namei.c:1644:34: warning: variable 'wq' is uninitialized when used within its own initialization [-Wuninitialized]
    1    fs/fuse/readdir.c:161:34: warning: variable 'wq' is uninitialized when used within its own initialization [-Wuninitialized]
    1    fs/cifs/readdir.c:83:34: warning: variable 'wq' is uninitialized when used within its own initialization [-Wuninitialized]
    1    fs/afs/dir_silly.c:205:34: warning: variable 'wq' is uninitialized when used within its own initialization [-Wuninitialized]
    1    drivers/staging/octeon/octeon-ethernet.h:94:12: warning: 'union cvmx_helper_link_info' declared inside parameter list will not be visible outside of this definition or declaration
    1    drivers/staging/octeon/ethernet.c:499:30: warning: unused variable 'link_info' [-Wunused-variable]
    1    drivers/staging/octeon/ethernet.c:463:30: warning: unused variable 'link_info' [-Wunused-variable]
    1    drivers/scsi/lpfc/lpfc_sli.c:11855:34: warning: variable 'done_q' is uninitialized when used within its own initialization [-Wuninitialized]
    1    drivers/scsi/lpfc/lpfc_scsi.c:4722:34: warning: variable 'waitq' is uninitialized when used within its own initialization [-Wuninitialized]
    1    drivers/scsi/bfa/bfad_im.c:378:34: warning: variable 'wq' is uninitialized when used within its own initialization [-Wuninitialized]
    1    drivers/scsi/bfa/bfad_im.c:301:34: warning: variable 'wq' is uninitialized when used within its own initialization [-Wuninitialized]
    1    drivers/net/usb/lan78xx.c:2662:34: warning: variable 'unlink_wakeup' is uninitialized when used within its own initialization [-Wuninitialized]
    1    drivers/net/phy/mdio-octeon.c:48:3: warning: cast from pointer to integer of different size [-Wpointer-to-int-cast]
    1    drivers/misc/mic/vop/vop_vringh.c:399:34: warning: variable 'wake' is uninitialized when used within its own initialization [-Wuninitialized]
    1    drivers/misc/mic/vop/vop_vringh.c:155:34: warning: variable 'wake' is uninitialized when used within its own initialization [-Wuninitialized]
    1    drivers/gpu/host1x/syncpt.c:208:34: warning: variable 'wq' is uninitialized when used within its own initialization [-Wuninitialized]
    1    drivers/gpu/drm/amd/amdgpu/../powerplay/renoir_ppt.c:182:26: warning: suggest braces around initialization of subobject [-Wmissing-braces]
    1    drivers/dma/fsl-dpaa2-qdma/dpdmai.c:151:25: warning: variable 'cfg' is uninitialized when used within its own initialization [-Wuninitialized]
    1    drivers/dma/fsl-dpaa2-qdma/dpdmai.c:151:20: warning: variable 'cmd' is uninitialized when used within its own initialization [-Wuninitialized]
    1    drivers/bluetooth/bluecard_cs.c:282:36: warning: variable 'wq' is uninitialized when used within its own initialization [-Wuninitialized]
    1    drivers/android/binderfs.c:657:41: warning: suggest braces around initialization of subobject [-Wmissing-braces]
    1    /tmp/ccygpJU8.s:18191: Warning: using r15 results in unpredictable behaviour
    1    /tmp/ccygpJU8.s:18119: Warning: using r15 results in unpredictable behaviour
    1    .config:1165:warning: override: UNWINDER_GUESS changes choice state
    1    ./.tmp.config.rrjgYa4qnP:3365:warning: override: reassigning to symbol USER_NS
    1    ./.tmp.config.rrjgYa4qnP:3348:warning: override: reassigning to symbol ANDROID
    1    ./.tmp.config.rrjgYa4qnP:3347:warning: override: reassigning to symbol STAGING
    1    ./.tmp.config.rrjgYa4qnP:3343:warning: override: reassigning to symbol SECURITYFS
    1    ./.tmp.config.rrjgYa4qnP:3323:warning: override: reassigning to symbol IPV6_GRE
    1    ./.tmp.config.rrjgYa4qnP:3317:warning: override: reassigning to symbol NET_CLS_FLOWER
    1    ./.tmp.config.rrjgYa4qnP:3308:warning: override: reassigning to symbol IPV6
    1    ./.tmp.config.rrjgYa4qnP:3306:warning: override: reassigning to symbol NET_SCH_INGRESS
    1    ./.tmp.config.rrjgYa4qnP:3305:warning: override: reassigning to symbol NET_SCHED
    1    ./.tmp.config.rrjgYa4qnP:3304:warning: override: reassigning to symbol NET_CLS_ACT
    1    ./.tmp.config.rrjgYa4qnP:3302:warning: override: reassigning to symbol CGROUP_BPF
    1    ./.tmp.config.rrjgYa4qnP:3301:warning: override: reassigning to symbol TEST_BPF
    1    ./.tmp.config.rrjgYa4qnP:3298:warning: override: reassigning to symbol BPF_SYSCALL
    1    ./.tmp.config.rrjgYa4qnP:3291:warning: override: reassigning to symbol ANDROID
    1    ./.tmp.config.rrjgYa4qnP:3281:warning: override: reassigning to symbol NOTIFIER_ERROR_INJECTION
    1    ./.tmp.config.rrjgYa4qnP:3270:warning: override: reassigning to symbol USER_NS
    1    ./.tmp.config.rrjgYa4qnP:3162:warning: override: reassigning to symbol NET_NS
    1    ./.tmp.config.rrjgYa4qnP:3158:warning: override: reassigning to symbol USER_NS
    1    ./.tmp.config.rrjgYa4qnP:3133:warning: override: reassigning to symbol NET_ACT_GACT
    1    ./.tmp.config.rrjgYa4qnP:3112:warning: override: reassigning to symbol NET_SCH_INGRESS
    1    ./.tmp.config.rrjgYa4qnP:3054:warning: override: reassigning to symbol VLAN_8021Q
    1    ./.tmp.config.rrjgYa4qnP:3053:warning: override: reassigning to symbol BRIDGE
    1    ./.tmp.config.rrjgYa4qnP:3049:warning: override: reassigning to symbol VETH
    1    ./.tmp.config.rrjgYa4qnP:3048:warning: override: reassigning to symbol IPV6_MULTIPLE_TABLES
    1    ./.tmp.config.rrjgYa4qnP:3046:warning: override: reassigning to symbol NET_L3_MASTER_DEV
    1    ./.tmp.config.rrjgYa4qnP:3045:warning: override: reassigning to symbol NET_VRF
    1    ./.tmp.config.rrjgYa4qnP:3042:warning: override: reassigning to symbol BPF_SYSCALL
    1    ./.tmp.config.PODRA17WFs:7968:warning: override: reassigning to symbol USER_NS
    1    ./.tmp.config.PODRA17WFs:7951:warning: override: reassigning to symbol ANDROID
    1    ./.tmp.config.PODRA17WFs:7950:warning: override: reassigning to symbol STAGING
    1    ./.tmp.config.PODRA17WFs:7946:warning: override: reassigning to symbol SECURITYFS
    1    ./.tmp.config.PODRA17WFs:7926:warning: override: reassigning to symbol IPV6_GRE
    1    ./.tmp.config.PODRA17WFs:7920:warning: override: reassigning to symbol NET_CLS_FLOWER
    1    ./.tmp.config.PODRA17WFs:7911:warning: override: reassigning to symbol IPV6
    1    ./.tmp.config.PODRA17WFs:7909:warning: override: reassigning to symbol NET_SCH_INGRESS
    1    ./.tmp.config.PODRA17WFs:7908:warning: override: reassigning to symbol NET_SCHED
    1    ./.tmp.config.PODRA17WFs:7907:warning: override: reassigning to symbol NET_CLS_ACT
    1    ./.tmp.config.PODRA17WFs:7905:warning: override: reassigning to symbol CGROUP_BPF
    1    ./.tmp.config.PODRA17WFs:7904:warning: override: reassigning to symbol TEST_BPF
    1    ./.tmp.config.PODRA17WFs:7901:warning: override: reassigning to symbol BPF_SYSCALL
    1    ./.tmp.config.PODRA17WFs:7894:warning: override: reassigning to symbol ANDROID
    1    ./.tmp.config.PODRA17WFs:7884:warning: override: reassigning to symbol NOTIFIER_ERROR_INJECTION
    1    ./.tmp.config.PODRA17WFs:7873:warning: override: reassigning to symbol USER_NS
    1    ./.tmp.config.PODRA17WFs:7765:warning: override: reassigning to symbol NET_NS
    1    ./.tmp.config.PODRA17WFs:7761:warning: override: reassigning to symbol USER_NS
    1    ./.tmp.config.PODRA17WFs:7736:warning: override: reassigning to symbol NET_ACT_GACT
    1    ./.tmp.config.PODRA17WFs:7715:warning: override: reassigning to symbol NET_SCH_INGRESS
    1    ./.tmp.config.PODRA17WFs:7657:warning: override: reassigning to symbol VLAN_8021Q
    1    ./.tmp.config.PODRA17WFs:7656:warning: override: reassigning to symbol BRIDGE
    1    ./.tmp.config.PODRA17WFs:7652:warning: override: reassigning to symbol VETH
    1    ./.tmp.config.PODRA17WFs:7651:warning: override: reassigning to symbol IPV6_MULTIPLE_TABLES
    1    ./.tmp.config.PODRA17WFs:7649:warning: override: reassigning to symbol NET_L3_MASTER_DEV
    1    ./.tmp.config.PODRA17WFs:7648:warning: override: reassigning to symbol NET_VRF
    1    ./.tmp.config.PODRA17WFs:7645:warning: override: reassigning to symbol BPF_SYSCALL
    1    ./.tmp.config.FycgTjdDk7:3979:warning: override: reassigning to symbol USER_NS
    1    ./.tmp.config.FycgTjdDk7:3962:warning: override: reassigning to symbol ANDROID
    1    ./.tmp.config.FycgTjdDk7:3961:warning: override: reassigning to symbol STAGING
    1    ./.tmp.config.FycgTjdDk7:3957:warning: override: reassigning to symbol SECURITYFS
    1    ./.tmp.config.FycgTjdDk7:3937:warning: override: reassigning to symbol IPV6_GRE
    1    ./.tmp.config.FycgTjdDk7:3931:warning: override: reassigning to symbol NET_CLS_FLOWER
    1    ./.tmp.config.FycgTjdDk7:3922:warning: override: reassigning to symbol IPV6
    1    ./.tmp.config.FycgTjdDk7:3920:warning: override: reassigning to symbol NET_SCH_INGRESS
    1    ./.tmp.config.FycgTjdDk7:3919:warning: override: reassigning to symbol NET_SCHED
    1    ./.tmp.config.FycgTjdDk7:3918:warning: override: reassigning to symbol NET_CLS_ACT
    1    ./.tmp.config.FycgTjdDk7:3916:warning: override: reassigning to symbol CGROUP_BPF
    1    ./.tmp.config.FycgTjdDk7:3915:warning: override: reassigning to symbol TEST_BPF
    1    ./.tmp.config.FycgTjdDk7:3912:warning: override: reassigning to symbol BPF_SYSCALL
    1    ./.tmp.config.FycgTjdDk7:3905:warning: override: reassigning to symbol ANDROID
    1    ./.tmp.config.FycgTjdDk7:3895:warning: override: reassigning to symbol NOTIFIER_ERROR_INJECTION
    1    ./.tmp.config.FycgTjdDk7:3884:warning: override: reassigning to symbol USER_NS
    1    ./.tmp.config.FycgTjdDk7:3776:warning: override: reassigning to symbol NET_NS
    1    ./.tmp.config.FycgTjdDk7:3772:warning: override: reassigning to symbol USER_NS
    1    ./.tmp.config.FycgTjdDk7:3747:warning: override: reassigning to symbol NET_ACT_GACT
    1    ./.tmp.config.FycgTjdDk7:3726:warning: override: reassigning to symbol NET_SCH_INGRESS
    1    ./.tmp.config.FycgTjdDk7:3668:warning: override: reassigning to symbol VLAN_8021Q
    1    ./.tmp.config.FycgTjdDk7:3667:warning: override: reassigning to symbol BRIDGE
    1    ./.tmp.config.FycgTjdDk7:3663:warning: override: reassigning to symbol VETH
    1    ./.tmp.config.FycgTjdDk7:3662:warning: override: reassigning to symbol IPV6_MULTIPLE_TABLES
    1    ./.tmp.config.FycgTjdDk7:3660:warning: override: reassigning to symbol NET_L3_MASTER_DEV
    1    ./.tmp.config.FycgTjdDk7:3659:warning: override: reassigning to symbol NET_VRF
    1    ./.tmp.config.FycgTjdDk7:3656:warning: override: reassigning to symbol BPF_SYSCALL
    1    ./.tmp.config.EZjBlGuLCc:4826:warning: override: reassigning to symbol USER_NS
    1    ./.tmp.config.EZjBlGuLCc:4809:warning: override: reassigning to symbol ANDROID
    1    ./.tmp.config.EZjBlGuLCc:4808:warning: override: reassigning to symbol STAGING
    1    ./.tmp.config.EZjBlGuLCc:4804:warning: override: reassigning to symbol SECURITYFS
    1    ./.tmp.config.EZjBlGuLCc:4784:warning: override: reassigning to symbol IPV6_GRE
    1    ./.tmp.config.EZjBlGuLCc:4778:warning: override: reassigning to symbol NET_CLS_FLOWER
    1    ./.tmp.config.EZjBlGuLCc:4769:warning: override: reassigning to symbol IPV6
    1    ./.tmp.config.EZjBlGuLCc:4767:warning: override: reassigning to symbol NET_SCH_INGRESS
    1    ./.tmp.config.EZjBlGuLCc:4766:warning: override: reassigning to symbol NET_SCHED
    1    ./.tmp.config.EZjBlGuLCc:4765:warning: override: reassigning to symbol NET_CLS_ACT
    1    ./.tmp.config.EZjBlGuLCc:4763:warning: override: reassigning to symbol CGROUP_BPF
    1    ./.tmp.config.EZjBlGuLCc:4762:warning: override: reassigning to symbol TEST_BPF
    1    ./.tmp.config.EZjBlGuLCc:4759:warning: override: reassigning to symbol BPF_SYSCALL
    1    ./.tmp.config.EZjBlGuLCc:4752:warning: override: reassigning to symbol ANDROID
    1    ./.tmp.config.EZjBlGuLCc:4742:warning: override: reassigning to symbol NOTIFIER_ERROR_INJECTION
    1    ./.tmp.config.EZjBlGuLCc:4731:warning: override: reassigning to symbol USER_NS
    1    ./.tmp.config.EZjBlGuLCc:4623:warning: override: reassigning to symbol NET_NS
    1    ./.tmp.config.EZjBlGuLCc:4619:warning: override: reassigning to symbol USER_NS
    1    ./.tmp.config.EZjBlGuLCc:4594:warning: override: reassigning to symbol NET_ACT_GACT
    1    ./.tmp.config.EZjBlGuLCc:4573:warning: override: reassigning to symbol NET_SCH_INGRESS
    1    ./.tmp.config.EZjBlGuLCc:4515:warning: override: reassigning to symbol VLAN_8021Q
    1    ./.tmp.config.EZjBlGuLCc:4514:warning: override: reassigning to symbol BRIDGE
    1    ./.tmp.config.EZjBlGuLCc:4510:warning: override: reassigning to symbol VETH
    1    ./.tmp.config.EZjBlGuLCc:4509:warning: override: reassigning to symbol IPV6_MULTIPLE_TABLES
    1    ./.tmp.config.EZjBlGuLCc:4507:warning: override: reassigning to symbol NET_L3_MASTER_DEV
    1    ./.tmp.config.EZjBlGuLCc:4506:warning: override: reassigning to symbol NET_VRF
    1    ./.tmp.config.EZjBlGuLCc:4503:warning: override: reassigning to symbol BPF_SYSCALL
    1    ./.tmp.config.BkiLKVagqf:8569:warning: override: reassigning to symbol USER_NS
    1    ./.tmp.config.BkiLKVagqf:8552:warning: override: reassigning to symbol ANDROID
    1    ./.tmp.config.BkiLKVagqf:8551:warning: override: reassigning to symbol STAGING
    1    ./.tmp.config.BkiLKVagqf:8547:warning: override: reassigning to symbol SECURITYFS
    1    ./.tmp.config.BkiLKVagqf:8527:warning: override: reassigning to symbol IPV6_GRE
    1    ./.tmp.config.BkiLKVagqf:8521:warning: override: reassigning to symbol NET_CLS_FLOWER
    1    ./.tmp.config.BkiLKVagqf:8512:warning: override: reassigning to symbol IPV6
    1    ./.tmp.config.BkiLKVagqf:8510:warning: override: reassigning to symbol NET_SCH_INGRESS
    1    ./.tmp.config.BkiLKVagqf:8509:warning: override: reassigning to symbol NET_SCHED
    1    ./.tmp.config.BkiLKVagqf:8508:warning: override: reassigning to symbol NET_CLS_ACT
    1    ./.tmp.config.BkiLKVagqf:8506:warning: override: reassigning to symbol CGROUP_BPF
    1    ./.tmp.config.BkiLKVagqf:8505:warning: override: reassigning to symbol TEST_BPF
    1    ./.tmp.config.BkiLKVagqf:8502:warning: override: reassigning to symbol BPF_SYSCALL
    1    ./.tmp.config.BkiLKVagqf:8495:warning: override: reassigning to symbol ANDROID
    1    ./.tmp.config.BkiLKVagqf:8485:warning: override: reassigning to symbol NOTIFIER_ERROR_INJECTION
    1    ./.tmp.config.BkiLKVagqf:8474:warning: override: reassigning to symbol USER_NS
    1    ./.tmp.config.BkiLKVagqf:8366:warning: override: reassigning to symbol NET_NS
    1    ./.tmp.config.BkiLKVagqf:8362:warning: override: reassigning to symbol USER_NS
    1    ./.tmp.config.BkiLKVagqf:8337:warning: override: reassigning to symbol NET_ACT_GACT
    1    ./.tmp.config.BkiLKVagqf:8316:warning: override: reassigning to symbol NET_SCH_INGRESS
    1    ./.tmp.config.BkiLKVagqf:8258:warning: override: reassigning to symbol VLAN_8021Q
    1    ./.tmp.config.BkiLKVagqf:8257:warning: override: reassigning to symbol BRIDGE
    1    ./.tmp.config.BkiLKVagqf:8253:warning: override: reassigning to symbol VETH
    1    ./.tmp.config.BkiLKVagqf:8252:warning: override: reassigning to symbol IPV6_MULTIPLE_TABLES
    1    ./.tmp.config.BkiLKVagqf:8250:warning: override: reassigning to symbol NET_L3_MASTER_DEV
    1    ./.tmp.config.BkiLKVagqf:8249:warning: override: reassigning to symbol NET_VRF
    1    ./.tmp.config.BkiLKVagqf:8246:warning: override: reassigning to symbol BPF_SYSCALL
    1    ./.tmp.config.6aLYcOxJFN:4889:warning: override: reassigning to symbol USER_NS
    1    ./.tmp.config.6aLYcOxJFN:4872:warning: override: reassigning to symbol ANDROID
    1    ./.tmp.config.6aLYcOxJFN:4871:warning: override: reassigning to symbol STAGING
    1    ./.tmp.config.6aLYcOxJFN:4867:warning: override: reassigning to symbol SECURITYFS
    1    ./.tmp.config.6aLYcOxJFN:4847:warning: override: reassigning to symbol IPV6_GRE
    1    ./.tmp.config.6aLYcOxJFN:4841:warning: override: reassigning to symbol NET_CLS_FLOWER
    1    ./.tmp.config.6aLYcOxJFN:4832:warning: override: reassigning to symbol IPV6
    1    ./.tmp.config.6aLYcOxJFN:4830:warning: override: reassigning to symbol NET_SCH_INGRESS
    1    ./.tmp.config.6aLYcOxJFN:4829:warning: override: reassigning to symbol NET_SCHED
    1    ./.tmp.config.6aLYcOxJFN:4828:warning: override: reassigning to symbol NET_CLS_ACT
    1    ./.tmp.config.6aLYcOxJFN:4826:warning: override: reassigning to symbol CGROUP_BPF
    1    ./.tmp.config.6aLYcOxJFN:4825:warning: override: reassigning to symbol TEST_BPF
    1    ./.tmp.config.6aLYcOxJFN:4822:warning: override: reassigning to symbol BPF_SYSCALL
    1    ./.tmp.config.6aLYcOxJFN:4815:warning: override: reassigning to symbol ANDROID
    1    ./.tmp.config.6aLYcOxJFN:4805:warning: override: reassigning to symbol NOTIFIER_ERROR_INJECTION
    1    ./.tmp.config.6aLYcOxJFN:4794:warning: override: reassigning to symbol USER_NS
    1    ./.tmp.config.6aLYcOxJFN:4686:warning: override: reassigning to symbol NET_NS
    1    ./.tmp.config.6aLYcOxJFN:4682:warning: override: reassigning to symbol USER_NS
    1    ./.tmp.config.6aLYcOxJFN:4657:warning: override: reassigning to symbol NET_ACT_GACT
    1    ./.tmp.config.6aLYcOxJFN:4636:warning: override: reassigning to symbol NET_SCH_INGRESS
    1    ./.tmp.config.6aLYcOxJFN:4578:warning: override: reassigning to symbol VLAN_8021Q
    1    ./.tmp.config.6aLYcOxJFN:4577:warning: override: reassigning to symbol BRIDGE
    1    ./.tmp.config.6aLYcOxJFN:4573:warning: override: reassigning to symbol VETH
    1    ./.tmp.config.6aLYcOxJFN:4572:warning: override: reassigning to symbol IPV6_MULTIPLE_TABLES
    1    ./.tmp.config.6aLYcOxJFN:4570:warning: override: reassigning to symbol NET_L3_MASTER_DEV
    1    ./.tmp.config.6aLYcOxJFN:4569:warning: override: reassigning to symbol NET_VRF
    1    ./.tmp.config.6aLYcOxJFN:4566:warning: override: reassigning to symbol BPF_SYSCALL

Section mismatches summary:

    5    WARNING: vmlinux.o(.text.unlikely+0x8c4): Section mismatch in reference from the function free_memmap() to the function .meminit.text:memblock_free()
    3    WARNING: vmlinux.o(.text.unlikely+0x84c): Section mismatch in reference from the function free_memmap() to the function .meminit.text:memblock_free()
    3    WARNING: vmlinux.o(.text.unlikely+0x840): Section mismatch in reference from the function free_memmap() to the function .meminit.text:memblock_free()
    1    WARNING: vmlinux.o(.text.unlikely+0x8e4): Section mismatch in reference from the function free_memmap() to the function .meminit.text:memblock_free()
    1    WARNING: vmlinux.o(.text.unlikely+0x7c8): Section mismatch in reference from the function free_memmap() to the function .meminit.text:memblock_free()
    1    WARNING: vmlinux.o(.text.unlikely+0x710): Section mismatch in reference from the function free_memmap() to the function .meminit.text:memblock_free()
    1    WARNING: vmlinux.o(.text.unlikely+0x3630): Section mismatch in reference from the function pmax_setup_memory_region() to the function .init.text:add_memory_region()
    1    WARNING: vmlinux.o(.text.unlikely+0x3320): Section mismatch in reference from the function pmax_setup_memory_region() to the function .init.text:add_memory_region()

================================================================================

Detailed per-defconfig build reports:

--------------------------------------------------------------------------------
32r2el_defconfig (mips, gcc-8) — PASS, 0 errors, 0 warnings, 0 section mismatches

--------------------------------------------------------------------------------
32r2el_defconfig+kselftest (mips, gcc-8) — PASS, 0 errors, 28 warnings, 0 section mismatches

Warnings:
    ./.tmp.config.FycgTjdDk7:3656:warning: override: reassigning to symbol BPF_SYSCALL
    ./.tmp.config.FycgTjdDk7:3659:warning: override: reassigning to symbol NET_VRF
    ./.tmp.config.FycgTjdDk7:3660:warning: override: reassigning to symbol NET_L3_MASTER_DEV
    ./.tmp.config.FycgTjdDk7:3662:warning: override: reassigning to symbol IPV6_MULTIPLE_TABLES
    ./.tmp.config.FycgTjdDk7:3663:warning: override: reassigning to symbol VETH
    ./.tmp.config.FycgTjdDk7:3667:warning: override: reassigning to symbol BRIDGE
    ./.tmp.config.FycgTjdDk7:3668:warning: override: reassigning to symbol VLAN_8021Q
    ./.tmp.config.FycgTjdDk7:3726:warning: override: reassigning to symbol NET_SCH_INGRESS
    ./.tmp.config.FycgTjdDk7:3747:warning: override: reassigning to symbol NET_ACT_GACT
    ./.tmp.config.FycgTjdDk7:3772:warning: override: reassigning to symbol USER_NS
    ./.tmp.config.FycgTjdDk7:3776:warning: override: reassigning to symbol NET_NS
    ./.tmp.config.FycgTjdDk7:3884:warning: override: reassigning to symbol USER_NS
    ./.tmp.config.FycgTjdDk7:3895:warning: override: reassigning to symbol NOTIFIER_ERROR_INJECTION
    ./.tmp.config.FycgTjdDk7:3905:warning: override: reassigning to symbol ANDROID
    ./.tmp.config.FycgTjdDk7:3912:warning: override: reassigning to symbol BPF_SYSCALL
    ./.tmp.config.FycgTjdDk7:3915:warning: override: reassigning to symbol TEST_BPF
    ./.tmp.config.FycgTjdDk7:3916:warning: override: reassigning to symbol CGROUP_BPF
    ./.tmp.config.FycgTjdDk7:3918:warning: override: reassigning to symbol NET_CLS_ACT
    ./.tmp.config.FycgTjdDk7:3919:warning: override: reassigning to symbol NET_SCHED
    ./.tmp.config.FycgTjdDk7:3920:warning: override: reassigning to symbol NET_SCH_INGRESS
    ./.tmp.config.FycgTjdDk7:3922:warning: override: reassigning to symbol IPV6
    ./.tmp.config.FycgTjdDk7:3931:warning: override: reassigning to symbol NET_CLS_FLOWER
    ./.tmp.config.FycgTjdDk7:3937:warning: override: reassigning to symbol IPV6_GRE
    ./.tmp.config.FycgTjdDk7:3957:warning: override: reassigning to symbol SECURITYFS
    ./.tmp.config.FycgTjdDk7:3961:warning: override: reassigning to symbol STAGING
    ./.tmp.config.FycgTjdDk7:3962:warning: override: reassigning to symbol ANDROID
    ./.tmp.config.FycgTjdDk7:3979:warning: override: reassigning to symbol USER_NS
    include/linux/kern_levels.h:5:18: warning: format '%lu' expects argument of type 'long unsigned int', but argument 8 has type 'unsigned int' [-Wformat=]

--------------------------------------------------------------------------------
allmodconfig (arm, gcc-8) — PASS, 0 errors, 19 warnings, 0 section mismatches

Warnings:
    /tmp/ccygpJU8.s:18119: Warning: using r15 results in unpredictable behaviour
    /tmp/ccygpJU8.s:18191: Warning: using r15 results in unpredictable behaviour
    include/linux/kern_levels.h:5:18: warning: format '%lu' expects argument of type 'long unsigned int', but argument 8 has type 'unsigned int' [-Wformat=]
    sound/soc/codecs/rt5677-spi.c:114:30: warning: unused variable 'rtd' [-Wunused-variable]
    drivers/net/phy/mdio-cavium.h:114:37: warning: cast to pointer from integer of different size [-Wint-to-pointer-cast]
    drivers/net/phy/mdio-cavium.h:113:48: warning: cast to pointer from integer of different size [-Wint-to-pointer-cast]
    drivers/net/phy/mdio-cavium.h:113:48: warning: cast to pointer from integer of different size [-Wint-to-pointer-cast]
    drivers/net/phy/mdio-cavium.h:113:48: warning: cast to pointer from integer of different size [-Wint-to-pointer-cast]
    drivers/net/phy/mdio-cavium.h:114:37: warning: cast to pointer from integer of different size [-Wint-to-pointer-cast]
    drivers/net/phy/mdio-cavium.h:113:48: warning: cast to pointer from integer of different size [-Wint-to-pointer-cast]
    drivers/net/phy/mdio-cavium.h:114:37: warning: cast to pointer from integer of different size [-Wint-to-pointer-cast]
    drivers/net/phy/mdio-cavium.h:113:48: warning: cast to pointer from integer of different size [-Wint-to-pointer-cast]
    drivers/net/phy/mdio-cavium.h:113:48: warning: cast to pointer from integer of different size [-Wint-to-pointer-cast]
    drivers/net/phy/mdio-cavium.h:114:37: warning: cast to pointer from integer of different size [-Wint-to-pointer-cast]
    drivers/net/phy/mdio-octeon.c:48:3: warning: cast from pointer to integer of different size [-Wpointer-to-int-cast]
    drivers/net/phy/mdio-cavium.h:113:48: warning: cast to pointer from integer of different size [-Wint-to-pointer-cast]
    drivers/net/phy/mdio-cavium.h:113:48: warning: cast to pointer from integer of different size [-Wint-to-pointer-cast]
    drivers/net/phy/mdio-cavium.h:113:48: warning: cast to pointer from integer of different size [-Wint-to-pointer-cast]
    warning: same module names found:

--------------------------------------------------------------------------------
allmodconfig (x86_64, gcc-8) — PASS, 0 errors, 1 warning, 0 section mismatches

Warnings:
    sound/soc/codecs/rt5677-spi.c:114:30: warning: unused variable 'rtd' [-Wunused-variable]

--------------------------------------------------------------------------------
allmodconfig (arm64, gcc-8) — PASS, 0 errors, 1 warning, 0 section mismatches

Warnings:
    sound/soc/codecs/rt5677-spi.c:114:30: warning: unused variable 'rtd' [-Wunused-variable]

--------------------------------------------------------------------------------
allmodconfig (arm64, clang-8) — PASS, 0 errors, 47 warnings, 0 section mismatches

Warnings:
    mm/shmem.c:2737:35: warning: variable 'shmem_falloc_waitq' is uninitialized when used within its own initialization [-Wuninitialized]
    1 warning generated.
    fs/proc/base.c:1894:35: warning: variable 'wq' is uninitialized when used within its own initialization [-Wuninitialized]
    1 warning generated.
    fs/proc/proc_sysctl.c:705:35: warning: variable 'wq' is uninitialized when used within its own initialization [-Wuninitialized]
    1 warning generated.
    fs/namei.c:1644:34: warning: variable 'wq' is uninitialized when used within its own initialization [-Wuninitialized]
    fs/namei.c:3132:34: warning: variable 'wq' is uninitialized when used within its own initialization [-Wuninitialized]
    2 warnings generated.
    drivers/android/binderfs.c:657:41: warning: suggest braces around initialization of subobject [-Wmissing-braces]
    1 warning generated.
    fs/afs/dir_silly.c:205:34: warning: variable 'wq' is uninitialized when used within its own initialization [-Wuninitialized]
    1 warning generated.
    fs/cifs/readdir.c:83:34: warning: variable 'wq' is uninitialized when used within its own initialization [-Wuninitialized]
    1 warning generated.
    drivers/bluetooth/bluecard_cs.c:282:36: warning: variable 'wq' is uninitialized when used within its own initialization [-Wuninitialized]
    1 warning generated.
    fs/fuse/readdir.c:161:34: warning: variable 'wq' is uninitialized when used within its own initialization [-Wuninitialized]
    1 warning generated.
    fs/nfs/dir.c:448:34: warning: variable 'wq' is uninitialized when used within its own initialization [-Wuninitialized]
    fs/nfs/dir.c:1499:34: warning: variable 'wq' is uninitialized when used within its own initialization [-Wuninitialized]
    2 warnings generated.
    drivers/dma/fsl-dpaa2-qdma/dpdmai.c:151:20: warning: variable 'cmd' is uninitialized when used within its own initialization [-Wuninitialized]
    drivers/dma/fsl-dpaa2-qdma/dpdmai.c:151:25: warning: variable 'cfg' is uninitialized when used within its own initialization [-Wuninitialized]
    2 warnings generated.
    sound/soc/codecs/rt5677-spi.c:114:30: warning: unused variable 'rtd' [-Wunused-variable]
    1 warning generated.
    drivers/gpu/drm/amd/amdgpu/../powerplay/renoir_ppt.c:182:26: warning: suggest braces around initialization of subobject [-Wmissing-braces]
    1 warning generated.
    drivers/gpu/host1x/syncpt.c:208:34: warning: variable 'wq' is uninitialized when used within its own initialization [-Wuninitialized]
    1 warning generated.
    net/nfc/hci/command.c:59:34: warning: variable 'ew_wq' is uninitialized when used within its own initialization [-Wuninitialized]
    1 warning generated.
    net/nfc/hci/llc_shdlc.c:687:34: warning: variable 'connect_wq' is uninitialized when used within its own initialization [-Wuninitialized]
    1 warning generated.
    drivers/misc/mic/vop/vop_vringh.c:155:34: warning: variable 'wake' is uninitialized when used within its own initialization [-Wuninitialized]
    drivers/misc/mic/vop/vop_vringh.c:399:34: warning: variable 'wake' is uninitialized when used within its own initialization [-Wuninitialized]
    2 warnings generated.
    drivers/net/usb/lan78xx.c:2662:34: warning: variable 'unlink_wakeup' is uninitialized when used within its own initialization [-Wuninitialized]
    1 warning generated.
    drivers/scsi/bfa/bfad_im.c:301:34: warning: variable 'wq' is uninitialized when used within its own initialization [-Wuninitialized]
    drivers/scsi/bfa/bfad_im.c:378:34: warning: variable 'wq' is uninitialized when used within its own initialization [-Wuninitialized]
    2 warnings generated.
    drivers/scsi/lpfc/lpfc_sli.c:11855:34: warning: variable 'done_q' is uninitialized when used within its own initialization [-Wuninitialized]
    1 warning generated.
    drivers/scsi/lpfc/lpfc_scsi.c:4722:34: warning: variable 'waitq' is uninitialized when used within its own initialization [-Wuninitialized]
    1 warning generated.

--------------------------------------------------------------------------------
allnoconfig (arc, gcc-8) — PASS, 0 errors, 1 warning, 0 section mismatches

Warnings:
    <stdin>:1511:2: warning: #warning syscall clone3 not implemented [-Wcpp]

--------------------------------------------------------------------------------
allnoconfig (arm64, gcc-8) — PASS, 0 errors, 0 warnings, 0 section mismatches

--------------------------------------------------------------------------------
allnoconfig (arm, gcc-8) — PASS, 0 errors, 0 warnings, 0 section mismatches

--------------------------------------------------------------------------------
allnoconfig (riscv, gcc-8) — PASS, 0 errors, 0 warnings, 0 section mismatches

--------------------------------------------------------------------------------
allnoconfig (mips, gcc-8) — PASS, 0 errors, 0 warnings, 0 section mismatches

--------------------------------------------------------------------------------
allnoconfig (arm64, clang-8) — PASS, 0 errors, 0 warnings, 0 section mismatches

--------------------------------------------------------------------------------
allnoconfig (i386, gcc-8) — PASS, 0 errors, 0 warnings, 0 section mismatches

--------------------------------------------------------------------------------
allnoconfig (x86_64, gcc-8) — PASS, 0 errors, 0 warnings, 0 section mismatches

--------------------------------------------------------------------------------
am200epdkit_defconfig (arm, gcc-8) — PASS, 0 errors, 1 warning, 0 section mismatches

Warnings:
    WARNING: "return_address" [vmlinux] is a static EXPORT_SYMBOL_GPL

--------------------------------------------------------------------------------
ar7_defconfig (mips, gcc-8) — PASS, 0 errors, 0 warnings, 0 section mismatches

--------------------------------------------------------------------------------
aspeed_g4_defconfig (arm, gcc-8) — PASS, 0 errors, 0 warnings, 0 section mismatches

--------------------------------------------------------------------------------
aspeed_g5_defconfig (arm, gcc-8) — PASS, 0 errors, 0 warnings, 0 section mismatches

--------------------------------------------------------------------------------
assabet_defconfig (arm, gcc-8) — PASS, 0 errors, 0 warnings, 0 section mismatches

Section mismatches:
    WARNING: vmlinux.o(.text.unlikely+0x8c4): Section mismatch in reference from the function free_memmap() to the function .meminit.text:memblock_free()

--------------------------------------------------------------------------------
at91_dt_defconfig (arm, gcc-8) — PASS, 0 errors, 1 warning, 0 section mismatches

Warnings:
    WARNING: "return_address" [vmlinux] is a static EXPORT_SYMBOL_GPL

--------------------------------------------------------------------------------
ath25_defconfig (mips, gcc-8) — PASS, 0 errors, 0 warnings, 0 section mismatches

--------------------------------------------------------------------------------
ath79_defconfig (mips, gcc-8) — PASS, 0 errors, 0 warnings, 0 section mismatches

--------------------------------------------------------------------------------
axm55xx_defconfig (arm, gcc-8) — PASS, 0 errors, 1 warning, 0 section mismatches

Warnings:
    WARNING: "return_address" [vmlinux] is a static EXPORT_SYMBOL_GPL

--------------------------------------------------------------------------------
axs103_defconfig (arc, gcc-8) — PASS, 0 errors, 2 warnings, 0 section mismatches

Warnings:
    <stdin>:1511:2: warning: #warning syscall clone3 not implemented [-Wcpp]
    <stdin>:1511:2: warning: #warning syscall clone3 not implemented [-Wcpp]

--------------------------------------------------------------------------------
axs103_smp_defconfig (arc, gcc-8) — PASS, 0 errors, 2 warnings, 0 section mismatches

Warnings:
    <stdin>:1511:2: warning: #warning syscall clone3 not implemented [-Wcpp]
    <stdin>:1511:2: warning: #warning syscall clone3 not implemented [-Wcpp]

--------------------------------------------------------------------------------
badge4_defconfig (arm, gcc-8) — PASS, 0 errors, 0 warnings, 0 section mismatches

Section mismatches:
    WARNING: vmlinux.o(.text.unlikely+0x84c): Section mismatch in reference from the function free_memmap() to the function .meminit.text:memblock_free()

--------------------------------------------------------------------------------
bcm2835_defconfig (arm, gcc-8) — PASS, 0 errors, 3 warnings, 0 section mismatches

Warnings:
    kernel/debug/debug_core.c:452:17: warning: array subscript [0, 0] is outside array bounds of 'struct debuggerinfo_struct[1]' [-Warray-bounds]
    kernel/debug/debug_core.c:469:33: warning: array subscript [0, 0] is outside array bounds of 'struct debuggerinfo_struct[1]' [-Warray-bounds]
    kernel/debug/debug_core.c:470:18: warning: array subscript [0, 0] is outside array bounds of 'struct debuggerinfo_struct[1]' [-Warray-bounds]

--------------------------------------------------------------------------------
bcm47xx_defconfig (mips, gcc-8) — PASS, 0 errors, 0 warnings, 0 section mismatches

--------------------------------------------------------------------------------
bcm63xx_defconfig (mips, gcc-8) — PASS, 0 errors, 0 warnings, 0 section mismatches

--------------------------------------------------------------------------------
bigsur_defconfig (mips, gcc-8) — PASS, 0 errors, 0 warnings, 0 section mismatches

--------------------------------------------------------------------------------
bmips_be_defconfig (mips, gcc-8) — PASS, 0 errors, 0 warnings, 0 section mismatches

--------------------------------------------------------------------------------
bmips_stb_defconfig (mips, gcc-8) — PASS, 0 errors, 0 warnings, 0 section mismatches

--------------------------------------------------------------------------------
capcella_defconfig (mips, gcc-8) — PASS, 0 errors, 0 warnings, 0 section mismatches

--------------------------------------------------------------------------------
cavium_octeon_defconfig (mips, gcc-8) — FAIL, 4 errors, 3 warnings, 0 section mismatches

Errors:
    drivers/staging/octeon/ethernet.c:177:21: error: dereferencing pointer to incomplete type 'struct cvmx_wqe'
    drivers/staging/octeon/ethernet.c:463:30: error: storage size of 'link_info' isn't known
    drivers/staging/octeon/ethernet.c:499:30: error: storage size of 'link_info' isn't known
    drivers/staging/octeon/ethernet.c:516:29: error: type of formal parameter 2 is incomplete

Warnings:
    drivers/staging/octeon/octeon-ethernet.h:94:12: warning: 'union cvmx_helper_link_info' declared inside parameter list will not be visible outside of this definition or declaration
    drivers/staging/octeon/ethernet.c:463:30: warning: unused variable 'link_info' [-Wunused-variable]
    drivers/staging/octeon/ethernet.c:499:30: warning: unused variable 'link_info' [-Wunused-variable]

--------------------------------------------------------------------------------
cerfcube_defconfig (arm, gcc-8) — PASS, 0 errors, 0 warnings, 0 section mismatches

Section mismatches:
    WARNING: vmlinux.o(.text.unlikely+0x84c): Section mismatch in reference from the function free_memmap() to the function .meminit.text:memblock_free()

--------------------------------------------------------------------------------
ci20_defconfig (mips, gcc-8) — PASS, 0 errors, 0 warnings, 0 section mismatches

--------------------------------------------------------------------------------
clps711x_defconfig (arm, gcc-8) — PASS, 0 errors, 0 warnings, 0 section mismatches

--------------------------------------------------------------------------------
cm_x2xx_defconfig (arm, gcc-8) — PASS, 0 errors, 1 warning, 0 section mismatches

Warnings:
    WARNING: "return_address" [vmlinux] is a static EXPORT_SYMBOL_GPL

--------------------------------------------------------------------------------
cm_x300_defconfig (arm, gcc-8) — PASS, 0 errors, 1 warning, 0 section mismatches

Warnings:
    WARNING: "return_address" [vmlinux] is a static EXPORT_SYMBOL_GPL

--------------------------------------------------------------------------------
cns3420vb_defconfig (arm, gcc-8) — PASS, 0 errors, 1 warning, 0 section mismatches

Warnings:
    WARNING: "return_address" [vmlinux] is a static EXPORT_SYMBOL_GPL

--------------------------------------------------------------------------------
cobalt_defconfig (mips, gcc-8) — PASS, 0 errors, 0 warnings, 0 section mismatches

--------------------------------------------------------------------------------
colibri_pxa270_defconfig (arm, gcc-8) — PASS, 0 errors, 1 warning, 0 section mismatches

Warnings:
    WARNING: "return_address" [vmlinux] is a static EXPORT_SYMBOL_GPL

--------------------------------------------------------------------------------
colibri_pxa300_defconfig (arm, gcc-8) — PASS, 0 errors, 1 warning, 0 section mismatches

Warnings:
    WARNING: "return_address" [vmlinux] is a static EXPORT_SYMBOL_GPL

--------------------------------------------------------------------------------
collie_defconfig (arm, gcc-8) — PASS, 0 errors, 0 warnings, 0 section mismatches

Section mismatches:
    WARNING: vmlinux.o(.text.unlikely+0x840): Section mismatch in reference from the function free_memmap() to the function .meminit.text:memblock_free()

--------------------------------------------------------------------------------
corgi_defconfig (arm, gcc-8) — PASS, 0 errors, 0 warnings, 0 section mismatches

--------------------------------------------------------------------------------
davinci_all_defconfig (arm, gcc-8) — PASS, 0 errors, 1 warning, 0 section mismatches

Warnings:
    WARNING: "return_address" [vmlinux] is a static EXPORT_SYMBOL_GPL

--------------------------------------------------------------------------------
db1xxx_defconfig (mips, gcc-8) — PASS, 0 errors, 1 warning, 0 section mismatches

Warnings:
    sound/soc/soc-pcm.c:1185:8: warning: unused variable 'name' [-Wunused-variable]

--------------------------------------------------------------------------------
decstation_64_defconfig (mips, gcc-8) — PASS, 0 errors, 0 warnings, 0 section mismatches

--------------------------------------------------------------------------------
decstation_defconfig (mips, gcc-8) — PASS, 0 errors, 0 warnings, 0 section mismatches

Section mismatches:
    WARNING: vmlinux.o(.text.unlikely+0x3630): Section mismatch in reference from the function pmax_setup_memory_region() to the function .init.text:add_memory_region()

--------------------------------------------------------------------------------
decstation_r4k_defconfig (mips, gcc-8) — PASS, 0 errors, 0 warnings, 0 section mismatches

Section mismatches:
    WARNING: vmlinux.o(.text.unlikely+0x3320): Section mismatch in reference from the function pmax_setup_memory_region() to the function .init.text:add_memory_region()

--------------------------------------------------------------------------------
defconfig (riscv, gcc-8) — PASS, 0 errors, 2 warnings, 0 section mismatches

Warnings:
    drivers/net/ethernet/intel/e1000e/netdev.c:6405:13: warning: 'e1000e_s0ix_exit_flow' defined but not used [-Wunused-function]
    drivers/net/ethernet/intel/e1000e/netdev.c:6298:13: warning: 'e1000e_s0ix_entry_flow' defined but not used [-Wunused-function]

--------------------------------------------------------------------------------
defconfig (arm64, clang-8) — PASS, 0 errors, 0 warnings, 0 section mismatches

--------------------------------------------------------------------------------
defconfig (arm64, gcc-8) — PASS, 0 errors, 0 warnings, 0 section mismatches

--------------------------------------------------------------------------------
defconfig+CONFIG_CPU_BIG_ENDIAN=y (arm64, gcc-8) — PASS, 0 errors, 0 warnings, 0 section mismatches

--------------------------------------------------------------------------------
defconfig+CONFIG_RANDOMIZE_BASE=y (arm64, gcc-8) — PASS, 0 errors, 0 warnings, 0 section mismatches

--------------------------------------------------------------------------------
defconfig+kselftest (riscv, gcc-8) — PASS, 0 errors, 29 warnings, 0 section mismatches

Warnings:
    ./.tmp.config.rrjgYa4qnP:3042:warning: override: reassigning to symbol BPF_SYSCALL
    ./.tmp.config.rrjgYa4qnP:3045:warning: override: reassigning to symbol NET_VRF
    ./.tmp.config.rrjgYa4qnP:3046:warning: override: reassigning to symbol NET_L3_MASTER_DEV
    ./.tmp.config.rrjgYa4qnP:3048:warning: override: reassigning to symbol IPV6_MULTIPLE_TABLES
    ./.tmp.config.rrjgYa4qnP:3049:warning: override: reassigning to symbol VETH
    ./.tmp.config.rrjgYa4qnP:3053:warning: override: reassigning to symbol BRIDGE
    ./.tmp.config.rrjgYa4qnP:3054:warning: override: reassigning to symbol VLAN_8021Q
    ./.tmp.config.rrjgYa4qnP:3112:warning: override: reassigning to symbol NET_SCH_INGRESS
    ./.tmp.config.rrjgYa4qnP:3133:warning: override: reassigning to symbol NET_ACT_GACT
    ./.tmp.config.rrjgYa4qnP:3158:warning: override: reassigning to symbol USER_NS
    ./.tmp.config.rrjgYa4qnP:3162:warning: override: reassigning to symbol NET_NS
    ./.tmp.config.rrjgYa4qnP:3270:warning: override: reassigning to symbol USER_NS
    ./.tmp.config.rrjgYa4qnP:3281:warning: override: reassigning to symbol NOTIFIER_ERROR_INJECTION
    ./.tmp.config.rrjgYa4qnP:3291:warning: override: reassigning to symbol ANDROID
    ./.tmp.config.rrjgYa4qnP:3298:warning: override: reassigning to symbol BPF_SYSCALL
    ./.tmp.config.rrjgYa4qnP:3301:warning: override: reassigning to symbol TEST_BPF
    ./.tmp.config.rrjgYa4qnP:3302:warning: override: reassigning to symbol CGROUP_BPF
    ./.tmp.config.rrjgYa4qnP:3304:warning: override: reassigning to symbol NET_CLS_ACT
    ./.tmp.config.rrjgYa4qnP:3305:warning: override: reassigning to symbol NET_SCHED
    ./.tmp.config.rrjgYa4qnP:3306:warning: override: reassigning to symbol NET_SCH_INGRESS
    ./.tmp.config.rrjgYa4qnP:3308:warning: override: reassigning to symbol IPV6
    ./.tmp.config.rrjgYa4qnP:3317:warning: override: reassigning to symbol NET_CLS_FLOWER
    ./.tmp.config.rrjgYa4qnP:3323:warning: override: reassigning to symbol IPV6_GRE
    ./.tmp.config.rrjgYa4qnP:3343:warning: override: reassigning to symbol SECURITYFS
    ./.tmp.config.rrjgYa4qnP:3347:warning: override: reassigning to symbol STAGING
    ./.tmp.config.rrjgYa4qnP:3348:warning: override: reassigning to symbol ANDROID
    ./.tmp.config.rrjgYa4qnP:3365:warning: override: reassigning to symbol USER_NS
    drivers/net/ethernet/intel/e1000e/netdev.c:6405:13: warning: 'e1000e_s0ix_exit_flow' defined but not used [-Wunused-function]
    drivers/net/ethernet/intel/e1000e/netdev.c:6298:13: warning: 'e1000e_s0ix_entry_flow' defined but not used [-Wunused-function]

--------------------------------------------------------------------------------
defconfig+kselftest (arm64, gcc-8) — PASS, 0 errors, 27 warnings, 0 section mismatches

Warnings:
    ./.tmp.config.PODRA17WFs:7645:warning: override: reassigning to symbol BPF_SYSCALL
    ./.tmp.config.PODRA17WFs:7648:warning: override: reassigning to symbol NET_VRF
    ./.tmp.config.PODRA17WFs:7649:warning: override: reassigning to symbol NET_L3_MASTER_DEV
    ./.tmp.config.PODRA17WFs:7651:warning: override: reassigning to symbol IPV6_MULTIPLE_TABLES
    ./.tmp.config.PODRA17WFs:7652:warning: override: reassigning to symbol VETH
    ./.tmp.config.PODRA17WFs:7656:warning: override: reassigning to symbol BRIDGE
    ./.tmp.config.PODRA17WFs:7657:warning: override: reassigning to symbol VLAN_8021Q
    ./.tmp.config.PODRA17WFs:7715:warning: override: reassigning to symbol NET_SCH_INGRESS
    ./.tmp.config.PODRA17WFs:7736:warning: override: reassigning to symbol NET_ACT_GACT
    ./.tmp.config.PODRA17WFs:7761:warning: override: reassigning to symbol USER_NS
    ./.tmp.config.PODRA17WFs:7765:warning: override: reassigning to symbol NET_NS
    ./.tmp.config.PODRA17WFs:7873:warning: override: reassigning to symbol USER_NS
    ./.tmp.config.PODRA17WFs:7884:warning: override: reassigning to symbol NOTIFIER_ERROR_INJECTION
    ./.tmp.config.PODRA17WFs:7894:warning: override: reassigning to symbol ANDROID
    ./.tmp.config.PODRA17WFs:7901:warning: override: reassigning to symbol BPF_SYSCALL
    ./.tmp.config.PODRA17WFs:7904:warning: override: reassigning to symbol TEST_BPF
    ./.tmp.config.PODRA17WFs:7905:warning: override: reassigning to symbol CGROUP_BPF
    ./.tmp.config.PODRA17WFs:7907:warning: override: reassigning to symbol NET_CLS_ACT
    ./.tmp.config.PODRA17WFs:7908:warning: override: reassigning to symbol NET_SCHED
    ./.tmp.config.PODRA17WFs:7909:warning: override: reassigning to symbol NET_SCH_INGRESS
    ./.tmp.config.PODRA17WFs:7911:warning: override: reassigning to symbol IPV6
    ./.tmp.config.PODRA17WFs:7920:warning: override: reassigning to symbol NET_CLS_FLOWER
    ./.tmp.config.PODRA17WFs:7926:warning: override: reassigning to symbol IPV6_GRE
    ./.tmp.config.PODRA17WFs:7946:warning: override: reassigning to symbol SECURITYFS
    ./.tmp.config.PODRA17WFs:7950:warning: override: reassigning to symbol STAGING
    ./.tmp.config.PODRA17WFs:7951:warning: override: reassigning to symbol ANDROID
    ./.tmp.config.PODRA17WFs:7968:warning: override: reassigning to symbol USER_NS

--------------------------------------------------------------------------------
dove_defconfig (arm, gcc-8) — PASS, 0 errors, 1 warning, 0 section mismatches

Warnings:
    WARNING: "return_address" [vmlinux] is a static EXPORT_SYMBOL_GPL

--------------------------------------------------------------------------------
e55_defconfig (mips, gcc-8) — PASS, 0 errors, 0 warnings, 0 section mismatches

--------------------------------------------------------------------------------
ebsa110_defconfig (arm, gcc-8) — PASS, 0 errors, 0 warnings, 0 section mismatches

--------------------------------------------------------------------------------
efm32_defconfig (arm, gcc-8) — PASS, 0 errors, 0 warnings, 0 section mismatches

--------------------------------------------------------------------------------
em_x270_defconfig (arm, gcc-8) — PASS, 0 errors, 1 warning, 0 section mismatches

Warnings:
    WARNING: "return_address" [vmlinux] is a static EXPORT_SYMBOL_GPL

--------------------------------------------------------------------------------
ep93xx_defconfig (arm, gcc-8) — PASS, 0 errors, 1 warning, 0 section mismatches

Warnings:
    WARNING: "return_address" [vmlinux] is a static EXPORT_SYMBOL_GPL

Section mismatches:
    WARNING: vmlinux.o(.text.unlikely+0x710): Section mismatch in reference from the function free_memmap() to the function .meminit.text:memblock_free()

--------------------------------------------------------------------------------
eseries_pxa_defconfig (arm, gcc-8) — PASS, 0 errors, 2 warnings, 0 section mismatches

Warnings:
    WARNING: "return_address" [vmlinux] is a static EXPORT_SYMBOL_GPL
    sound/soc/soc-pcm.c:1185:8: warning: unused variable 'name' [-Wunused-variable]

--------------------------------------------------------------------------------
exynos_defconfig (arm, gcc-8) — PASS, 0 errors, 1 warning, 0 section mismatches

Warnings:
    WARNING: "return_address" [vmlinux] is a static EXPORT_SYMBOL_GPL

--------------------------------------------------------------------------------
ezx_defconfig (arm, gcc-8) — PASS, 0 errors, 1 warning, 0 section mismatches

Warnings:
    WARNING: "return_address" [vmlinux] is a static EXPORT_SYMBOL_GPL

--------------------------------------------------------------------------------
footbridge_defconfig (arm, gcc-8) — PASS, 0 errors, 0 warnings, 0 section mismatches

--------------------------------------------------------------------------------
fuloong2e_defconfig (mips, gcc-8) — PASS, 0 errors, 0 warnings, 0 section mismatches

--------------------------------------------------------------------------------
gcw0_defconfig (mips, gcc-8) — PASS, 0 errors, 0 warnings, 0 section mismatches

--------------------------------------------------------------------------------
gemini_defconfig (arm, gcc-8) — PASS, 0 errors, 0 warnings, 0 section mismatches

--------------------------------------------------------------------------------
gpr_defconfig (mips, gcc-8) — PASS, 0 errors, 0 warnings, 0 section mismatches

--------------------------------------------------------------------------------
h3600_defconfig (arm, gcc-8) — PASS, 0 errors, 0 warnings, 0 section mismatches

Section mismatches:
    WARNING: vmlinux.o(.text.unlikely+0x840): Section mismatch in reference from the function free_memmap() to the function .meminit.text:memblock_free()

--------------------------------------------------------------------------------
h5000_defconfig (arm, gcc-8) — PASS, 0 errors, 1 warning, 0 section mismatches

Warnings:
    WARNING: "return_address" [vmlinux] is a static EXPORT_SYMBOL_GPL

--------------------------------------------------------------------------------
hackkit_defconfig (arm, gcc-8) — PASS, 0 errors, 0 warnings, 0 section mismatches

Section mismatches:
    WARNING: vmlinux.o(.text.unlikely+0x8c4): Section mismatch in reference from the function free_memmap() to the function .meminit.text:memblock_free()

--------------------------------------------------------------------------------
haps_hs_defconfig (arc, gcc-8) — PASS, 0 errors, 2 warnings, 0 section mismatches

Warnings:
    <stdin>:1511:2: warning: #warning syscall clone3 not implemented [-Wcpp]
    <stdin>:1511:2: warning: #warning syscall clone3 not implemented [-Wcpp]

--------------------------------------------------------------------------------
haps_hs_smp_defconfig (arc, gcc-8) — PASS, 0 errors, 2 warnings, 0 section mismatches

Warnings:
    <stdin>:1511:2: warning: #warning syscall clone3 not implemented [-Wcpp]
    <stdin>:1511:2: warning: #warning syscall clone3 not implemented [-Wcpp]

--------------------------------------------------------------------------------
hisi_defconfig (arm, gcc-8) — PASS, 0 errors, 0 warnings, 0 section mismatches

--------------------------------------------------------------------------------
hsdk_defconfig (arc, gcc-8) — PASS, 0 errors, 2 warnings, 0 section mismatches

Warnings:
    <stdin>:1511:2: warning: #warning syscall clone3 not implemented [-Wcpp]
    <stdin>:1511:2: warning: #warning syscall clone3 not implemented [-Wcpp]

--------------------------------------------------------------------------------
i386_defconfig (i386, gcc-8) — PASS, 0 errors, 0 warnings, 0 section mismatches

--------------------------------------------------------------------------------
i386_defconfig+kselftest (i386, gcc-8) — PASS, 0 errors, 28 warnings, 0 section mismatches

Warnings:
    ./.tmp.config.EZjBlGuLCc:4503:warning: override: reassigning to symbol BPF_SYSCALL
    ./.tmp.config.EZjBlGuLCc:4506:warning: override: reassigning to symbol NET_VRF
    ./.tmp.config.EZjBlGuLCc:4507:warning: override: reassigning to symbol NET_L3_MASTER_DEV
    ./.tmp.config.EZjBlGuLCc:4509:warning: override: reassigning to symbol IPV6_MULTIPLE_TABLES
    ./.tmp.config.EZjBlGuLCc:4510:warning: override: reassigning to symbol VETH
    ./.tmp.config.EZjBlGuLCc:4514:warning: override: reassigning to symbol BRIDGE
    ./.tmp.config.EZjBlGuLCc:4515:warning: override: reassigning to symbol VLAN_8021Q
    ./.tmp.config.EZjBlGuLCc:4573:warning: override: reassigning to symbol NET_SCH_INGRESS
    ./.tmp.config.EZjBlGuLCc:4594:warning: override: reassigning to symbol NET_ACT_GACT
    ./.tmp.config.EZjBlGuLCc:4619:warning: override: reassigning to symbol USER_NS
    ./.tmp.config.EZjBlGuLCc:4623:warning: override: reassigning to symbol NET_NS
    ./.tmp.config.EZjBlGuLCc:4731:warning: override: reassigning to symbol USER_NS
    ./.tmp.config.EZjBlGuLCc:4742:warning: override: reassigning to symbol NOTIFIER_ERROR_INJECTION
    ./.tmp.config.EZjBlGuLCc:4752:warning: override: reassigning to symbol ANDROID
    ./.tmp.config.EZjBlGuLCc:4759:warning: override: reassigning to symbol BPF_SYSCALL
    ./.tmp.config.EZjBlGuLCc:4762:warning: override: reassigning to symbol TEST_BPF
    ./.tmp.config.EZjBlGuLCc:4763:warning: override: reassigning to symbol CGROUP_BPF
    ./.tmp.config.EZjBlGuLCc:4765:warning: override: reassigning to symbol NET_CLS_ACT
    ./.tmp.config.EZjBlGuLCc:4766:warning: override: reassigning to symbol NET_SCHED
    ./.tmp.config.EZjBlGuLCc:4767:warning: override: reassigning to symbol NET_SCH_INGRESS
    ./.tmp.config.EZjBlGuLCc:4769:warning: override: reassigning to symbol IPV6
    ./.tmp.config.EZjBlGuLCc:4778:warning: override: reassigning to symbol NET_CLS_FLOWER
    ./.tmp.config.EZjBlGuLCc:4784:warning: override: reassigning to symbol IPV6_GRE
    ./.tmp.config.EZjBlGuLCc:4804:warning: override: reassigning to symbol SECURITYFS
    ./.tmp.config.EZjBlGuLCc:4808:warning: override: reassigning to symbol STAGING
    ./.tmp.config.EZjBlGuLCc:4809:warning: override: reassigning to symbol ANDROID
    ./.tmp.config.EZjBlGuLCc:4826:warning: override: reassigning to symbol USER_NS
    include/linux/kern_levels.h:5:18: warning: format '%lu' expects argument of type 'long unsigned int', but argument 8 has type 'unsigned int' [-Wformat=]

--------------------------------------------------------------------------------
imote2_defconfig (arm, gcc-8) — PASS, 0 errors, 1 warning, 0 section mismatches

Warnings:
    WARNING: "return_address" [vmlinux] is a static EXPORT_SYMBOL_GPL

--------------------------------------------------------------------------------
imx_v4_v5_defconfig (arm, gcc-8) — PASS, 0 errors, 1 warning, 0 section mismatches

Warnings:
    WARNING: "return_address" [vmlinux] is a static EXPORT_SYMBOL_GPL

--------------------------------------------------------------------------------
imx_v6_v7_defconfig (arm, gcc-8) — PASS, 0 errors, 1 warning, 0 section mismatches

Warnings:
    WARNING: "return_address" [vmlinux] is a static EXPORT_SYMBOL_GPL

--------------------------------------------------------------------------------
integrator_defconfig (arm, gcc-8) — PASS, 0 errors, 1 warning, 0 section mismatches

Warnings:
    WARNING: "return_address" [vmlinux] is a static EXPORT_SYMBOL_GPL

--------------------------------------------------------------------------------
iop32x_defconfig (arm, gcc-8) — PASS, 0 errors, 0 warnings, 0 section mismatches

--------------------------------------------------------------------------------
ip22_defconfig (mips, gcc-8) — PASS, 0 errors, 0 warnings, 0 section mismatches

--------------------------------------------------------------------------------
ip27_defconfig (mips, gcc-8) — PASS, 0 errors, 2 warnings, 0 section mismatches

Warnings:
    drivers/net/ethernet/intel/e1000e/netdev.c:6405:13: warning: 'e1000e_s0ix_exit_flow' defined but not used [-Wunused-function]
    drivers/net/ethernet/intel/e1000e/netdev.c:6298:13: warning: 'e1000e_s0ix_entry_flow' defined but not used [-Wunused-function]

--------------------------------------------------------------------------------
ip28_defconfig (mips, gcc-8) — PASS, 0 errors, 0 warnings, 0 section mismatches

--------------------------------------------------------------------------------
ip32_defconfig (mips, gcc-8) — PASS, 0 errors, 0 warnings, 0 section mismatches

--------------------------------------------------------------------------------
ixp4xx_defconfig (arm, gcc-8) — PASS, 0 errors, 1 warning, 0 section mismatches

Warnings:
    WARNING: "return_address" [vmlinux] is a static EXPORT_SYMBOL_GPL

--------------------------------------------------------------------------------
jazz_defconfig (mips, gcc-8) — PASS, 0 errors, 0 warnings, 0 section mismatches

--------------------------------------------------------------------------------
jmr3927_defconfig (mips, gcc-8) — PASS, 0 errors, 0 warnings, 0 section mismatches

--------------------------------------------------------------------------------
jornada720_defconfig (arm, gcc-8) — PASS, 0 errors, 0 warnings, 0 section mismatches

Section mismatches:
    WARNING: vmlinux.o(.text.unlikely+0x7c8): Section mismatch in reference from the function free_memmap() to the function .meminit.text:memblock_free()

--------------------------------------------------------------------------------
keystone_defconfig (arm, gcc-8) — PASS, 0 errors, 1 warning, 0 section mismatches

Warnings:
    WARNING: "return_address" [vmlinux] is a static EXPORT_SYMBOL_GPL

--------------------------------------------------------------------------------
lart_defconfig (arm, gcc-8) — PASS, 0 errors, 0 warnings, 0 section mismatches

Section mismatches:
    WARNING: vmlinux.o(.text.unlikely+0x8c4): Section mismatch in reference from the function free_memmap() to the function .meminit.text:memblock_free()

--------------------------------------------------------------------------------
lasat_defconfig (mips, gcc-8) — PASS, 0 errors, 0 warnings, 0 section mismatches

--------------------------------------------------------------------------------
lemote2f_defconfig (mips, gcc-8) — PASS, 0 errors, 0 warnings, 0 section mismatches

--------------------------------------------------------------------------------
loongson1b_defconfig (mips, gcc-8) — PASS, 0 errors, 0 warnings, 0 section mismatches

--------------------------------------------------------------------------------
loongson1c_defconfig (mips, gcc-8) — PASS, 0 errors, 0 warnings, 0 section mismatches

--------------------------------------------------------------------------------
loongson3_defconfig (mips, gcc-8) — PASS, 0 errors, 0 warnings, 0 section mismatches

--------------------------------------------------------------------------------
lpc18xx_defconfig (arm, gcc-8) — PASS, 0 errors, 0 warnings, 0 section mismatches

--------------------------------------------------------------------------------
lpc32xx_defconfig (arm, gcc-8) — PASS, 0 errors, 1 warning, 0 section mismatches

Warnings:
    WARNING: "return_address" [vmlinux] is a static EXPORT_SYMBOL_GPL

--------------------------------------------------------------------------------
lpd270_defconfig (arm, gcc-8) — PASS, 0 errors, 0 warnings, 0 section mismatches

--------------------------------------------------------------------------------
lubbock_defconfig (arm, gcc-8) — PASS, 0 errors, 0 warnings, 0 section mismatches

--------------------------------------------------------------------------------
magician_defconfig (arm, gcc-8) — PASS, 0 errors, 2 warnings, 0 section mismatches

Warnings:
    WARNING: "return_address" [vmlinux] is a static EXPORT_SYMBOL_GPL
    sound/soc/soc-pcm.c:1185:8: warning: unused variable 'name' [-Wunused-variable]

--------------------------------------------------------------------------------
mainstone_defconfig (arm, gcc-8) — PASS, 0 errors, 0 warnings, 0 section mismatches

--------------------------------------------------------------------------------
malta_defconfig (mips, gcc-8) — PASS, 0 errors, 0 warnings, 0 section mismatches

--------------------------------------------------------------------------------
malta_kvm_defconfig (mips, gcc-8) — PASS, 0 errors, 0 warnings, 0 section mismatches

--------------------------------------------------------------------------------
malta_kvm_guest_defconfig (mips, gcc-8) — PASS, 0 errors, 0 warnings, 0 section mismatches

--------------------------------------------------------------------------------
malta_qemu_32r6_defconfig (mips, gcc-8) — PASS, 0 errors, 1 warning, 0 section mismatches

Warnings:
    {standard input}:134: Warning: macro instruction expanded into multiple instructions

--------------------------------------------------------------------------------
maltaaprp_defconfig (mips, gcc-8) — PASS, 0 errors, 0 warnings, 0 section mismatches

--------------------------------------------------------------------------------
maltasmvp_defconfig (mips, gcc-8) — PASS, 0 errors, 0 warnings, 0 section mismatches

--------------------------------------------------------------------------------
maltasmvp_eva_defconfig (mips, gcc-8) — PASS, 0 errors, 0 warnings, 0 section mismatches

--------------------------------------------------------------------------------
maltaup_defconfig (mips, gcc-8) — PASS, 0 errors, 0 warnings, 0 section mismatches

--------------------------------------------------------------------------------
maltaup_xpa_defconfig (mips, gcc-8) — PASS, 0 errors, 0 warnings, 0 section mismatches

--------------------------------------------------------------------------------
markeins_defconfig (mips, gcc-8) — PASS, 0 errors, 0 warnings, 0 section mismatches

--------------------------------------------------------------------------------
milbeaut_m10v_defconfig (arm, gcc-8) — PASS, 0 errors, 1 warning, 0 section mismatches

Warnings:
    WARNING: "return_address" [vmlinux] is a static EXPORT_SYMBOL_GPL

--------------------------------------------------------------------------------
mini2440_defconfig (arm, gcc-8) — PASS, 0 errors, 1 warning, 0 section mismatches

Warnings:
    WARNING: "return_address" [vmlinux] is a static EXPORT_SYMBOL_GPL

--------------------------------------------------------------------------------
mips_paravirt_defconfig (mips, gcc-8) — PASS, 0 errors, 0 warnings, 0 section mismatches

--------------------------------------------------------------------------------
mmp2_defconfig (arm, gcc-8) — PASS, 0 errors, 1 warning, 0 section mismatches

Warnings:
    WARNING: "return_address" [vmlinux] is a static EXPORT_SYMBOL_GPL

--------------------------------------------------------------------------------
moxart_defconfig (arm, gcc-8) — PASS, 0 errors, 0 warnings, 0 section mismatches

--------------------------------------------------------------------------------
mpc30x_defconfig (mips, gcc-8) — PASS, 0 errors, 0 warnings, 0 section mismatches

--------------------------------------------------------------------------------
mps2_defconfig (arm, gcc-8) — PASS, 0 errors, 0 warnings, 0 section mismatches

--------------------------------------------------------------------------------
msp71xx_defconfig (mips, gcc-8) — PASS, 0 errors, 0 warnings, 0 section mismatches

--------------------------------------------------------------------------------
mtx1_defconfig (mips, gcc-8) — PASS, 0 errors, 0 warnings, 0 section mismatches

--------------------------------------------------------------------------------
multi_v4t_defconfig (arm, gcc-8) — PASS, 0 errors, 0 warnings, 0 section mismatches

--------------------------------------------------------------------------------
multi_v5_defconfig (arm, gcc-8) — PASS, 0 errors, 1 warning, 0 section mismatches

Warnings:
    WARNING: "return_address" [vmlinux] is a static EXPORT_SYMBOL_GPL

--------------------------------------------------------------------------------
multi_v7_defconfig (arm, gcc-8) — PASS, 0 errors, 1 warning, 0 section mismatches

Warnings:
    WARNING: "return_address" [vmlinux] is a static EXPORT_SYMBOL_GPL

--------------------------------------------------------------------------------
multi_v7_defconfig+CONFIG_CPU_BIG_ENDIAN=y (arm, gcc-8) — PASS, 0 errors, 1 warning, 0 section mismatches

Warnings:
    WARNING: "return_address" [vmlinux] is a static EXPORT_SYMBOL_GPL

--------------------------------------------------------------------------------
multi_v7_defconfig+CONFIG_EFI=y+CONFIG_ARM_LPAE=y (arm, gcc-8) — PASS, 0 errors, 1 warning, 0 section mismatches

Warnings:
    WARNING: "return_address" [vmlinux] is a static EXPORT_SYMBOL_GPL

--------------------------------------------------------------------------------
multi_v7_defconfig+CONFIG_SMP=n (arm, gcc-8) — PASS, 0 errors, 1 warning, 0 section mismatches

Warnings:
    WARNING: "return_address" [vmlinux] is a static EXPORT_SYMBOL_GPL

--------------------------------------------------------------------------------
multi_v7_defconfig+kselftest (arm, gcc-8) — PASS, 0 errors, 28 warnings, 0 section mismatches

Warnings:
    ./.tmp.config.BkiLKVagqf:8246:warning: override: reassigning to symbol BPF_SYSCALL
    ./.tmp.config.BkiLKVagqf:8249:warning: override: reassigning to symbol NET_VRF
    ./.tmp.config.BkiLKVagqf:8250:warning: override: reassigning to symbol NET_L3_MASTER_DEV
    ./.tmp.config.BkiLKVagqf:8252:warning: override: reassigning to symbol IPV6_MULTIPLE_TABLES
    ./.tmp.config.BkiLKVagqf:8253:warning: override: reassigning to symbol VETH
    ./.tmp.config.BkiLKVagqf:8257:warning: override: reassigning to symbol BRIDGE
    ./.tmp.config.BkiLKVagqf:8258:warning: override: reassigning to symbol VLAN_8021Q
    ./.tmp.config.BkiLKVagqf:8316:warning: override: reassigning to symbol NET_SCH_INGRESS
    ./.tmp.config.BkiLKVagqf:8337:warning: override: reassigning to symbol NET_ACT_GACT
    ./.tmp.config.BkiLKVagqf:8362:warning: override: reassigning to symbol USER_NS
    ./.tmp.config.BkiLKVagqf:8366:warning: override: reassigning to symbol NET_NS
    ./.tmp.config.BkiLKVagqf:8474:warning: override: reassigning to symbol USER_NS
    ./.tmp.config.BkiLKVagqf:8485:warning: override: reassigning to symbol NOTIFIER_ERROR_INJECTION
    ./.tmp.config.BkiLKVagqf:8495:warning: override: reassigning to symbol ANDROID
    ./.tmp.config.BkiLKVagqf:8502:warning: override: reassigning to symbol BPF_SYSCALL
    ./.tmp.config.BkiLKVagqf:8505:warning: override: reassigning to symbol TEST_BPF
    ./.tmp.config.BkiLKVagqf:8506:warning: override: reassigning to symbol CGROUP_BPF
    ./.tmp.config.BkiLKVagqf:8508:warning: override: reassigning to symbol NET_CLS_ACT
    ./.tmp.config.BkiLKVagqf:8509:warning: override: reassigning to symbol NET_SCHED
    ./.tmp.config.BkiLKVagqf:8510:warning: override: reassigning to symbol NET_SCH_INGRESS
    ./.tmp.config.BkiLKVagqf:8512:warning: override: reassigning to symbol IPV6
    ./.tmp.config.BkiLKVagqf:8521:warning: override: reassigning to symbol NET_CLS_FLOWER
    ./.tmp.config.BkiLKVagqf:8527:warning: override: reassigning to symbol IPV6_GRE
    ./.tmp.config.BkiLKVagqf:8547:warning: override: reassigning to symbol SECURITYFS
    ./.tmp.config.BkiLKVagqf:8551:warning: override: reassigning to symbol STAGING
    ./.tmp.config.BkiLKVagqf:8552:warning: override: reassigning to symbol ANDROID
    ./.tmp.config.BkiLKVagqf:8569:warning: override: reassigning to symbol USER_NS
    include/linux/kern_levels.h:5:18: warning: format '%lu' expects argument of type 'long unsigned int', but argument 8 has type 'unsigned int' [-Wformat=]

--------------------------------------------------------------------------------
mv78xx0_defconfig (arm, gcc-8) — PASS, 0 errors, 1 warning, 0 section mismatches

Warnings:
    WARNING: "return_address" [vmlinux] is a static EXPORT_SYMBOL_GPL

--------------------------------------------------------------------------------
mvebu_v5_defconfig (arm, gcc-8) — PASS, 0 errors, 1 warning, 0 section mismatches

Warnings:
    WARNING: "return_address" [vmlinux] is a static EXPORT_SYMBOL_GPL

--------------------------------------------------------------------------------
mvebu_v7_defconfig (arm, gcc-8) — PASS, 0 errors, 1 warning, 0 section mismatches

Warnings:
    WARNING: "return_address" [vmlinux] is a static EXPORT_SYMBOL_GPL

--------------------------------------------------------------------------------
mxs_defconfig (arm, gcc-8) — PASS, 0 errors, 1 warning, 0 section mismatches

Warnings:
    WARNING: "return_address" [vmlinux] is a static EXPORT_SYMBOL_GPL

--------------------------------------------------------------------------------
neponset_defconfig (arm, gcc-8) — PASS, 0 errors, 0 warnings, 0 section mismatches

Section mismatches:
    WARNING: vmlinux.o(.text.unlikely+0x8c4): Section mismatch in reference from the function free_memmap() to the function .meminit.text:memblock_free()

--------------------------------------------------------------------------------
netwinder_defconfig (arm, gcc-8) — PASS, 0 errors, 0 warnings, 0 section mismatches

--------------------------------------------------------------------------------
nhk8815_defconfig (arm, gcc-8) — PASS, 0 errors, 1 warning, 0 section mismatches

Warnings:
    WARNING: "return_address" [vmlinux] is a static EXPORT_SYMBOL_GPL

--------------------------------------------------------------------------------
nlm_xlp_defconfig (mips, gcc-8) — PASS, 0 errors, 2 warnings, 0 section mismatches

Warnings:
    drivers/net/ethernet/intel/e1000e/netdev.c:6405:13: warning: 'e1000e_s0ix_exit_flow' defined but not used [-Wunused-function]
    drivers/net/ethernet/intel/e1000e/netdev.c:6298:13: warning: 'e1000e_s0ix_entry_flow' defined but not used [-Wunused-function]

--------------------------------------------------------------------------------
nlm_xlr_defconfig (mips, gcc-8) — PASS, 0 errors, 3 warnings, 0 section mismatches

Warnings:
    include/linux/kern_levels.h:5:18: warning: format '%lu' expects argument of type 'long unsigned int', but argument 8 has type 'unsigned int' [-Wformat=]
    drivers/net/ethernet/intel/e1000e/netdev.c:6405:13: warning: 'e1000e_s0ix_exit_flow' defined but not used [-Wunused-function]
    drivers/net/ethernet/intel/e1000e/netdev.c:6298:13: warning: 'e1000e_s0ix_entry_flow' defined but not used [-Wunused-function]

--------------------------------------------------------------------------------
nsimosci_hs_defconfig (arc, gcc-8) — PASS, 0 errors, 2 warnings, 0 section mismatches

Warnings:
    <stdin>:1511:2: warning: #warning syscall clone3 not implemented [-Wcpp]
    <stdin>:1511:2: warning: #warning syscall clone3 not implemented [-Wcpp]

--------------------------------------------------------------------------------
nsimosci_hs_smp_defconfig (arc, gcc-8) — PASS, 0 errors, 2 warnings, 0 section mismatches

Warnings:
    <stdin>:1511:2: warning: #warning syscall clone3 not implemented [-Wcpp]
    <stdin>:1511:2: warning: #warning syscall clone3 not implemented [-Wcpp]

--------------------------------------------------------------------------------
omap1_defconfig (arm, gcc-8) — PASS, 0 errors, 1 warning, 0 section mismatches

Warnings:
    WARNING: "return_address" [vmlinux] is a static EXPORT_SYMBOL_GPL

--------------------------------------------------------------------------------
omap2plus_defconfig (arm, gcc-8) — PASS, 0 errors, 1 warning, 0 section mismatches

Warnings:
    WARNING: "return_address" [vmlinux] is a static EXPORT_SYMBOL_GPL

--------------------------------------------------------------------------------
omega2p_defconfig (mips, gcc-8) — PASS, 0 errors, 0 warnings, 0 section mismatches

--------------------------------------------------------------------------------
orion5x_defconfig (arm, gcc-8) — PASS, 0 errors, 1 warning, 0 section mismatches

Warnings:
    WARNING: "return_address" [vmlinux] is a static EXPORT_SYMBOL_GPL

--------------------------------------------------------------------------------
oxnas_v6_defconfig (arm, gcc-8) — PASS, 0 errors, 1 warning, 0 section mismatches

Warnings:
    WARNING: "return_address" [vmlinux] is a static EXPORT_SYMBOL_GPL

--------------------------------------------------------------------------------
palmz72_defconfig (arm, gcc-8) — PASS, 0 errors, 1 warning, 0 section mismatches

Warnings:
    WARNING: "return_address" [vmlinux] is a static EXPORT_SYMBOL_GPL

--------------------------------------------------------------------------------
pcm027_defconfig (arm, gcc-8) — PASS, 0 errors, 1 warning, 0 section mismatches

Warnings:
    WARNING: "return_address" [vmlinux] is a static EXPORT_SYMBOL_GPL

--------------------------------------------------------------------------------
pic32mzda_defconfig (mips, gcc-8) — PASS, 0 errors, 0 warnings, 0 section mismatches

--------------------------------------------------------------------------------
pistachio_defconfig (mips, gcc-8) — PASS, 0 errors, 0 warnings, 0 section mismatches

--------------------------------------------------------------------------------
pleb_defconfig (arm, gcc-8) — PASS, 0 errors, 0 warnings, 0 section mismatches

Section mismatches:
    WARNING: vmlinux.o(.text.unlikely+0x840): Section mismatch in reference from the function free_memmap() to the function .meminit.text:memblock_free()

--------------------------------------------------------------------------------
pnx8335_stb225_defconfig (mips, gcc-8) — PASS, 0 errors, 0 warnings, 0 section mismatches

--------------------------------------------------------------------------------
prima2_defconfig (arm, gcc-8) — PASS, 0 errors, 1 warning, 0 section mismatches

Warnings:
    WARNING: "return_address" [vmlinux] is a static EXPORT_SYMBOL_GPL

--------------------------------------------------------------------------------
pxa168_defconfig (arm, gcc-8) — PASS, 0 errors, 1 warning, 0 section mismatches

Warnings:
    WARNING: "return_address" [vmlinux] is a static EXPORT_SYMBOL_GPL

--------------------------------------------------------------------------------
pxa255-idp_defconfig (arm, gcc-8) — PASS, 0 errors, 0 warnings, 0 section mismatches

--------------------------------------------------------------------------------
pxa3xx_defconfig (arm, gcc-8) — PASS, 0 errors, 1 warning, 0 section mismatches

Warnings:
    WARNING: "return_address" [vmlinux] is a static EXPORT_SYMBOL_GPL

--------------------------------------------------------------------------------
pxa910_defconfig (arm, gcc-8) — PASS, 0 errors, 1 warning, 0 section mismatches

Warnings:
    WARNING: "return_address" [vmlinux] is a static EXPORT_SYMBOL_GPL

--------------------------------------------------------------------------------
pxa_defconfig (arm, gcc-8) — PASS, 0 errors, 0 warnings, 0 section mismatches

--------------------------------------------------------------------------------
qcom_defconfig (arm, gcc-8) — PASS, 0 errors, 1 warning, 0 section mismatches

Warnings:
    WARNING: "return_address" [vmlinux] is a static EXPORT_SYMBOL_GPL

--------------------------------------------------------------------------------
qi_lb60_defconfig (mips, gcc-8) — PASS, 0 errors, 0 warnings, 0 section mismatches

--------------------------------------------------------------------------------
rb532_defconfig (mips, gcc-8) — PASS, 0 errors, 0 warnings, 0 section mismatches

--------------------------------------------------------------------------------
rbtx49xx_defconfig (mips, gcc-8) — PASS, 0 errors, 1 warning, 0 section mismatches

Warnings:
    sound/soc/txx9/txx9aclc.c:54:30: warning: unused variable 'rtd' [-Wunused-variable]

--------------------------------------------------------------------------------
realview_defconfig (arm, gcc-8) — PASS, 0 errors, 1 warning, 0 section mismatches

Warnings:
    WARNING: "return_address" [vmlinux] is a static EXPORT_SYMBOL_GPL

--------------------------------------------------------------------------------
rm200_defconfig (mips, gcc-8) — PASS, 0 errors, 0 warnings, 0 section mismatches

--------------------------------------------------------------------------------
rpc_defconfig (arm, gcc-8) — PASS, 0 errors, 0 warnings, 0 section mismatches

Section mismatches:
    WARNING: vmlinux.o(.text.unlikely+0x8e4): Section mismatch in reference from the function free_memmap() to the function .meminit.text:memblock_free()

--------------------------------------------------------------------------------
rt305x_defconfig (mips, gcc-8) — PASS, 0 errors, 0 warnings, 0 section mismatches

--------------------------------------------------------------------------------
rv32_defconfig (riscv, gcc-8) — PASS, 0 errors, 8 warnings, 0 section mismatches

Warnings:
    <stdin>:830:2: warning: #warning syscall fstat64 not implemented [-Wcpp]
    <stdin>:1127:2: warning: #warning syscall fstatat64 not implemented [-Wcpp]
    <stdin>:1511:2: warning: #warning syscall clone3 not implemented [-Wcpp]
    drivers/net/ethernet/intel/e1000e/netdev.c:6405:13: warning: 'e1000e_s0ix_exit_flow' defined but not used [-Wunused-function]
    drivers/net/ethernet/intel/e1000e/netdev.c:6298:13: warning: 'e1000e_s0ix_entry_flow' defined but not used [-Wunused-function]
    <stdin>:830:2: warning: #warning syscall fstat64 not implemented [-Wcpp]
    <stdin>:1127:2: warning: #warning syscall fstatat64 not implemented [-Wcpp]
    <stdin>:1511:2: warning: #warning syscall clone3 not implemented [-Wcpp]

--------------------------------------------------------------------------------
s3c2410_defconfig (arm, gcc-8) — PASS, 0 errors, 1 warning, 0 section mismatches

Warnings:
    sound/soc/soc-pcm.c:1185:8: warning: unused variable 'name' [-Wunused-variable]

--------------------------------------------------------------------------------
s3c6400_defconfig (arm, gcc-8) — PASS, 0 errors, 2 warnings, 0 section mismatches

Warnings:
    WARNING: "return_address" [vmlinux] is a static EXPORT_SYMBOL_GPL
    sound/soc/soc-pcm.c:1185:8: warning: unused variable 'name' [-Wunused-variable]

--------------------------------------------------------------------------------
s5pv210_defconfig (arm, gcc-8) — PASS, 0 errors, 1 warning, 0 section mismatches

Warnings:
    WARNING: "return_address" [vmlinux] is a static EXPORT_SYMBOL_GPL

--------------------------------------------------------------------------------
sama5_defconfig (arm, gcc-8) — PASS, 0 errors, 1 warning, 0 section mismatches

Warnings:
    WARNING: "return_address" [vmlinux] is a static EXPORT_SYMBOL_GPL

--------------------------------------------------------------------------------
sb1250_swarm_defconfig (mips, gcc-8) — PASS, 0 errors, 0 warnings, 0 section mismatches

--------------------------------------------------------------------------------
shannon_defconfig (arm, gcc-8) — PASS, 0 errors, 0 warnings, 0 section mismatches

Section mismatches:
    WARNING: vmlinux.o(.text.unlikely+0x8c4): Section mismatch in reference from the function free_memmap() to the function .meminit.text:memblock_free()

--------------------------------------------------------------------------------
shmobile_defconfig (arm, gcc-8) — PASS, 0 errors, 0 warnings, 0 section mismatches

--------------------------------------------------------------------------------
simpad_defconfig (arm, gcc-8) — PASS, 0 errors, 0 warnings, 0 section mismatches

Section mismatches:
    WARNING: vmlinux.o(.text.unlikely+0x84c): Section mismatch in reference from the function free_memmap() to the function .meminit.text:memblock_free()

--------------------------------------------------------------------------------
socfpga_defconfig (arm, gcc-8) — PASS, 0 errors, 0 warnings, 0 section mismatches

--------------------------------------------------------------------------------
spear13xx_defconfig (arm, gcc-8) — PASS, 0 errors, 1 warning, 0 section mismatches

Warnings:
    WARNING: "return_address" [vmlinux] is a static EXPORT_SYMBOL_GPL

--------------------------------------------------------------------------------
spear3xx_defconfig (arm, gcc-8) — PASS, 0 errors, 0 warnings, 0 section mismatches

--------------------------------------------------------------------------------
spear6xx_defconfig (arm, gcc-8) — PASS, 0 errors, 0 warnings, 0 section mismatches

--------------------------------------------------------------------------------
spitz_defconfig (arm, gcc-8) — PASS, 0 errors, 0 warnings, 0 section mismatches

--------------------------------------------------------------------------------
stm32_defconfig (arm, gcc-8) — PASS, 0 errors, 0 warnings, 0 section mismatches

--------------------------------------------------------------------------------
sunxi_defconfig (arm, gcc-8) — PASS, 0 errors, 1 warning, 0 section mismatches

Warnings:
    WARNING: "return_address" [vmlinux] is a static EXPORT_SYMBOL_GPL

--------------------------------------------------------------------------------
tango4_defconfig (arm, gcc-8) — PASS, 0 errors, 1 warning, 0 section mismatches

Warnings:
    WARNING: "return_address" [vmlinux] is a static EXPORT_SYMBOL_GPL

--------------------------------------------------------------------------------
tb0219_defconfig (mips, gcc-8) — PASS, 0 errors, 0 warnings, 0 section mismatches

--------------------------------------------------------------------------------
tb0226_defconfig (mips, gcc-8) — PASS, 0 errors, 0 warnings, 0 section mismatches

--------------------------------------------------------------------------------
tb0287_defconfig (mips, gcc-8) — PASS, 0 errors, 0 warnings, 0 section mismatches

--------------------------------------------------------------------------------
tct_hammer_defconfig (arm, gcc-8) — PASS, 0 errors, 0 warnings, 0 section mismatches

--------------------------------------------------------------------------------
tegra_defconfig (arm, gcc-8) — PASS, 0 errors, 1 warning, 0 section mismatches

Warnings:
    WARNING: "return_address" [vmlinux] is a static EXPORT_SYMBOL_GPL

--------------------------------------------------------------------------------
tinyconfig (i386, gcc-8) — PASS, 0 errors, 0 warnings, 0 section mismatches

--------------------------------------------------------------------------------
tinyconfig (x86_64, gcc-8) — PASS, 0 errors, 1 warning, 0 section mismatches

Warnings:
    .config:1165:warning: override: UNWINDER_GUESS changes choice state

--------------------------------------------------------------------------------
tinyconfig (arm64, gcc-8) — PASS, 0 errors, 0 warnings, 0 section mismatches

--------------------------------------------------------------------------------
tinyconfig (arm, gcc-8) — PASS, 0 errors, 0 warnings, 0 section mismatches

--------------------------------------------------------------------------------
tinyconfig (mips, gcc-8) — PASS, 0 errors, 0 warnings, 0 section mismatches

--------------------------------------------------------------------------------
tinyconfig (riscv, gcc-8) — PASS, 0 errors, 0 warnings, 0 section mismatches

--------------------------------------------------------------------------------
tinyconfig (arc, gcc-8) — PASS, 0 errors, 1 warning, 0 section mismatches

Warnings:
    <stdin>:1511:2: warning: #warning syscall clone3 not implemented [-Wcpp]

--------------------------------------------------------------------------------
trizeps4_defconfig (arm, gcc-8) — PASS, 0 errors, 1 warning, 0 section mismatches

Warnings:
    WARNING: "return_address" [vmlinux] is a static EXPORT_SYMBOL_GPL

--------------------------------------------------------------------------------
u300_defconfig (arm, gcc-8) — PASS, 0 errors, 1 warning, 0 section mismatches

Warnings:
    WARNING: "return_address" [vmlinux] is a static EXPORT_SYMBOL_GPL

--------------------------------------------------------------------------------
u8500_defconfig (arm, gcc-8) — PASS, 0 errors, 1 warning, 0 section mismatches

Warnings:
    WARNING: "return_address" [vmlinux] is a static EXPORT_SYMBOL_GPL

--------------------------------------------------------------------------------
vdk_hs38_defconfig (arc, gcc-8) — PASS, 0 errors, 1 warning, 0 section mismatches

Warnings:
    <stdin>:1511:2: warning: #warning syscall clone3 not implemented [-Wcpp]

--------------------------------------------------------------------------------
vdk_hs38_smp_defconfig (arc, gcc-8) — PASS, 0 errors, 1 warning, 0 section mismatches

Warnings:
    <stdin>:1511:2: warning: #warning syscall clone3 not implemented [-Wcpp]

--------------------------------------------------------------------------------
versatile_defconfig (arm, gcc-8) — PASS, 0 errors, 1 warning, 0 section mismatches

Warnings:
    WARNING: "return_address" [vmlinux] is a static EXPORT_SYMBOL_GPL

--------------------------------------------------------------------------------
vexpress_defconfig (arm, gcc-8) — PASS, 0 errors, 1 warning, 0 section mismatches

Warnings:
    WARNING: "return_address" [vmlinux] is a static EXPORT_SYMBOL_GPL

--------------------------------------------------------------------------------
vf610m4_defconfig (arm, gcc-8) — PASS, 0 errors, 0 warnings, 0 section mismatches

--------------------------------------------------------------------------------
viper_defconfig (arm, gcc-8) — PASS, 0 errors, 1 warning, 0 section mismatches

Warnings:
    WARNING: "return_address" [vmlinux] is a static EXPORT_SYMBOL_GPL

--------------------------------------------------------------------------------
vocore2_defconfig (mips, gcc-8) — PASS, 0 errors, 0 warnings, 0 section mismatches

--------------------------------------------------------------------------------
vt8500_v6_v7_defconfig (arm, gcc-8) — PASS, 0 errors, 0 warnings, 0 section mismatches

--------------------------------------------------------------------------------
workpad_defconfig (mips, gcc-8) — PASS, 0 errors, 0 warnings, 0 section mismatches

--------------------------------------------------------------------------------
x86_64_defconfig (x86_64, gcc-8) — PASS, 0 errors, 0 warnings, 0 section mismatches

--------------------------------------------------------------------------------
x86_64_defconfig+kselftest (x86_64, gcc-8) — PASS, 0 errors, 27 warnings, 0 section mismatches

Warnings:
    ./.tmp.config.6aLYcOxJFN:4566:warning: override: reassigning to symbol BPF_SYSCALL
    ./.tmp.config.6aLYcOxJFN:4569:warning: override: reassigning to symbol NET_VRF
    ./.tmp.config.6aLYcOxJFN:4570:warning: override: reassigning to symbol NET_L3_MASTER_DEV
    ./.tmp.config.6aLYcOxJFN:4572:warning: override: reassigning to symbol IPV6_MULTIPLE_TABLES
    ./.tmp.config.6aLYcOxJFN:4573:warning: override: reassigning to symbol VETH
    ./.tmp.config.6aLYcOxJFN:4577:warning: override: reassigning to symbol BRIDGE
    ./.tmp.config.6aLYcOxJFN:4578:warning: override: reassigning to symbol VLAN_8021Q
    ./.tmp.config.6aLYcOxJFN:4636:warning: override: reassigning to symbol NET_SCH_INGRESS
    ./.tmp.config.6aLYcOxJFN:4657:warning: override: reassigning to symbol NET_ACT_GACT
    ./.tmp.config.6aLYcOxJFN:4682:warning: override: reassigning to symbol USER_NS
    ./.tmp.config.6aLYcOxJFN:4686:warning: override: reassigning to symbol NET_NS
    ./.tmp.config.6aLYcOxJFN:4794:warning: override: reassigning to symbol USER_NS
    ./.tmp.config.6aLYcOxJFN:4805:warning: override: reassigning to symbol NOTIFIER_ERROR_INJECTION
    ./.tmp.config.6aLYcOxJFN:4815:warning: override: reassigning to symbol ANDROID
    ./.tmp.config.6aLYcOxJFN:4822:warning: override: reassigning to symbol BPF_SYSCALL
    ./.tmp.config.6aLYcOxJFN:4825:warning: override: reassigning to symbol TEST_BPF
    ./.tmp.config.6aLYcOxJFN:4826:warning: override: reassigning to symbol CGROUP_BPF
    ./.tmp.config.6aLYcOxJFN:4828:warning: override: reassigning to symbol NET_CLS_ACT
    ./.tmp.config.6aLYcOxJFN:4829:warning: override: reassigning to symbol NET_SCHED
    ./.tmp.config.6aLYcOxJFN:4830:warning: override: reassigning to symbol NET_SCH_INGRESS
    ./.tmp.config.6aLYcOxJFN:4832:warning: override: reassigning to symbol IPV6
    ./.tmp.config.6aLYcOxJFN:4841:warning: override: reassigning to symbol NET_CLS_FLOWER
    ./.tmp.config.6aLYcOxJFN:4847:warning: override: reassigning to symbol IPV6_GRE
    ./.tmp.config.6aLYcOxJFN:4867:warning: override: reassigning to symbol SECURITYFS
    ./.tmp.config.6aLYcOxJFN:4871:warning: override: reassigning to symbol STAGING
    ./.tmp.config.6aLYcOxJFN:4872:warning: override: reassigning to symbol ANDROID
    ./.tmp.config.6aLYcOxJFN:4889:warning: override: reassigning to symbol USER_NS

--------------------------------------------------------------------------------
x86_64_defconfig+kvm_guest (x86_64, gcc-8) — PASS, 0 errors, 0 warnings, 0 section mismatches

--------------------------------------------------------------------------------
xcep_defconfig (arm, gcc-8) — PASS, 0 errors, 1 warning, 0 section mismatches

Warnings:
    WARNING: "return_address" [vmlinux] is a static EXPORT_SYMBOL_GPL

--------------------------------------------------------------------------------
xway_defconfig (mips, gcc-8) — PASS, 0 errors, 0 warnings, 0 section mismatches

--------------------------------------------------------------------------------
zeus_defconfig (arm, gcc-8) — PASS, 0 errors, 2 warnings, 0 section mismatches

Warnings:
    WARNING: "return_address" [vmlinux] is a static EXPORT_SYMBOL_GPL
    sound/soc/soc-pcm.c:1185:8: warning: unused variable 'name' [-Wunused-variable]

--------------------------------------------------------------------------------
zx_defconfig (arm, gcc-8) — PASS, 0 errors, 0 warnings, 0 section mismatches

---
For more info write to <info@kernelci.org>

^ permalink raw reply	[flat|nested] only message in thread

only message in thread, back to index

Thread overview: (only message) (download: mbox.gz / follow: Atom feed)
-- links below jump to the message on this page --
2019-10-24 11:17 next/master build: 216 builds: 1 failed, 215 passed, 4 errors, 349 warnings (next-20191024) kernelci.org bot

Linux-Next Archive on lore.kernel.org

Archives are clonable:
	git clone --mirror https://lore.kernel.org/linux-next/0 linux-next/git/0.git

	# If you have public-inbox 1.1+ installed, you may
	# initialize and index your mirror using the following commands:
	public-inbox-init -V2 linux-next linux-next/ https://lore.kernel.org/linux-next \
		linux-next@vger.kernel.org
	public-inbox-index linux-next

Example config snippet for mirrors

Newsgroup available over NNTP:
	nntp://nntp.lore.kernel.org/org.kernel.vger.linux-next


AGPL code for this site: git clone https://public-inbox.org/public-inbox.git