Linux-Next Archive on lore.kernel.org
 help / color / Atom feed
* next/master build: 216 builds: 4 failed, 212 passed, 19 errors, 277 warnings (next-20191031)
@ 2019-10-31  9:03 kernelci.org bot
  0 siblings, 0 replies; only message in thread
From: kernelci.org bot @ 2019-10-31  9:03 UTC (permalink / raw)
  To: linux-next

next/master build: 216 builds: 4 failed, 212 passed, 19 errors, 277 warnings (next-20191031)

Full Build Summary: https://kernelci.org/build/next/branch/master/kernel/next-20191031/

Tree: next
Branch: master
Git Describe: next-20191031
Git Commit: 49afce6d47fe05ee01f1a41129b835fe4cca7eea
Git URL: git://git.kernel.org/pub/scm/linux/kernel/git/next/linux-next.git
Built: 7 unique architectures

Build Failures Detected:

arm:
    allmodconfig: (gcc-8) FAIL
    bcm2835_defconfig: (gcc-8) FAIL
    multi_v7_defconfig+kselftest: (gcc-8) FAIL

mips:
    cavium_octeon_defconfig: (gcc-8) FAIL

Errors and Warnings Detected:

arc:
    allnoconfig (gcc-8): 1 warning
    axs103_defconfig (gcc-8): 2 warnings
    axs103_smp_defconfig (gcc-8): 2 warnings
    haps_hs_defconfig (gcc-8): 2 warnings
    haps_hs_smp_defconfig (gcc-8): 2 warnings
    hsdk_defconfig (gcc-8): 2 warnings
    nsimosci_hs_defconfig (gcc-8): 2 warnings
    nsimosci_hs_smp_defconfig (gcc-8): 2 warnings
    tinyconfig (gcc-8): 1 warning
    vdk_hs38_defconfig (gcc-8): 1 warning
    vdk_hs38_smp_defconfig (gcc-8): 1 warning

arm64:
    allmodconfig (clang-8): 48 warnings
    defconfig (gcc-8): 29 warnings

arm:
    allmodconfig (gcc-8): 6 errors
    bcm2835_defconfig (gcc-8): 3 errors
    eseries_pxa_defconfig (gcc-8): 1 warning
    magician_defconfig (gcc-8): 1 warning
    multi_v7_defconfig (gcc-8): 6 errors, 29 warnings
    s3c2410_defconfig (gcc-8): 1 warning
    s3c6400_defconfig (gcc-8): 1 warning
    zeus_defconfig (gcc-8): 1 warning

i386:
    i386_defconfig (gcc-8): 31 warnings

mips:
    32r2el_defconfig (gcc-8): 31 warnings
    cavium_octeon_defconfig (gcc-8): 4 errors, 3 warnings
    db1xxx_defconfig (gcc-8): 1 warning
    ip27_defconfig (gcc-8): 2 warnings
    malta_qemu_32r6_defconfig (gcc-8): 1 warning
    nlm_xlp_defconfig (gcc-8): 2 warnings
    nlm_xlr_defconfig (gcc-8): 4 warnings
    rbtx49xx_defconfig (gcc-8): 1 warning

riscv:
    defconfig (gcc-8): 2 warnings
    defconfig (gcc-8): 31 warnings
    rv32_defconfig (gcc-8): 8 warnings

x86_64:
    allmodconfig (gcc-8): 1 warning
    tinyconfig (gcc-8): 1 warning
    x86_64_defconfig (gcc-8): 29 warnings

Errors summary:

    1    trace_preemptirq.c:(.text+0xd14): undefined reference to `return_address'
    1    trace_preemptirq.c:(.text+0x710): undefined reference to `return_address'
    1    trace_preemptirq.c:(.text+0x470): undefined reference to `return_address'
    1    trace_preemptirq.c:(.text+0x2a8): undefined reference to `return_address'
    1    trace_irqsoff.c:(.text+0xa70): undefined reference to `return_address'
    1    trace_irqsoff.c:(.text+0x7a8): undefined reference to `return_address'
    1    drivers/staging/octeon/ethernet.c:516:29: error: type of formal parameter 2 is incomplete
    1    drivers/staging/octeon/ethernet.c:499:30: error: storage size of 'link_info' isn't known
    1    drivers/staging/octeon/ethernet.c:463:30: error: storage size of 'link_info' isn't known
    1    drivers/staging/octeon/ethernet.c:177:21: error: dereferencing pointer to incomplete type 'struct cvmx_wqe'
    1    arm-linux-gnueabihf-ld: trace_preemptirq.c:(.text+0xda0): undefined reference to `return_address'
    1    arm-linux-gnueabihf-ld: trace_preemptirq.c:(.text+0xb10): undefined reference to `return_address'
    1    arm-linux-gnueabihf-ld: trace_preemptirq.c:(.text+0x49c): undefined reference to `return_address'
    1    arm-linux-gnueabihf-ld: trace_preemptirq.c:(.text+0x2e4): undefined reference to `return_address'
    1    arm-linux-gnueabihf-ld: kernel/trace/trace_irqsoff.o:trace_irqsoff.c:(.text+0xee4): more undefined references to `return_address' follow
    1    arm-linux-gnueabihf-ld: kernel/trace/trace_irqsoff.o:trace_irqsoff.c:(.text+0x27d4): more undefined references to `return_address' follow
    1    arm-linux-gnueabihf-ld: /home/buildslave/workspace/kernel-build/linux/build/../kernel/trace/trace_sched_wakeup.c:596: undefined reference to `return_address'
    1    /home/buildslave/workspace/kernel-build/linux/build/../kernel/trace/trace_sched_wakeup.c:596: undefined reference to `return_address'
    1    /home/buildslave/workspace/kernel-build/linux/build/../kernel/trace/trace_sched_wakeup.c:476: undefined reference to `return_address'

Warnings summary:

    20   <stdin>:1511:2: warning: #warning syscall clone3 not implemented [-Wcpp]
    15   1 warning generated.
    6    sound/soc/soc-pcm.c:1185:8: warning: unused variable 'name' [-Wunused-variable]
    6    drivers/net/ethernet/intel/e1000e/netdev.c:6405:13: warning: 'e1000e_s0ix_exit_flow' defined but not used [-Wunused-function]
    6    drivers/net/ethernet/intel/e1000e/netdev.c:6298:13: warning: 'e1000e_s0ix_entry_flow' defined but not used [-Wunused-function]
    6    2 warnings generated.
    3    include/linux/kern_levels.h:5:18: warning: format '%lu' expects argument of type 'long unsigned int', but argument 8 has type 'unsigned int' [-Wformat=]
    3    fs/btrfs/tree-checker.c:230:43: warning: format '%lu' expects argument of type 'long unsigned int', but argument 5 has type 'unsigned int' [-Wformat=]
    2    <stdin>:830:2: warning: #warning syscall fstat64 not implemented [-Wcpp]
    2    <stdin>:1127:2: warning: #warning syscall fstatat64 not implemented [-Wcpp]
    1    {standard input}:134: Warning: macro instruction expanded into multiple instructions
    1    sound/soc/txx9/txx9aclc.c:54:30: warning: unused variable 'rtd' [-Wunused-variable]
    1    net/nfc/hci/llc_shdlc.c:687:34: warning: variable 'connect_wq' is uninitialized when used within its own initialization [-Wuninitialized]
    1    net/nfc/hci/command.c:59:34: warning: variable 'ew_wq' is uninitialized when used within its own initialization [-Wuninitialized]
    1    mm/shmem.c:2737:35: warning: variable 'shmem_falloc_waitq' is uninitialized when used within its own initialization [-Wuninitialized]
    1    fs/proc/proc_sysctl.c:705:35: warning: variable 'wq' is uninitialized when used within its own initialization [-Wuninitialized]
    1    fs/proc/base.c:1894:35: warning: variable 'wq' is uninitialized when used within its own initialization [-Wuninitialized]
    1    fs/nfs/dir.c:448:34: warning: variable 'wq' is uninitialized when used within its own initialization [-Wuninitialized]
    1    fs/nfs/dir.c:1499:34: warning: variable 'wq' is uninitialized when used within its own initialization [-Wuninitialized]
    1    fs/namei.c:3132:34: warning: variable 'wq' is uninitialized when used within its own initialization [-Wuninitialized]
    1    fs/namei.c:1644:34: warning: variable 'wq' is uninitialized when used within its own initialization [-Wuninitialized]
    1    fs/fuse/readdir.c:161:34: warning: variable 'wq' is uninitialized when used within its own initialization [-Wuninitialized]
    1    fs/cifs/readdir.c:83:34: warning: variable 'wq' is uninitialized when used within its own initialization [-Wuninitialized]
    1    fs/afs/dir_silly.c:205:34: warning: variable 'wq' is uninitialized when used within its own initialization [-Wuninitialized]
    1    drivers/staging/octeon/octeon-ethernet.h:94:12: warning: 'union cvmx_helper_link_info' declared inside parameter list will not be visible outside of this definition or declaration
    1    drivers/staging/octeon/ethernet.c:499:30: warning: unused variable 'link_info' [-Wunused-variable]
    1    drivers/staging/octeon/ethernet.c:463:30: warning: unused variable 'link_info' [-Wunused-variable]
    1    drivers/scsi/lpfc/lpfc_sli.c:11878:34: warning: variable 'done_q' is uninitialized when used within its own initialization [-Wuninitialized]
    1    drivers/scsi/lpfc/lpfc_scsi.c:4726:34: warning: variable 'waitq' is uninitialized when used within its own initialization [-Wuninitialized]
    1    drivers/scsi/bfa/bfad_im.c:378:34: warning: variable 'wq' is uninitialized when used within its own initialization [-Wuninitialized]
    1    drivers/scsi/bfa/bfad_im.c:301:34: warning: variable 'wq' is uninitialized when used within its own initialization [-Wuninitialized]
    1    drivers/net/wireless/realtek/rtw88/phy.c:2074:55: warning: address of array 'swing_table->p' will always evaluate to 'true' [-Wpointer-bool-conversion]
    1    drivers/net/wireless/realtek/rtw88/phy.c:2074:36: warning: address of array 'swing_table->n' will always evaluate to 'true' [-Wpointer-bool-conversion]
    1    drivers/net/usb/lan78xx.c:2665:34: warning: variable 'unlink_wakeup' is uninitialized when used within its own initialization [-Wuninitialized]
    1    drivers/misc/mic/vop/vop_vringh.c:399:34: warning: variable 'wake' is uninitialized when used within its own initialization [-Wuninitialized]
    1    drivers/misc/mic/vop/vop_vringh.c:155:34: warning: variable 'wake' is uninitialized when used within its own initialization [-Wuninitialized]
    1    drivers/gpu/host1x/syncpt.c:208:34: warning: variable 'wq' is uninitialized when used within its own initialization [-Wuninitialized]
    1    drivers/gpu/drm/amd/amdgpu/../powerplay/renoir_ppt.c:183:26: warning: suggest braces around initialization of subobject [-Wmissing-braces]
    1    drivers/dma/fsl-dpaa2-qdma/dpdmai.c:151:25: warning: variable 'cfg' is uninitialized when used within its own initialization [-Wuninitialized]
    1    drivers/dma/fsl-dpaa2-qdma/dpdmai.c:151:20: warning: variable 'cmd' is uninitialized when used within its own initialization [-Wuninitialized]
    1    drivers/bluetooth/bluecard_cs.c:282:36: warning: variable 'wq' is uninitialized when used within its own initialization [-Wuninitialized]
    1    drivers/android/binderfs.c:657:41: warning: suggest braces around initialization of subobject [-Wmissing-braces]
    1    WARNING: unmet direct dependencies detected for FSL_RCPM
    1    .config:1165:warning: override: UNWINDER_GUESS changes choice state
    1    ./.tmp.config.splU4w1k0v:7987:warning: override: reassigning to symbol USER_NS
    1    ./.tmp.config.splU4w1k0v:7970:warning: override: reassigning to symbol ANDROID
    1    ./.tmp.config.splU4w1k0v:7969:warning: override: reassigning to symbol STAGING
    1    ./.tmp.config.splU4w1k0v:7965:warning: override: reassigning to symbol SECURITYFS
    1    ./.tmp.config.splU4w1k0v:7945:warning: override: reassigning to symbol IPV6_GRE
    1    ./.tmp.config.splU4w1k0v:7939:warning: override: reassigning to symbol NET_CLS_FLOWER
    1    ./.tmp.config.splU4w1k0v:7930:warning: override: reassigning to symbol IPV6
    1    ./.tmp.config.splU4w1k0v:7928:warning: override: reassigning to symbol NET_SCH_INGRESS
    1    ./.tmp.config.splU4w1k0v:7927:warning: override: reassigning to symbol NET_SCHED
    1    ./.tmp.config.splU4w1k0v:7926:warning: override: reassigning to symbol NET_CLS_ACT
    1    ./.tmp.config.splU4w1k0v:7924:warning: override: reassigning to symbol CGROUP_BPF
    1    ./.tmp.config.splU4w1k0v:7923:warning: override: reassigning to symbol TEST_BPF
    1    ./.tmp.config.splU4w1k0v:7920:warning: override: reassigning to symbol BPF_SYSCALL
    1    ./.tmp.config.splU4w1k0v:7913:warning: override: reassigning to symbol ANDROID
    1    ./.tmp.config.splU4w1k0v:7903:warning: override: reassigning to symbol NOTIFIER_ERROR_INJECTION
    1    ./.tmp.config.splU4w1k0v:7892:warning: override: reassigning to symbol USER_NS
    1    ./.tmp.config.splU4w1k0v:7784:warning: override: reassigning to symbol NET_NS
    1    ./.tmp.config.splU4w1k0v:7780:warning: override: reassigning to symbol USER_NS
    1    ./.tmp.config.splU4w1k0v:7754:warning: override: reassigning to symbol NET_ACT_GACT
    1    ./.tmp.config.splU4w1k0v:7733:warning: override: reassigning to symbol NET_SCH_INGRESS
    1    ./.tmp.config.splU4w1k0v:7725:warning: override: reassigning to symbol NF_NAT
    1    ./.tmp.config.splU4w1k0v:7721:warning: override: reassigning to symbol NF_CONNTRACK
    1    ./.tmp.config.splU4w1k0v:7666:warning: override: reassigning to symbol VLAN_8021Q
    1    ./.tmp.config.splU4w1k0v:7665:warning: override: reassigning to symbol BRIDGE
    1    ./.tmp.config.splU4w1k0v:7661:warning: override: reassigning to symbol VETH
    1    ./.tmp.config.splU4w1k0v:7660:warning: override: reassigning to symbol IPV6_MULTIPLE_TABLES
    1    ./.tmp.config.splU4w1k0v:7658:warning: override: reassigning to symbol NET_L3_MASTER_DEV
    1    ./.tmp.config.splU4w1k0v:7657:warning: override: reassigning to symbol NET_VRF
    1    ./.tmp.config.splU4w1k0v:7654:warning: override: reassigning to symbol BPF_SYSCALL
    1    ./.tmp.config.ba6id5KDSu:3995:warning: override: reassigning to symbol USER_NS
    1    ./.tmp.config.ba6id5KDSu:3978:warning: override: reassigning to symbol ANDROID
    1    ./.tmp.config.ba6id5KDSu:3977:warning: override: reassigning to symbol STAGING
    1    ./.tmp.config.ba6id5KDSu:3973:warning: override: reassigning to symbol SECURITYFS
    1    ./.tmp.config.ba6id5KDSu:3953:warning: override: reassigning to symbol IPV6_GRE
    1    ./.tmp.config.ba6id5KDSu:3947:warning: override: reassigning to symbol NET_CLS_FLOWER
    1    ./.tmp.config.ba6id5KDSu:3938:warning: override: reassigning to symbol IPV6
    1    ./.tmp.config.ba6id5KDSu:3936:warning: override: reassigning to symbol NET_SCH_INGRESS
    1    ./.tmp.config.ba6id5KDSu:3935:warning: override: reassigning to symbol NET_SCHED
    1    ./.tmp.config.ba6id5KDSu:3934:warning: override: reassigning to symbol NET_CLS_ACT
    1    ./.tmp.config.ba6id5KDSu:3932:warning: override: reassigning to symbol CGROUP_BPF
    1    ./.tmp.config.ba6id5KDSu:3931:warning: override: reassigning to symbol TEST_BPF
    1    ./.tmp.config.ba6id5KDSu:3928:warning: override: reassigning to symbol BPF_SYSCALL
    1    ./.tmp.config.ba6id5KDSu:3921:warning: override: reassigning to symbol ANDROID
    1    ./.tmp.config.ba6id5KDSu:3911:warning: override: reassigning to symbol NOTIFIER_ERROR_INJECTION
    1    ./.tmp.config.ba6id5KDSu:3900:warning: override: reassigning to symbol USER_NS
    1    ./.tmp.config.ba6id5KDSu:3792:warning: override: reassigning to symbol NET_NS
    1    ./.tmp.config.ba6id5KDSu:3788:warning: override: reassigning to symbol USER_NS
    1    ./.tmp.config.ba6id5KDSu:3762:warning: override: reassigning to symbol NET_ACT_GACT
    1    ./.tmp.config.ba6id5KDSu:3741:warning: override: reassigning to symbol NET_SCH_INGRESS
    1    ./.tmp.config.ba6id5KDSu:3733:warning: override: reassigning to symbol NF_NAT
    1    ./.tmp.config.ba6id5KDSu:3729:warning: override: reassigning to symbol NF_CONNTRACK
    1    ./.tmp.config.ba6id5KDSu:3674:warning: override: reassigning to symbol VLAN_8021Q
    1    ./.tmp.config.ba6id5KDSu:3673:warning: override: reassigning to symbol BRIDGE
    1    ./.tmp.config.ba6id5KDSu:3669:warning: override: reassigning to symbol VETH
    1    ./.tmp.config.ba6id5KDSu:3668:warning: override: reassigning to symbol IPV6_MULTIPLE_TABLES
    1    ./.tmp.config.ba6id5KDSu:3666:warning: override: reassigning to symbol NET_L3_MASTER_DEV
    1    ./.tmp.config.ba6id5KDSu:3665:warning: override: reassigning to symbol NET_VRF
    1    ./.tmp.config.ba6id5KDSu:3662:warning: override: reassigning to symbol BPF_SYSCALL
    1    ./.tmp.config.aZ1oqzw4pd:3380:warning: override: reassigning to symbol USER_NS
    1    ./.tmp.config.aZ1oqzw4pd:3363:warning: override: reassigning to symbol ANDROID
    1    ./.tmp.config.aZ1oqzw4pd:3362:warning: override: reassigning to symbol STAGING
    1    ./.tmp.config.aZ1oqzw4pd:3358:warning: override: reassigning to symbol SECURITYFS
    1    ./.tmp.config.aZ1oqzw4pd:3338:warning: override: reassigning to symbol IPV6_GRE
    1    ./.tmp.config.aZ1oqzw4pd:3332:warning: override: reassigning to symbol NET_CLS_FLOWER
    1    ./.tmp.config.aZ1oqzw4pd:3323:warning: override: reassigning to symbol IPV6
    1    ./.tmp.config.aZ1oqzw4pd:3321:warning: override: reassigning to symbol NET_SCH_INGRESS
    1    ./.tmp.config.aZ1oqzw4pd:3320:warning: override: reassigning to symbol NET_SCHED
    1    ./.tmp.config.aZ1oqzw4pd:3319:warning: override: reassigning to symbol NET_CLS_ACT
    1    ./.tmp.config.aZ1oqzw4pd:3317:warning: override: reassigning to symbol CGROUP_BPF
    1    ./.tmp.config.aZ1oqzw4pd:3316:warning: override: reassigning to symbol TEST_BPF
    1    ./.tmp.config.aZ1oqzw4pd:3313:warning: override: reassigning to symbol BPF_SYSCALL
    1    ./.tmp.config.aZ1oqzw4pd:3306:warning: override: reassigning to symbol ANDROID
    1    ./.tmp.config.aZ1oqzw4pd:3296:warning: override: reassigning to symbol NOTIFIER_ERROR_INJECTION
    1    ./.tmp.config.aZ1oqzw4pd:3285:warning: override: reassigning to symbol USER_NS
    1    ./.tmp.config.aZ1oqzw4pd:3177:warning: override: reassigning to symbol NET_NS
    1    ./.tmp.config.aZ1oqzw4pd:3173:warning: override: reassigning to symbol USER_NS
    1    ./.tmp.config.aZ1oqzw4pd:3147:warning: override: reassigning to symbol NET_ACT_GACT
    1    ./.tmp.config.aZ1oqzw4pd:3126:warning: override: reassigning to symbol NET_SCH_INGRESS
    1    ./.tmp.config.aZ1oqzw4pd:3118:warning: override: reassigning to symbol NF_NAT
    1    ./.tmp.config.aZ1oqzw4pd:3114:warning: override: reassigning to symbol NF_CONNTRACK
    1    ./.tmp.config.aZ1oqzw4pd:3059:warning: override: reassigning to symbol VLAN_8021Q
    1    ./.tmp.config.aZ1oqzw4pd:3058:warning: override: reassigning to symbol BRIDGE
    1    ./.tmp.config.aZ1oqzw4pd:3054:warning: override: reassigning to symbol VETH
    1    ./.tmp.config.aZ1oqzw4pd:3053:warning: override: reassigning to symbol IPV6_MULTIPLE_TABLES
    1    ./.tmp.config.aZ1oqzw4pd:3051:warning: override: reassigning to symbol NET_L3_MASTER_DEV
    1    ./.tmp.config.aZ1oqzw4pd:3050:warning: override: reassigning to symbol NET_VRF
    1    ./.tmp.config.aZ1oqzw4pd:3047:warning: override: reassigning to symbol BPF_SYSCALL
    1    ./.tmp.config.ROAP1GT9JN:8597:warning: override: reassigning to symbol USER_NS
    1    ./.tmp.config.ROAP1GT9JN:8580:warning: override: reassigning to symbol ANDROID
    1    ./.tmp.config.ROAP1GT9JN:8579:warning: override: reassigning to symbol STAGING
    1    ./.tmp.config.ROAP1GT9JN:8575:warning: override: reassigning to symbol SECURITYFS
    1    ./.tmp.config.ROAP1GT9JN:8555:warning: override: reassigning to symbol IPV6_GRE
    1    ./.tmp.config.ROAP1GT9JN:8549:warning: override: reassigning to symbol NET_CLS_FLOWER
    1    ./.tmp.config.ROAP1GT9JN:8540:warning: override: reassigning to symbol IPV6
    1    ./.tmp.config.ROAP1GT9JN:8538:warning: override: reassigning to symbol NET_SCH_INGRESS
    1    ./.tmp.config.ROAP1GT9JN:8537:warning: override: reassigning to symbol NET_SCHED
    1    ./.tmp.config.ROAP1GT9JN:8536:warning: override: reassigning to symbol NET_CLS_ACT
    1    ./.tmp.config.ROAP1GT9JN:8534:warning: override: reassigning to symbol CGROUP_BPF
    1    ./.tmp.config.ROAP1GT9JN:8533:warning: override: reassigning to symbol TEST_BPF
    1    ./.tmp.config.ROAP1GT9JN:8530:warning: override: reassigning to symbol BPF_SYSCALL
    1    ./.tmp.config.ROAP1GT9JN:8523:warning: override: reassigning to symbol ANDROID
    1    ./.tmp.config.ROAP1GT9JN:8513:warning: override: reassigning to symbol NOTIFIER_ERROR_INJECTION
    1    ./.tmp.config.ROAP1GT9JN:8502:warning: override: reassigning to symbol USER_NS
    1    ./.tmp.config.ROAP1GT9JN:8394:warning: override: reassigning to symbol NET_NS
    1    ./.tmp.config.ROAP1GT9JN:8390:warning: override: reassigning to symbol USER_NS
    1    ./.tmp.config.ROAP1GT9JN:8364:warning: override: reassigning to symbol NET_ACT_GACT
    1    ./.tmp.config.ROAP1GT9JN:8343:warning: override: reassigning to symbol NET_SCH_INGRESS
    1    ./.tmp.config.ROAP1GT9JN:8335:warning: override: reassigning to symbol NF_NAT
    1    ./.tmp.config.ROAP1GT9JN:8331:warning: override: reassigning to symbol NF_CONNTRACK
    1    ./.tmp.config.ROAP1GT9JN:8276:warning: override: reassigning to symbol VLAN_8021Q
    1    ./.tmp.config.ROAP1GT9JN:8275:warning: override: reassigning to symbol BRIDGE
    1    ./.tmp.config.ROAP1GT9JN:8271:warning: override: reassigning to symbol VETH
    1    ./.tmp.config.ROAP1GT9JN:8270:warning: override: reassigning to symbol IPV6_MULTIPLE_TABLES
    1    ./.tmp.config.ROAP1GT9JN:8268:warning: override: reassigning to symbol NET_L3_MASTER_DEV
    1    ./.tmp.config.ROAP1GT9JN:8267:warning: override: reassigning to symbol NET_VRF
    1    ./.tmp.config.ROAP1GT9JN:8264:warning: override: reassigning to symbol BPF_SYSCALL
    1    ./.tmp.config.EhvFnj8w1Q:4900:warning: override: reassigning to symbol USER_NS
    1    ./.tmp.config.EhvFnj8w1Q:4883:warning: override: reassigning to symbol ANDROID
    1    ./.tmp.config.EhvFnj8w1Q:4882:warning: override: reassigning to symbol STAGING
    1    ./.tmp.config.EhvFnj8w1Q:4878:warning: override: reassigning to symbol SECURITYFS
    1    ./.tmp.config.EhvFnj8w1Q:4858:warning: override: reassigning to symbol IPV6_GRE
    1    ./.tmp.config.EhvFnj8w1Q:4852:warning: override: reassigning to symbol NET_CLS_FLOWER
    1    ./.tmp.config.EhvFnj8w1Q:4843:warning: override: reassigning to symbol IPV6
    1    ./.tmp.config.EhvFnj8w1Q:4841:warning: override: reassigning to symbol NET_SCH_INGRESS
    1    ./.tmp.config.EhvFnj8w1Q:4840:warning: override: reassigning to symbol NET_SCHED
    1    ./.tmp.config.EhvFnj8w1Q:4839:warning: override: reassigning to symbol NET_CLS_ACT
    1    ./.tmp.config.EhvFnj8w1Q:4837:warning: override: reassigning to symbol CGROUP_BPF
    1    ./.tmp.config.EhvFnj8w1Q:4836:warning: override: reassigning to symbol TEST_BPF
    1    ./.tmp.config.EhvFnj8w1Q:4833:warning: override: reassigning to symbol BPF_SYSCALL
    1    ./.tmp.config.EhvFnj8w1Q:4826:warning: override: reassigning to symbol ANDROID
    1    ./.tmp.config.EhvFnj8w1Q:4816:warning: override: reassigning to symbol NOTIFIER_ERROR_INJECTION
    1    ./.tmp.config.EhvFnj8w1Q:4805:warning: override: reassigning to symbol USER_NS
    1    ./.tmp.config.EhvFnj8w1Q:4697:warning: override: reassigning to symbol NET_NS
    1    ./.tmp.config.EhvFnj8w1Q:4693:warning: override: reassigning to symbol USER_NS
    1    ./.tmp.config.EhvFnj8w1Q:4667:warning: override: reassigning to symbol NET_ACT_GACT
    1    ./.tmp.config.EhvFnj8w1Q:4646:warning: override: reassigning to symbol NET_SCH_INGRESS
    1    ./.tmp.config.EhvFnj8w1Q:4638:warning: override: reassigning to symbol NF_NAT
    1    ./.tmp.config.EhvFnj8w1Q:4634:warning: override: reassigning to symbol NF_CONNTRACK
    1    ./.tmp.config.EhvFnj8w1Q:4579:warning: override: reassigning to symbol VLAN_8021Q
    1    ./.tmp.config.EhvFnj8w1Q:4578:warning: override: reassigning to symbol BRIDGE
    1    ./.tmp.config.EhvFnj8w1Q:4574:warning: override: reassigning to symbol VETH
    1    ./.tmp.config.EhvFnj8w1Q:4573:warning: override: reassigning to symbol IPV6_MULTIPLE_TABLES
    1    ./.tmp.config.EhvFnj8w1Q:4571:warning: override: reassigning to symbol NET_L3_MASTER_DEV
    1    ./.tmp.config.EhvFnj8w1Q:4570:warning: override: reassigning to symbol NET_VRF
    1    ./.tmp.config.EhvFnj8w1Q:4567:warning: override: reassigning to symbol BPF_SYSCALL
    1    ./.tmp.config.7ZxsmYxbNe:4837:warning: override: reassigning to symbol USER_NS
    1    ./.tmp.config.7ZxsmYxbNe:4820:warning: override: reassigning to symbol ANDROID
    1    ./.tmp.config.7ZxsmYxbNe:4819:warning: override: reassigning to symbol STAGING
    1    ./.tmp.config.7ZxsmYxbNe:4815:warning: override: reassigning to symbol SECURITYFS
    1    ./.tmp.config.7ZxsmYxbNe:4795:warning: override: reassigning to symbol IPV6_GRE
    1    ./.tmp.config.7ZxsmYxbNe:4789:warning: override: reassigning to symbol NET_CLS_FLOWER
    1    ./.tmp.config.7ZxsmYxbNe:4780:warning: override: reassigning to symbol IPV6
    1    ./.tmp.config.7ZxsmYxbNe:4778:warning: override: reassigning to symbol NET_SCH_INGRESS
    1    ./.tmp.config.7ZxsmYxbNe:4777:warning: override: reassigning to symbol NET_SCHED
    1    ./.tmp.config.7ZxsmYxbNe:4776:warning: override: reassigning to symbol NET_CLS_ACT
    1    ./.tmp.config.7ZxsmYxbNe:4774:warning: override: reassigning to symbol CGROUP_BPF
    1    ./.tmp.config.7ZxsmYxbNe:4773:warning: override: reassigning to symbol TEST_BPF
    1    ./.tmp.config.7ZxsmYxbNe:4770:warning: override: reassigning to symbol BPF_SYSCALL
    1    ./.tmp.config.7ZxsmYxbNe:4763:warning: override: reassigning to symbol ANDROID
    1    ./.tmp.config.7ZxsmYxbNe:4753:warning: override: reassigning to symbol NOTIFIER_ERROR_INJECTION
    1    ./.tmp.config.7ZxsmYxbNe:4742:warning: override: reassigning to symbol USER_NS
    1    ./.tmp.config.7ZxsmYxbNe:4634:warning: override: reassigning to symbol NET_NS
    1    ./.tmp.config.7ZxsmYxbNe:4630:warning: override: reassigning to symbol USER_NS
    1    ./.tmp.config.7ZxsmYxbNe:4604:warning: override: reassigning to symbol NET_ACT_GACT
    1    ./.tmp.config.7ZxsmYxbNe:4583:warning: override: reassigning to symbol NET_SCH_INGRESS
    1    ./.tmp.config.7ZxsmYxbNe:4575:warning: override: reassigning to symbol NF_NAT
    1    ./.tmp.config.7ZxsmYxbNe:4571:warning: override: reassigning to symbol NF_CONNTRACK
    1    ./.tmp.config.7ZxsmYxbNe:4516:warning: override: reassigning to symbol VLAN_8021Q
    1    ./.tmp.config.7ZxsmYxbNe:4515:warning: override: reassigning to symbol BRIDGE
    1    ./.tmp.config.7ZxsmYxbNe:4511:warning: override: reassigning to symbol VETH
    1    ./.tmp.config.7ZxsmYxbNe:4510:warning: override: reassigning to symbol IPV6_MULTIPLE_TABLES
    1    ./.tmp.config.7ZxsmYxbNe:4508:warning: override: reassigning to symbol NET_L3_MASTER_DEV
    1    ./.tmp.config.7ZxsmYxbNe:4507:warning: override: reassigning to symbol NET_VRF
    1    ./.tmp.config.7ZxsmYxbNe:4504:warning: override: reassigning to symbol BPF_SYSCALL

Section mismatches summary:

    5    WARNING: vmlinux.o(.text.unlikely+0x8c4): Section mismatch in reference from the function free_memmap() to the function .meminit.text:memblock_free()
    3    WARNING: vmlinux.o(.text.unlikely+0x84c): Section mismatch in reference from the function free_memmap() to the function .meminit.text:memblock_free()
    3    WARNING: vmlinux.o(.text.unlikely+0x840): Section mismatch in reference from the function free_memmap() to the function .meminit.text:memblock_free()
    1    WARNING: vmlinux.o(.text.unlikely+0x8e4): Section mismatch in reference from the function free_memmap() to the function .meminit.text:memblock_free()
    1    WARNING: vmlinux.o(.text.unlikely+0x7c8): Section mismatch in reference from the function free_memmap() to the function .meminit.text:memblock_free()
    1    WARNING: vmlinux.o(.text.unlikely+0x710): Section mismatch in reference from the function free_memmap() to the function .meminit.text:memblock_free()
    1    WARNING: vmlinux.o(.text.unlikely+0x3630): Section mismatch in reference from the function pmax_setup_memory_region() to the function .init.text:add_memory_region()
    1    WARNING: vmlinux.o(.text.unlikely+0x3320): Section mismatch in reference from the function pmax_setup_memory_region() to the function .init.text:add_memory_region()

================================================================================

Detailed per-defconfig build reports:

--------------------------------------------------------------------------------
32r2el_defconfig (mips, gcc-8) — PASS, 0 errors, 0 warnings, 0 section mismatches

--------------------------------------------------------------------------------
32r2el_defconfig+kselftest (mips, gcc-8) — PASS, 0 errors, 31 warnings, 0 section mismatches

Warnings:
    ./.tmp.config.ba6id5KDSu:3662:warning: override: reassigning to symbol BPF_SYSCALL
    ./.tmp.config.ba6id5KDSu:3665:warning: override: reassigning to symbol NET_VRF
    ./.tmp.config.ba6id5KDSu:3666:warning: override: reassigning to symbol NET_L3_MASTER_DEV
    ./.tmp.config.ba6id5KDSu:3668:warning: override: reassigning to symbol IPV6_MULTIPLE_TABLES
    ./.tmp.config.ba6id5KDSu:3669:warning: override: reassigning to symbol VETH
    ./.tmp.config.ba6id5KDSu:3673:warning: override: reassigning to symbol BRIDGE
    ./.tmp.config.ba6id5KDSu:3674:warning: override: reassigning to symbol VLAN_8021Q
    ./.tmp.config.ba6id5KDSu:3729:warning: override: reassigning to symbol NF_CONNTRACK
    ./.tmp.config.ba6id5KDSu:3733:warning: override: reassigning to symbol NF_NAT
    ./.tmp.config.ba6id5KDSu:3741:warning: override: reassigning to symbol NET_SCH_INGRESS
    ./.tmp.config.ba6id5KDSu:3762:warning: override: reassigning to symbol NET_ACT_GACT
    ./.tmp.config.ba6id5KDSu:3788:warning: override: reassigning to symbol USER_NS
    ./.tmp.config.ba6id5KDSu:3792:warning: override: reassigning to symbol NET_NS
    ./.tmp.config.ba6id5KDSu:3900:warning: override: reassigning to symbol USER_NS
    ./.tmp.config.ba6id5KDSu:3911:warning: override: reassigning to symbol NOTIFIER_ERROR_INJECTION
    ./.tmp.config.ba6id5KDSu:3921:warning: override: reassigning to symbol ANDROID
    ./.tmp.config.ba6id5KDSu:3928:warning: override: reassigning to symbol BPF_SYSCALL
    ./.tmp.config.ba6id5KDSu:3931:warning: override: reassigning to symbol TEST_BPF
    ./.tmp.config.ba6id5KDSu:3932:warning: override: reassigning to symbol CGROUP_BPF
    ./.tmp.config.ba6id5KDSu:3934:warning: override: reassigning to symbol NET_CLS_ACT
    ./.tmp.config.ba6id5KDSu:3935:warning: override: reassigning to symbol NET_SCHED
    ./.tmp.config.ba6id5KDSu:3936:warning: override: reassigning to symbol NET_SCH_INGRESS
    ./.tmp.config.ba6id5KDSu:3938:warning: override: reassigning to symbol IPV6
    ./.tmp.config.ba6id5KDSu:3947:warning: override: reassigning to symbol NET_CLS_FLOWER
    ./.tmp.config.ba6id5KDSu:3953:warning: override: reassigning to symbol IPV6_GRE
    ./.tmp.config.ba6id5KDSu:3973:warning: override: reassigning to symbol SECURITYFS
    ./.tmp.config.ba6id5KDSu:3977:warning: override: reassigning to symbol STAGING
    ./.tmp.config.ba6id5KDSu:3978:warning: override: reassigning to symbol ANDROID
    ./.tmp.config.ba6id5KDSu:3995:warning: override: reassigning to symbol USER_NS
    include/linux/kern_levels.h:5:18: warning: format '%lu' expects argument of type 'long unsigned int', but argument 8 has type 'unsigned int' [-Wformat=]
    fs/btrfs/tree-checker.c:230:43: warning: format '%lu' expects argument of type 'long unsigned int', but argument 5 has type 'unsigned int' [-Wformat=]

--------------------------------------------------------------------------------
allmodconfig (arm, gcc-8) — FAIL, 6 errors, 0 warnings, 0 section mismatches

Errors:
    trace_preemptirq.c:(.text+0x710): undefined reference to `return_address'
    arm-linux-gnueabihf-ld: trace_preemptirq.c:(.text+0xb10): undefined reference to `return_address'
    trace_preemptirq.c:(.text+0xd14): undefined reference to `return_address'
    arm-linux-gnueabihf-ld: trace_preemptirq.c:(.text+0xda0): undefined reference to `return_address'
    trace_irqsoff.c:(.text+0xa70): undefined reference to `return_address'
    arm-linux-gnueabihf-ld: kernel/trace/trace_irqsoff.o:trace_irqsoff.c:(.text+0x27d4): more undefined references to `return_address' follow

--------------------------------------------------------------------------------
allmodconfig (arm64, gcc-8) — PASS, 0 errors, 0 warnings, 0 section mismatches

--------------------------------------------------------------------------------
allmodconfig (arm64, clang-8) — PASS, 0 errors, 48 warnings, 0 section mismatches

Warnings:
    mm/shmem.c:2737:35: warning: variable 'shmem_falloc_waitq' is uninitialized when used within its own initialization [-Wuninitialized]
    1 warning generated.
    fs/proc/base.c:1894:35: warning: variable 'wq' is uninitialized when used within its own initialization [-Wuninitialized]
    1 warning generated.
    fs/proc/proc_sysctl.c:705:35: warning: variable 'wq' is uninitialized when used within its own initialization [-Wuninitialized]
    1 warning generated.
    fs/namei.c:1644:34: warning: variable 'wq' is uninitialized when used within its own initialization [-Wuninitialized]
    fs/namei.c:3132:34: warning: variable 'wq' is uninitialized when used within its own initialization [-Wuninitialized]
    2 warnings generated.
    drivers/android/binderfs.c:657:41: warning: suggest braces around initialization of subobject [-Wmissing-braces]
    1 warning generated.
    fs/afs/dir_silly.c:205:34: warning: variable 'wq' is uninitialized when used within its own initialization [-Wuninitialized]
    1 warning generated.
    drivers/bluetooth/bluecard_cs.c:282:36: warning: variable 'wq' is uninitialized when used within its own initialization [-Wuninitialized]
    1 warning generated.
    fs/cifs/readdir.c:83:34: warning: variable 'wq' is uninitialized when used within its own initialization [-Wuninitialized]
    1 warning generated.
    fs/fuse/readdir.c:161:34: warning: variable 'wq' is uninitialized when used within its own initialization [-Wuninitialized]
    1 warning generated.
    drivers/dma/fsl-dpaa2-qdma/dpdmai.c:151:20: warning: variable 'cmd' is uninitialized when used within its own initialization [-Wuninitialized]
    drivers/dma/fsl-dpaa2-qdma/dpdmai.c:151:25: warning: variable 'cfg' is uninitialized when used within its own initialization [-Wuninitialized]
    2 warnings generated.
    fs/nfs/dir.c:448:34: warning: variable 'wq' is uninitialized when used within its own initialization [-Wuninitialized]
    fs/nfs/dir.c:1499:34: warning: variable 'wq' is uninitialized when used within its own initialization [-Wuninitialized]
    2 warnings generated.
    drivers/gpu/drm/amd/amdgpu/../powerplay/renoir_ppt.c:183:26: warning: suggest braces around initialization of subobject [-Wmissing-braces]
    1 warning generated.
    drivers/gpu/host1x/syncpt.c:208:34: warning: variable 'wq' is uninitialized when used within its own initialization [-Wuninitialized]
    1 warning generated.
    net/nfc/hci/command.c:59:34: warning: variable 'ew_wq' is uninitialized when used within its own initialization [-Wuninitialized]
    1 warning generated.
    net/nfc/hci/llc_shdlc.c:687:34: warning: variable 'connect_wq' is uninitialized when used within its own initialization [-Wuninitialized]
    1 warning generated.
    drivers/misc/mic/vop/vop_vringh.c:155:34: warning: variable 'wake' is uninitialized when used within its own initialization [-Wuninitialized]
    drivers/misc/mic/vop/vop_vringh.c:399:34: warning: variable 'wake' is uninitialized when used within its own initialization [-Wuninitialized]
    2 warnings generated.
    drivers/net/usb/lan78xx.c:2665:34: warning: variable 'unlink_wakeup' is uninitialized when used within its own initialization [-Wuninitialized]
    1 warning generated.
    drivers/net/wireless/realtek/rtw88/phy.c:2074:36: warning: address of array 'swing_table->n' will always evaluate to 'true' [-Wpointer-bool-conversion]
    drivers/net/wireless/realtek/rtw88/phy.c:2074:55: warning: address of array 'swing_table->p' will always evaluate to 'true' [-Wpointer-bool-conversion]
    2 warnings generated.
    drivers/scsi/bfa/bfad_im.c:301:34: warning: variable 'wq' is uninitialized when used within its own initialization [-Wuninitialized]
    drivers/scsi/bfa/bfad_im.c:378:34: warning: variable 'wq' is uninitialized when used within its own initialization [-Wuninitialized]
    2 warnings generated.
    drivers/scsi/lpfc/lpfc_sli.c:11878:34: warning: variable 'done_q' is uninitialized when used within its own initialization [-Wuninitialized]
    1 warning generated.
    drivers/scsi/lpfc/lpfc_scsi.c:4726:34: warning: variable 'waitq' is uninitialized when used within its own initialization [-Wuninitialized]
    1 warning generated.

--------------------------------------------------------------------------------
allmodconfig (x86_64, gcc-8) — PASS, 0 errors, 1 warning, 0 section mismatches

Warnings:
    WARNING: unmet direct dependencies detected for FSL_RCPM

--------------------------------------------------------------------------------
allnoconfig (arc, gcc-8) — PASS, 0 errors, 1 warning, 0 section mismatches

Warnings:
    <stdin>:1511:2: warning: #warning syscall clone3 not implemented [-Wcpp]

--------------------------------------------------------------------------------
allnoconfig (arm64, gcc-8) — PASS, 0 errors, 0 warnings, 0 section mismatches

--------------------------------------------------------------------------------
allnoconfig (arm, gcc-8) — PASS, 0 errors, 0 warnings, 0 section mismatches

--------------------------------------------------------------------------------
allnoconfig (mips, gcc-8) — PASS, 0 errors, 0 warnings, 0 section mismatches

--------------------------------------------------------------------------------
allnoconfig (riscv, gcc-8) — PASS, 0 errors, 0 warnings, 0 section mismatches

--------------------------------------------------------------------------------
allnoconfig (arm64, clang-8) — PASS, 0 errors, 0 warnings, 0 section mismatches

--------------------------------------------------------------------------------
allnoconfig (i386, gcc-8) — PASS, 0 errors, 0 warnings, 0 section mismatches

--------------------------------------------------------------------------------
allnoconfig (x86_64, gcc-8) — PASS, 0 errors, 0 warnings, 0 section mismatches

--------------------------------------------------------------------------------
am200epdkit_defconfig (arm, gcc-8) — PASS, 0 errors, 0 warnings, 0 section mismatches

--------------------------------------------------------------------------------
ar7_defconfig (mips, gcc-8) — PASS, 0 errors, 0 warnings, 0 section mismatches

--------------------------------------------------------------------------------
aspeed_g4_defconfig (arm, gcc-8) — PASS, 0 errors, 0 warnings, 0 section mismatches

--------------------------------------------------------------------------------
aspeed_g5_defconfig (arm, gcc-8) — PASS, 0 errors, 0 warnings, 0 section mismatches

--------------------------------------------------------------------------------
assabet_defconfig (arm, gcc-8) — PASS, 0 errors, 0 warnings, 0 section mismatches

Section mismatches:
    WARNING: vmlinux.o(.text.unlikely+0x8c4): Section mismatch in reference from the function free_memmap() to the function .meminit.text:memblock_free()

--------------------------------------------------------------------------------
at91_dt_defconfig (arm, gcc-8) — PASS, 0 errors, 0 warnings, 0 section mismatches

--------------------------------------------------------------------------------
ath25_defconfig (mips, gcc-8) — PASS, 0 errors, 0 warnings, 0 section mismatches

--------------------------------------------------------------------------------
ath79_defconfig (mips, gcc-8) — PASS, 0 errors, 0 warnings, 0 section mismatches

--------------------------------------------------------------------------------
axm55xx_defconfig (arm, gcc-8) — PASS, 0 errors, 0 warnings, 0 section mismatches

--------------------------------------------------------------------------------
axs103_defconfig (arc, gcc-8) — PASS, 0 errors, 2 warnings, 0 section mismatches

Warnings:
    <stdin>:1511:2: warning: #warning syscall clone3 not implemented [-Wcpp]
    <stdin>:1511:2: warning: #warning syscall clone3 not implemented [-Wcpp]

--------------------------------------------------------------------------------
axs103_smp_defconfig (arc, gcc-8) — PASS, 0 errors, 2 warnings, 0 section mismatches

Warnings:
    <stdin>:1511:2: warning: #warning syscall clone3 not implemented [-Wcpp]
    <stdin>:1511:2: warning: #warning syscall clone3 not implemented [-Wcpp]

--------------------------------------------------------------------------------
badge4_defconfig (arm, gcc-8) — PASS, 0 errors, 0 warnings, 0 section mismatches

Section mismatches:
    WARNING: vmlinux.o(.text.unlikely+0x84c): Section mismatch in reference from the function free_memmap() to the function .meminit.text:memblock_free()

--------------------------------------------------------------------------------
bcm2835_defconfig (arm, gcc-8) — FAIL, 3 errors, 0 warnings, 0 section mismatches

Errors:
    /home/buildslave/workspace/kernel-build/linux/build/../kernel/trace/trace_sched_wakeup.c:596: undefined reference to `return_address'
    arm-linux-gnueabihf-ld: /home/buildslave/workspace/kernel-build/linux/build/../kernel/trace/trace_sched_wakeup.c:596: undefined reference to `return_address'
    /home/buildslave/workspace/kernel-build/linux/build/../kernel/trace/trace_sched_wakeup.c:476: undefined reference to `return_address'

--------------------------------------------------------------------------------
bcm47xx_defconfig (mips, gcc-8) — PASS, 0 errors, 0 warnings, 0 section mismatches

--------------------------------------------------------------------------------
bcm63xx_defconfig (mips, gcc-8) — PASS, 0 errors, 0 warnings, 0 section mismatches

--------------------------------------------------------------------------------
bigsur_defconfig (mips, gcc-8) — PASS, 0 errors, 0 warnings, 0 section mismatches

--------------------------------------------------------------------------------
bmips_be_defconfig (mips, gcc-8) — PASS, 0 errors, 0 warnings, 0 section mismatches

--------------------------------------------------------------------------------
bmips_stb_defconfig (mips, gcc-8) — PASS, 0 errors, 0 warnings, 0 section mismatches

--------------------------------------------------------------------------------
capcella_defconfig (mips, gcc-8) — PASS, 0 errors, 0 warnings, 0 section mismatches

--------------------------------------------------------------------------------
cavium_octeon_defconfig (mips, gcc-8) — FAIL, 4 errors, 3 warnings, 0 section mismatches

Errors:
    drivers/staging/octeon/ethernet.c:177:21: error: dereferencing pointer to incomplete type 'struct cvmx_wqe'
    drivers/staging/octeon/ethernet.c:463:30: error: storage size of 'link_info' isn't known
    drivers/staging/octeon/ethernet.c:499:30: error: storage size of 'link_info' isn't known
    drivers/staging/octeon/ethernet.c:516:29: error: type of formal parameter 2 is incomplete

Warnings:
    drivers/staging/octeon/octeon-ethernet.h:94:12: warning: 'union cvmx_helper_link_info' declared inside parameter list will not be visible outside of this definition or declaration
    drivers/staging/octeon/ethernet.c:463:30: warning: unused variable 'link_info' [-Wunused-variable]
    drivers/staging/octeon/ethernet.c:499:30: warning: unused variable 'link_info' [-Wunused-variable]

--------------------------------------------------------------------------------
cerfcube_defconfig (arm, gcc-8) — PASS, 0 errors, 0 warnings, 0 section mismatches

Section mismatches:
    WARNING: vmlinux.o(.text.unlikely+0x84c): Section mismatch in reference from the function free_memmap() to the function .meminit.text:memblock_free()

--------------------------------------------------------------------------------
ci20_defconfig (mips, gcc-8) — PASS, 0 errors, 0 warnings, 0 section mismatches

--------------------------------------------------------------------------------
clps711x_defconfig (arm, gcc-8) — PASS, 0 errors, 0 warnings, 0 section mismatches

--------------------------------------------------------------------------------
cm_x2xx_defconfig (arm, gcc-8) — PASS, 0 errors, 0 warnings, 0 section mismatches

--------------------------------------------------------------------------------
cm_x300_defconfig (arm, gcc-8) — PASS, 0 errors, 0 warnings, 0 section mismatches

--------------------------------------------------------------------------------
cns3420vb_defconfig (arm, gcc-8) — PASS, 0 errors, 0 warnings, 0 section mismatches

--------------------------------------------------------------------------------
cobalt_defconfig (mips, gcc-8) — PASS, 0 errors, 0 warnings, 0 section mismatches

--------------------------------------------------------------------------------
colibri_pxa270_defconfig (arm, gcc-8) — PASS, 0 errors, 0 warnings, 0 section mismatches

--------------------------------------------------------------------------------
colibri_pxa300_defconfig (arm, gcc-8) — PASS, 0 errors, 0 warnings, 0 section mismatches

--------------------------------------------------------------------------------
collie_defconfig (arm, gcc-8) — PASS, 0 errors, 0 warnings, 0 section mismatches

Section mismatches:
    WARNING: vmlinux.o(.text.unlikely+0x840): Section mismatch in reference from the function free_memmap() to the function .meminit.text:memblock_free()

--------------------------------------------------------------------------------
corgi_defconfig (arm, gcc-8) — PASS, 0 errors, 0 warnings, 0 section mismatches

--------------------------------------------------------------------------------
davinci_all_defconfig (arm, gcc-8) — PASS, 0 errors, 0 warnings, 0 section mismatches

--------------------------------------------------------------------------------
db1xxx_defconfig (mips, gcc-8) — PASS, 0 errors, 1 warning, 0 section mismatches

Warnings:
    sound/soc/soc-pcm.c:1185:8: warning: unused variable 'name' [-Wunused-variable]

--------------------------------------------------------------------------------
decstation_64_defconfig (mips, gcc-8) — PASS, 0 errors, 0 warnings, 0 section mismatches

--------------------------------------------------------------------------------
decstation_defconfig (mips, gcc-8) — PASS, 0 errors, 0 warnings, 0 section mismatches

Section mismatches:
    WARNING: vmlinux.o(.text.unlikely+0x3630): Section mismatch in reference from the function pmax_setup_memory_region() to the function .init.text:add_memory_region()

--------------------------------------------------------------------------------
decstation_r4k_defconfig (mips, gcc-8) — PASS, 0 errors, 0 warnings, 0 section mismatches

Section mismatches:
    WARNING: vmlinux.o(.text.unlikely+0x3320): Section mismatch in reference from the function pmax_setup_memory_region() to the function .init.text:add_memory_region()

--------------------------------------------------------------------------------
defconfig (riscv, gcc-8) — PASS, 0 errors, 2 warnings, 0 section mismatches

Warnings:
    drivers/net/ethernet/intel/e1000e/netdev.c:6405:13: warning: 'e1000e_s0ix_exit_flow' defined but not used [-Wunused-function]
    drivers/net/ethernet/intel/e1000e/netdev.c:6298:13: warning: 'e1000e_s0ix_entry_flow' defined but not used [-Wunused-function]

--------------------------------------------------------------------------------
defconfig (arm64, gcc-8) — PASS, 0 errors, 0 warnings, 0 section mismatches

--------------------------------------------------------------------------------
defconfig (arm64, clang-8) — PASS, 0 errors, 0 warnings, 0 section mismatches

--------------------------------------------------------------------------------
defconfig+CONFIG_CPU_BIG_ENDIAN=y (arm64, gcc-8) — PASS, 0 errors, 0 warnings, 0 section mismatches

--------------------------------------------------------------------------------
defconfig+CONFIG_RANDOMIZE_BASE=y (arm64, gcc-8) — PASS, 0 errors, 0 warnings, 0 section mismatches

--------------------------------------------------------------------------------
defconfig+kselftest (riscv, gcc-8) — PASS, 0 errors, 31 warnings, 0 section mismatches

Warnings:
    ./.tmp.config.aZ1oqzw4pd:3047:warning: override: reassigning to symbol BPF_SYSCALL
    ./.tmp.config.aZ1oqzw4pd:3050:warning: override: reassigning to symbol NET_VRF
    ./.tmp.config.aZ1oqzw4pd:3051:warning: override: reassigning to symbol NET_L3_MASTER_DEV
    ./.tmp.config.aZ1oqzw4pd:3053:warning: override: reassigning to symbol IPV6_MULTIPLE_TABLES
    ./.tmp.config.aZ1oqzw4pd:3054:warning: override: reassigning to symbol VETH
    ./.tmp.config.aZ1oqzw4pd:3058:warning: override: reassigning to symbol BRIDGE
    ./.tmp.config.aZ1oqzw4pd:3059:warning: override: reassigning to symbol VLAN_8021Q
    ./.tmp.config.aZ1oqzw4pd:3114:warning: override: reassigning to symbol NF_CONNTRACK
    ./.tmp.config.aZ1oqzw4pd:3118:warning: override: reassigning to symbol NF_NAT
    ./.tmp.config.aZ1oqzw4pd:3126:warning: override: reassigning to symbol NET_SCH_INGRESS
    ./.tmp.config.aZ1oqzw4pd:3147:warning: override: reassigning to symbol NET_ACT_GACT
    ./.tmp.config.aZ1oqzw4pd:3173:warning: override: reassigning to symbol USER_NS
    ./.tmp.config.aZ1oqzw4pd:3177:warning: override: reassigning to symbol NET_NS
    ./.tmp.config.aZ1oqzw4pd:3285:warning: override: reassigning to symbol USER_NS
    ./.tmp.config.aZ1oqzw4pd:3296:warning: override: reassigning to symbol NOTIFIER_ERROR_INJECTION
    ./.tmp.config.aZ1oqzw4pd:3306:warning: override: reassigning to symbol ANDROID
    ./.tmp.config.aZ1oqzw4pd:3313:warning: override: reassigning to symbol BPF_SYSCALL
    ./.tmp.config.aZ1oqzw4pd:3316:warning: override: reassigning to symbol TEST_BPF
    ./.tmp.config.aZ1oqzw4pd:3317:warning: override: reassigning to symbol CGROUP_BPF
    ./.tmp.config.aZ1oqzw4pd:3319:warning: override: reassigning to symbol NET_CLS_ACT
    ./.tmp.config.aZ1oqzw4pd:3320:warning: override: reassigning to symbol NET_SCHED
    ./.tmp.config.aZ1oqzw4pd:3321:warning: override: reassigning to symbol NET_SCH_INGRESS
    ./.tmp.config.aZ1oqzw4pd:3323:warning: override: reassigning to symbol IPV6
    ./.tmp.config.aZ1oqzw4pd:3332:warning: override: reassigning to symbol NET_CLS_FLOWER
    ./.tmp.config.aZ1oqzw4pd:3338:warning: override: reassigning to symbol IPV6_GRE
    ./.tmp.config.aZ1oqzw4pd:3358:warning: override: reassigning to symbol SECURITYFS
    ./.tmp.config.aZ1oqzw4pd:3362:warning: override: reassigning to symbol STAGING
    ./.tmp.config.aZ1oqzw4pd:3363:warning: override: reassigning to symbol ANDROID
    ./.tmp.config.aZ1oqzw4pd:3380:warning: override: reassigning to symbol USER_NS
    drivers/net/ethernet/intel/e1000e/netdev.c:6405:13: warning: 'e1000e_s0ix_exit_flow' defined but not used [-Wunused-function]
    drivers/net/ethernet/intel/e1000e/netdev.c:6298:13: warning: 'e1000e_s0ix_entry_flow' defined but not used [-Wunused-function]

--------------------------------------------------------------------------------
defconfig+kselftest (arm64, gcc-8) — PASS, 0 errors, 29 warnings, 0 section mismatches

Warnings:
    ./.tmp.config.splU4w1k0v:7654:warning: override: reassigning to symbol BPF_SYSCALL
    ./.tmp.config.splU4w1k0v:7657:warning: override: reassigning to symbol NET_VRF
    ./.tmp.config.splU4w1k0v:7658:warning: override: reassigning to symbol NET_L3_MASTER_DEV
    ./.tmp.config.splU4w1k0v:7660:warning: override: reassigning to symbol IPV6_MULTIPLE_TABLES
    ./.tmp.config.splU4w1k0v:7661:warning: override: reassigning to symbol VETH
    ./.tmp.config.splU4w1k0v:7665:warning: override: reassigning to symbol BRIDGE
    ./.tmp.config.splU4w1k0v:7666:warning: override: reassigning to symbol VLAN_8021Q
    ./.tmp.config.splU4w1k0v:7721:warning: override: reassigning to symbol NF_CONNTRACK
    ./.tmp.config.splU4w1k0v:7725:warning: override: reassigning to symbol NF_NAT
    ./.tmp.config.splU4w1k0v:7733:warning: override: reassigning to symbol NET_SCH_INGRESS
    ./.tmp.config.splU4w1k0v:7754:warning: override: reassigning to symbol NET_ACT_GACT
    ./.tmp.config.splU4w1k0v:7780:warning: override: reassigning to symbol USER_NS
    ./.tmp.config.splU4w1k0v:7784:warning: override: reassigning to symbol NET_NS
    ./.tmp.config.splU4w1k0v:7892:warning: override: reassigning to symbol USER_NS
    ./.tmp.config.splU4w1k0v:7903:warning: override: reassigning to symbol NOTIFIER_ERROR_INJECTION
    ./.tmp.config.splU4w1k0v:7913:warning: override: reassigning to symbol ANDROID
    ./.tmp.config.splU4w1k0v:7920:warning: override: reassigning to symbol BPF_SYSCALL
    ./.tmp.config.splU4w1k0v:7923:warning: override: reassigning to symbol TEST_BPF
    ./.tmp.config.splU4w1k0v:7924:warning: override: reassigning to symbol CGROUP_BPF
    ./.tmp.config.splU4w1k0v:7926:warning: override: reassigning to symbol NET_CLS_ACT
    ./.tmp.config.splU4w1k0v:7927:warning: override: reassigning to symbol NET_SCHED
    ./.tmp.config.splU4w1k0v:7928:warning: override: reassigning to symbol NET_SCH_INGRESS
    ./.tmp.config.splU4w1k0v:7930:warning: override: reassigning to symbol IPV6
    ./.tmp.config.splU4w1k0v:7939:warning: override: reassigning to symbol NET_CLS_FLOWER
    ./.tmp.config.splU4w1k0v:7945:warning: override: reassigning to symbol IPV6_GRE
    ./.tmp.config.splU4w1k0v:7965:warning: override: reassigning to symbol SECURITYFS
    ./.tmp.config.splU4w1k0v:7969:warning: override: reassigning to symbol STAGING
    ./.tmp.config.splU4w1k0v:7970:warning: override: reassigning to symbol ANDROID
    ./.tmp.config.splU4w1k0v:7987:warning: override: reassigning to symbol USER_NS

--------------------------------------------------------------------------------
dove_defconfig (arm, gcc-8) — PASS, 0 errors, 0 warnings, 0 section mismatches

--------------------------------------------------------------------------------
e55_defconfig (mips, gcc-8) — PASS, 0 errors, 0 warnings, 0 section mismatches

--------------------------------------------------------------------------------
ebsa110_defconfig (arm, gcc-8) — PASS, 0 errors, 0 warnings, 0 section mismatches

--------------------------------------------------------------------------------
efm32_defconfig (arm, gcc-8) — PASS, 0 errors, 0 warnings, 0 section mismatches

--------------------------------------------------------------------------------
em_x270_defconfig (arm, gcc-8) — PASS, 0 errors, 0 warnings, 0 section mismatches

--------------------------------------------------------------------------------
ep93xx_defconfig (arm, gcc-8) — PASS, 0 errors, 0 warnings, 0 section mismatches

Section mismatches:
    WARNING: vmlinux.o(.text.unlikely+0x710): Section mismatch in reference from the function free_memmap() to the function .meminit.text:memblock_free()

--------------------------------------------------------------------------------
eseries_pxa_defconfig (arm, gcc-8) — PASS, 0 errors, 1 warning, 0 section mismatches

Warnings:
    sound/soc/soc-pcm.c:1185:8: warning: unused variable 'name' [-Wunused-variable]

--------------------------------------------------------------------------------
exynos_defconfig (arm, gcc-8) — PASS, 0 errors, 0 warnings, 0 section mismatches

--------------------------------------------------------------------------------
ezx_defconfig (arm, gcc-8) — PASS, 0 errors, 0 warnings, 0 section mismatches

--------------------------------------------------------------------------------
footbridge_defconfig (arm, gcc-8) — PASS, 0 errors, 0 warnings, 0 section mismatches

--------------------------------------------------------------------------------
fuloong2e_defconfig (mips, gcc-8) — PASS, 0 errors, 0 warnings, 0 section mismatches

--------------------------------------------------------------------------------
gcw0_defconfig (mips, gcc-8) — PASS, 0 errors, 0 warnings, 0 section mismatches

--------------------------------------------------------------------------------
gemini_defconfig (arm, gcc-8) — PASS, 0 errors, 0 warnings, 0 section mismatches

--------------------------------------------------------------------------------
gpr_defconfig (mips, gcc-8) — PASS, 0 errors, 0 warnings, 0 section mismatches

--------------------------------------------------------------------------------
h3600_defconfig (arm, gcc-8) — PASS, 0 errors, 0 warnings, 0 section mismatches

Section mismatches:
    WARNING: vmlinux.o(.text.unlikely+0x840): Section mismatch in reference from the function free_memmap() to the function .meminit.text:memblock_free()

--------------------------------------------------------------------------------
h5000_defconfig (arm, gcc-8) — PASS, 0 errors, 0 warnings, 0 section mismatches

--------------------------------------------------------------------------------
hackkit_defconfig (arm, gcc-8) — PASS, 0 errors, 0 warnings, 0 section mismatches

Section mismatches:
    WARNING: vmlinux.o(.text.unlikely+0x8c4): Section mismatch in reference from the function free_memmap() to the function .meminit.text:memblock_free()

--------------------------------------------------------------------------------
haps_hs_defconfig (arc, gcc-8) — PASS, 0 errors, 2 warnings, 0 section mismatches

Warnings:
    <stdin>:1511:2: warning: #warning syscall clone3 not implemented [-Wcpp]
    <stdin>:1511:2: warning: #warning syscall clone3 not implemented [-Wcpp]

--------------------------------------------------------------------------------
haps_hs_smp_defconfig (arc, gcc-8) — PASS, 0 errors, 2 warnings, 0 section mismatches

Warnings:
    <stdin>:1511:2: warning: #warning syscall clone3 not implemented [-Wcpp]
    <stdin>:1511:2: warning: #warning syscall clone3 not implemented [-Wcpp]

--------------------------------------------------------------------------------
hisi_defconfig (arm, gcc-8) — PASS, 0 errors, 0 warnings, 0 section mismatches

--------------------------------------------------------------------------------
hsdk_defconfig (arc, gcc-8) — PASS, 0 errors, 2 warnings, 0 section mismatches

Warnings:
    <stdin>:1511:2: warning: #warning syscall clone3 not implemented [-Wcpp]
    <stdin>:1511:2: warning: #warning syscall clone3 not implemented [-Wcpp]

--------------------------------------------------------------------------------
i386_defconfig (i386, gcc-8) — PASS, 0 errors, 0 warnings, 0 section mismatches

--------------------------------------------------------------------------------
i386_defconfig+kselftest (i386, gcc-8) — PASS, 0 errors, 31 warnings, 0 section mismatches

Warnings:
    ./.tmp.config.7ZxsmYxbNe:4504:warning: override: reassigning to symbol BPF_SYSCALL
    ./.tmp.config.7ZxsmYxbNe:4507:warning: override: reassigning to symbol NET_VRF
    ./.tmp.config.7ZxsmYxbNe:4508:warning: override: reassigning to symbol NET_L3_MASTER_DEV
    ./.tmp.config.7ZxsmYxbNe:4510:warning: override: reassigning to symbol IPV6_MULTIPLE_TABLES
    ./.tmp.config.7ZxsmYxbNe:4511:warning: override: reassigning to symbol VETH
    ./.tmp.config.7ZxsmYxbNe:4515:warning: override: reassigning to symbol BRIDGE
    ./.tmp.config.7ZxsmYxbNe:4516:warning: override: reassigning to symbol VLAN_8021Q
    ./.tmp.config.7ZxsmYxbNe:4571:warning: override: reassigning to symbol NF_CONNTRACK
    ./.tmp.config.7ZxsmYxbNe:4575:warning: override: reassigning to symbol NF_NAT
    ./.tmp.config.7ZxsmYxbNe:4583:warning: override: reassigning to symbol NET_SCH_INGRESS
    ./.tmp.config.7ZxsmYxbNe:4604:warning: override: reassigning to symbol NET_ACT_GACT
    ./.tmp.config.7ZxsmYxbNe:4630:warning: override: reassigning to symbol USER_NS
    ./.tmp.config.7ZxsmYxbNe:4634:warning: override: reassigning to symbol NET_NS
    ./.tmp.config.7ZxsmYxbNe:4742:warning: override: reassigning to symbol USER_NS
    ./.tmp.config.7ZxsmYxbNe:4753:warning: override: reassigning to symbol NOTIFIER_ERROR_INJECTION
    ./.tmp.config.7ZxsmYxbNe:4763:warning: override: reassigning to symbol ANDROID
    ./.tmp.config.7ZxsmYxbNe:4770:warning: override: reassigning to symbol BPF_SYSCALL
    ./.tmp.config.7ZxsmYxbNe:4773:warning: override: reassigning to symbol TEST_BPF
    ./.tmp.config.7ZxsmYxbNe:4774:warning: override: reassigning to symbol CGROUP_BPF
    ./.tmp.config.7ZxsmYxbNe:4776:warning: override: reassigning to symbol NET_CLS_ACT
    ./.tmp.config.7ZxsmYxbNe:4777:warning: override: reassigning to symbol NET_SCHED
    ./.tmp.config.7ZxsmYxbNe:4778:warning: override: reassigning to symbol NET_SCH_INGRESS
    ./.tmp.config.7ZxsmYxbNe:4780:warning: override: reassigning to symbol IPV6
    ./.tmp.config.7ZxsmYxbNe:4789:warning: override: reassigning to symbol NET_CLS_FLOWER
    ./.tmp.config.7ZxsmYxbNe:4795:warning: override: reassigning to symbol IPV6_GRE
    ./.tmp.config.7ZxsmYxbNe:4815:warning: override: reassigning to symbol SECURITYFS
    ./.tmp.config.7ZxsmYxbNe:4819:warning: override: reassigning to symbol STAGING
    ./.tmp.config.7ZxsmYxbNe:4820:warning: override: reassigning to symbol ANDROID
    ./.tmp.config.7ZxsmYxbNe:4837:warning: override: reassigning to symbol USER_NS
    include/linux/kern_levels.h:5:18: warning: format '%lu' expects argument of type 'long unsigned int', but argument 8 has type 'unsigned int' [-Wformat=]
    fs/btrfs/tree-checker.c:230:43: warning: format '%lu' expects argument of type 'long unsigned int', but argument 5 has type 'unsigned int' [-Wformat=]

--------------------------------------------------------------------------------
imote2_defconfig (arm, gcc-8) — PASS, 0 errors, 0 warnings, 0 section mismatches

--------------------------------------------------------------------------------
imx_v4_v5_defconfig (arm, gcc-8) — PASS, 0 errors, 0 warnings, 0 section mismatches

--------------------------------------------------------------------------------
imx_v6_v7_defconfig (arm, gcc-8) — PASS, 0 errors, 0 warnings, 0 section mismatches

--------------------------------------------------------------------------------
integrator_defconfig (arm, gcc-8) — PASS, 0 errors, 0 warnings, 0 section mismatches

--------------------------------------------------------------------------------
iop32x_defconfig (arm, gcc-8) — PASS, 0 errors, 0 warnings, 0 section mismatches

--------------------------------------------------------------------------------
ip22_defconfig (mips, gcc-8) — PASS, 0 errors, 0 warnings, 0 section mismatches

--------------------------------------------------------------------------------
ip27_defconfig (mips, gcc-8) — PASS, 0 errors, 2 warnings, 0 section mismatches

Warnings:
    drivers/net/ethernet/intel/e1000e/netdev.c:6405:13: warning: 'e1000e_s0ix_exit_flow' defined but not used [-Wunused-function]
    drivers/net/ethernet/intel/e1000e/netdev.c:6298:13: warning: 'e1000e_s0ix_entry_flow' defined but not used [-Wunused-function]

--------------------------------------------------------------------------------
ip28_defconfig (mips, gcc-8) — PASS, 0 errors, 0 warnings, 0 section mismatches

--------------------------------------------------------------------------------
ip32_defconfig (mips, gcc-8) — PASS, 0 errors, 0 warnings, 0 section mismatches

--------------------------------------------------------------------------------
ixp4xx_defconfig (arm, gcc-8) — PASS, 0 errors, 0 warnings, 0 section mismatches

--------------------------------------------------------------------------------
jazz_defconfig (mips, gcc-8) — PASS, 0 errors, 0 warnings, 0 section mismatches

--------------------------------------------------------------------------------
jmr3927_defconfig (mips, gcc-8) — PASS, 0 errors, 0 warnings, 0 section mismatches

--------------------------------------------------------------------------------
jornada720_defconfig (arm, gcc-8) — PASS, 0 errors, 0 warnings, 0 section mismatches

Section mismatches:
    WARNING: vmlinux.o(.text.unlikely+0x7c8): Section mismatch in reference from the function free_memmap() to the function .meminit.text:memblock_free()

--------------------------------------------------------------------------------
keystone_defconfig (arm, gcc-8) — PASS, 0 errors, 0 warnings, 0 section mismatches

--------------------------------------------------------------------------------
lart_defconfig (arm, gcc-8) — PASS, 0 errors, 0 warnings, 0 section mismatches

Section mismatches:
    WARNING: vmlinux.o(.text.unlikely+0x8c4): Section mismatch in reference from the function free_memmap() to the function .meminit.text:memblock_free()

--------------------------------------------------------------------------------
lasat_defconfig (mips, gcc-8) — PASS, 0 errors, 0 warnings, 0 section mismatches

--------------------------------------------------------------------------------
lemote2f_defconfig (mips, gcc-8) — PASS, 0 errors, 0 warnings, 0 section mismatches

--------------------------------------------------------------------------------
loongson1b_defconfig (mips, gcc-8) — PASS, 0 errors, 0 warnings, 0 section mismatches

--------------------------------------------------------------------------------
loongson1c_defconfig (mips, gcc-8) — PASS, 0 errors, 0 warnings, 0 section mismatches

--------------------------------------------------------------------------------
loongson3_defconfig (mips, gcc-8) — PASS, 0 errors, 0 warnings, 0 section mismatches

--------------------------------------------------------------------------------
lpc18xx_defconfig (arm, gcc-8) — PASS, 0 errors, 0 warnings, 0 section mismatches

--------------------------------------------------------------------------------
lpc32xx_defconfig (arm, gcc-8) — PASS, 0 errors, 0 warnings, 0 section mismatches

--------------------------------------------------------------------------------
lpd270_defconfig (arm, gcc-8) — PASS, 0 errors, 0 warnings, 0 section mismatches

--------------------------------------------------------------------------------
lubbock_defconfig (arm, gcc-8) — PASS, 0 errors, 0 warnings, 0 section mismatches

--------------------------------------------------------------------------------
magician_defconfig (arm, gcc-8) — PASS, 0 errors, 1 warning, 0 section mismatches

Warnings:
    sound/soc/soc-pcm.c:1185:8: warning: unused variable 'name' [-Wunused-variable]

--------------------------------------------------------------------------------
mainstone_defconfig (arm, gcc-8) — PASS, 0 errors, 0 warnings, 0 section mismatches

--------------------------------------------------------------------------------
malta_defconfig (mips, gcc-8) — PASS, 0 errors, 0 warnings, 0 section mismatches

--------------------------------------------------------------------------------
malta_kvm_defconfig (mips, gcc-8) — PASS, 0 errors, 0 warnings, 0 section mismatches

--------------------------------------------------------------------------------
malta_kvm_guest_defconfig (mips, gcc-8) — PASS, 0 errors, 0 warnings, 0 section mismatches

--------------------------------------------------------------------------------
malta_qemu_32r6_defconfig (mips, gcc-8) — PASS, 0 errors, 1 warning, 0 section mismatches

Warnings:
    {standard input}:134: Warning: macro instruction expanded into multiple instructions

--------------------------------------------------------------------------------
maltaaprp_defconfig (mips, gcc-8) — PASS, 0 errors, 0 warnings, 0 section mismatches

--------------------------------------------------------------------------------
maltasmvp_defconfig (mips, gcc-8) — PASS, 0 errors, 0 warnings, 0 section mismatches

--------------------------------------------------------------------------------
maltasmvp_eva_defconfig (mips, gcc-8) — PASS, 0 errors, 0 warnings, 0 section mismatches

--------------------------------------------------------------------------------
maltaup_defconfig (mips, gcc-8) — PASS, 0 errors, 0 warnings, 0 section mismatches

--------------------------------------------------------------------------------
maltaup_xpa_defconfig (mips, gcc-8) — PASS, 0 errors, 0 warnings, 0 section mismatches

--------------------------------------------------------------------------------
markeins_defconfig (mips, gcc-8) — PASS, 0 errors, 0 warnings, 0 section mismatches

--------------------------------------------------------------------------------
milbeaut_m10v_defconfig (arm, gcc-8) — PASS, 0 errors, 0 warnings, 0 section mismatches

--------------------------------------------------------------------------------
mini2440_defconfig (arm, gcc-8) — PASS, 0 errors, 0 warnings, 0 section mismatches

--------------------------------------------------------------------------------
mips_paravirt_defconfig (mips, gcc-8) — PASS, 0 errors, 0 warnings, 0 section mismatches

--------------------------------------------------------------------------------
mmp2_defconfig (arm, gcc-8) — PASS, 0 errors, 0 warnings, 0 section mismatches

--------------------------------------------------------------------------------
moxart_defconfig (arm, gcc-8) — PASS, 0 errors, 0 warnings, 0 section mismatches

--------------------------------------------------------------------------------
mpc30x_defconfig (mips, gcc-8) — PASS, 0 errors, 0 warnings, 0 section mismatches

--------------------------------------------------------------------------------
mps2_defconfig (arm, gcc-8) — PASS, 0 errors, 0 warnings, 0 section mismatches

--------------------------------------------------------------------------------
msp71xx_defconfig (mips, gcc-8) — PASS, 0 errors, 0 warnings, 0 section mismatches

--------------------------------------------------------------------------------
mtx1_defconfig (mips, gcc-8) — PASS, 0 errors, 0 warnings, 0 section mismatches

--------------------------------------------------------------------------------
multi_v4t_defconfig (arm, gcc-8) — PASS, 0 errors, 0 warnings, 0 section mismatches

--------------------------------------------------------------------------------
multi_v5_defconfig (arm, gcc-8) — PASS, 0 errors, 0 warnings, 0 section mismatches

--------------------------------------------------------------------------------
multi_v7_defconfig (arm, gcc-8) — PASS, 0 errors, 0 warnings, 0 section mismatches

--------------------------------------------------------------------------------
multi_v7_defconfig+CONFIG_CPU_BIG_ENDIAN=y (arm, gcc-8) — PASS, 0 errors, 0 warnings, 0 section mismatches

--------------------------------------------------------------------------------
multi_v7_defconfig+CONFIG_EFI=y+CONFIG_ARM_LPAE=y (arm, gcc-8) — PASS, 0 errors, 0 warnings, 0 section mismatches

--------------------------------------------------------------------------------
multi_v7_defconfig+CONFIG_SMP=n (arm, gcc-8) — PASS, 0 errors, 0 warnings, 0 section mismatches

--------------------------------------------------------------------------------
multi_v7_defconfig+kselftest (arm, gcc-8) — FAIL, 6 errors, 29 warnings, 0 section mismatches

Errors:
    trace_preemptirq.c:(.text+0x2a8): undefined reference to `return_address'
    arm-linux-gnueabihf-ld: trace_preemptirq.c:(.text+0x2e4): undefined reference to `return_address'
    trace_preemptirq.c:(.text+0x470): undefined reference to `return_address'
    arm-linux-gnueabihf-ld: trace_preemptirq.c:(.text+0x49c): undefined reference to `return_address'
    trace_irqsoff.c:(.text+0x7a8): undefined reference to `return_address'
    arm-linux-gnueabihf-ld: kernel/trace/trace_irqsoff.o:trace_irqsoff.c:(.text+0xee4): more undefined references to `return_address' follow

Warnings:
    ./.tmp.config.ROAP1GT9JN:8264:warning: override: reassigning to symbol BPF_SYSCALL
    ./.tmp.config.ROAP1GT9JN:8267:warning: override: reassigning to symbol NET_VRF
    ./.tmp.config.ROAP1GT9JN:8268:warning: override: reassigning to symbol NET_L3_MASTER_DEV
    ./.tmp.config.ROAP1GT9JN:8270:warning: override: reassigning to symbol IPV6_MULTIPLE_TABLES
    ./.tmp.config.ROAP1GT9JN:8271:warning: override: reassigning to symbol VETH
    ./.tmp.config.ROAP1GT9JN:8275:warning: override: reassigning to symbol BRIDGE
    ./.tmp.config.ROAP1GT9JN:8276:warning: override: reassigning to symbol VLAN_8021Q
    ./.tmp.config.ROAP1GT9JN:8331:warning: override: reassigning to symbol NF_CONNTRACK
    ./.tmp.config.ROAP1GT9JN:8335:warning: override: reassigning to symbol NF_NAT
    ./.tmp.config.ROAP1GT9JN:8343:warning: override: reassigning to symbol NET_SCH_INGRESS
    ./.tmp.config.ROAP1GT9JN:8364:warning: override: reassigning to symbol NET_ACT_GACT
    ./.tmp.config.ROAP1GT9JN:8390:warning: override: reassigning to symbol USER_NS
    ./.tmp.config.ROAP1GT9JN:8394:warning: override: reassigning to symbol NET_NS
    ./.tmp.config.ROAP1GT9JN:8502:warning: override: reassigning to symbol USER_NS
    ./.tmp.config.ROAP1GT9JN:8513:warning: override: reassigning to symbol NOTIFIER_ERROR_INJECTION
    ./.tmp.config.ROAP1GT9JN:8523:warning: override: reassigning to symbol ANDROID
    ./.tmp.config.ROAP1GT9JN:8530:warning: override: reassigning to symbol BPF_SYSCALL
    ./.tmp.config.ROAP1GT9JN:8533:warning: override: reassigning to symbol TEST_BPF
    ./.tmp.config.ROAP1GT9JN:8534:warning: override: reassigning to symbol CGROUP_BPF
    ./.tmp.config.ROAP1GT9JN:8536:warning: override: reassigning to symbol NET_CLS_ACT
    ./.tmp.config.ROAP1GT9JN:8537:warning: override: reassigning to symbol NET_SCHED
    ./.tmp.config.ROAP1GT9JN:8538:warning: override: reassigning to symbol NET_SCH_INGRESS
    ./.tmp.config.ROAP1GT9JN:8540:warning: override: reassigning to symbol IPV6
    ./.tmp.config.ROAP1GT9JN:8549:warning: override: reassigning to symbol NET_CLS_FLOWER
    ./.tmp.config.ROAP1GT9JN:8555:warning: override: reassigning to symbol IPV6_GRE
    ./.tmp.config.ROAP1GT9JN:8575:warning: override: reassigning to symbol SECURITYFS
    ./.tmp.config.ROAP1GT9JN:8579:warning: override: reassigning to symbol STAGING
    ./.tmp.config.ROAP1GT9JN:8580:warning: override: reassigning to symbol ANDROID
    ./.tmp.config.ROAP1GT9JN:8597:warning: override: reassigning to symbol USER_NS

--------------------------------------------------------------------------------
mv78xx0_defconfig (arm, gcc-8) — PASS, 0 errors, 0 warnings, 0 section mismatches

--------------------------------------------------------------------------------
mvebu_v5_defconfig (arm, gcc-8) — PASS, 0 errors, 0 warnings, 0 section mismatches

--------------------------------------------------------------------------------
mvebu_v7_defconfig (arm, gcc-8) — PASS, 0 errors, 0 warnings, 0 section mismatches

--------------------------------------------------------------------------------
mxs_defconfig (arm, gcc-8) — PASS, 0 errors, 0 warnings, 0 section mismatches

--------------------------------------------------------------------------------
neponset_defconfig (arm, gcc-8) — PASS, 0 errors, 0 warnings, 0 section mismatches

Section mismatches:
    WARNING: vmlinux.o(.text.unlikely+0x8c4): Section mismatch in reference from the function free_memmap() to the function .meminit.text:memblock_free()

--------------------------------------------------------------------------------
netwinder_defconfig (arm, gcc-8) — PASS, 0 errors, 0 warnings, 0 section mismatches

--------------------------------------------------------------------------------
nhk8815_defconfig (arm, gcc-8) — PASS, 0 errors, 0 warnings, 0 section mismatches

--------------------------------------------------------------------------------
nlm_xlp_defconfig (mips, gcc-8) — PASS, 0 errors, 2 warnings, 0 section mismatches

Warnings:
    drivers/net/ethernet/intel/e1000e/netdev.c:6405:13: warning: 'e1000e_s0ix_exit_flow' defined but not used [-Wunused-function]
    drivers/net/ethernet/intel/e1000e/netdev.c:6298:13: warning: 'e1000e_s0ix_entry_flow' defined but not used [-Wunused-function]

--------------------------------------------------------------------------------
nlm_xlr_defconfig (mips, gcc-8) — PASS, 0 errors, 4 warnings, 0 section mismatches

Warnings:
    include/linux/kern_levels.h:5:18: warning: format '%lu' expects argument of type 'long unsigned int', but argument 8 has type 'unsigned int' [-Wformat=]
    fs/btrfs/tree-checker.c:230:43: warning: format '%lu' expects argument of type 'long unsigned int', but argument 5 has type 'unsigned int' [-Wformat=]
    drivers/net/ethernet/intel/e1000e/netdev.c:6405:13: warning: 'e1000e_s0ix_exit_flow' defined but not used [-Wunused-function]
    drivers/net/ethernet/intel/e1000e/netdev.c:6298:13: warning: 'e1000e_s0ix_entry_flow' defined but not used [-Wunused-function]

--------------------------------------------------------------------------------
nsimosci_hs_defconfig (arc, gcc-8) — PASS, 0 errors, 2 warnings, 0 section mismatches

Warnings:
    <stdin>:1511:2: warning: #warning syscall clone3 not implemented [-Wcpp]
    <stdin>:1511:2: warning: #warning syscall clone3 not implemented [-Wcpp]

--------------------------------------------------------------------------------
nsimosci_hs_smp_defconfig (arc, gcc-8) — PASS, 0 errors, 2 warnings, 0 section mismatches

Warnings:
    <stdin>:1511:2: warning: #warning syscall clone3 not implemented [-Wcpp]
    <stdin>:1511:2: warning: #warning syscall clone3 not implemented [-Wcpp]

--------------------------------------------------------------------------------
omap1_defconfig (arm, gcc-8) — PASS, 0 errors, 0 warnings, 0 section mismatches

--------------------------------------------------------------------------------
omap2plus_defconfig (arm, gcc-8) — PASS, 0 errors, 0 warnings, 0 section mismatches

--------------------------------------------------------------------------------
omega2p_defconfig (mips, gcc-8) — PASS, 0 errors, 0 warnings, 0 section mismatches

--------------------------------------------------------------------------------
orion5x_defconfig (arm, gcc-8) — PASS, 0 errors, 0 warnings, 0 section mismatches

--------------------------------------------------------------------------------
oxnas_v6_defconfig (arm, gcc-8) — PASS, 0 errors, 0 warnings, 0 section mismatches

--------------------------------------------------------------------------------
palmz72_defconfig (arm, gcc-8) — PASS, 0 errors, 0 warnings, 0 section mismatches

--------------------------------------------------------------------------------
pcm027_defconfig (arm, gcc-8) — PASS, 0 errors, 0 warnings, 0 section mismatches

--------------------------------------------------------------------------------
pic32mzda_defconfig (mips, gcc-8) — PASS, 0 errors, 0 warnings, 0 section mismatches

--------------------------------------------------------------------------------
pistachio_defconfig (mips, gcc-8) — PASS, 0 errors, 0 warnings, 0 section mismatches

--------------------------------------------------------------------------------
pleb_defconfig (arm, gcc-8) — PASS, 0 errors, 0 warnings, 0 section mismatches

Section mismatches:
    WARNING: vmlinux.o(.text.unlikely+0x840): Section mismatch in reference from the function free_memmap() to the function .meminit.text:memblock_free()

--------------------------------------------------------------------------------
pnx8335_stb225_defconfig (mips, gcc-8) — PASS, 0 errors, 0 warnings, 0 section mismatches

--------------------------------------------------------------------------------
prima2_defconfig (arm, gcc-8) — PASS, 0 errors, 0 warnings, 0 section mismatches

--------------------------------------------------------------------------------
pxa168_defconfig (arm, gcc-8) — PASS, 0 errors, 0 warnings, 0 section mismatches

--------------------------------------------------------------------------------
pxa255-idp_defconfig (arm, gcc-8) — PASS, 0 errors, 0 warnings, 0 section mismatches

--------------------------------------------------------------------------------
pxa3xx_defconfig (arm, gcc-8) — PASS, 0 errors, 0 warnings, 0 section mismatches

--------------------------------------------------------------------------------
pxa910_defconfig (arm, gcc-8) — PASS, 0 errors, 0 warnings, 0 section mismatches

--------------------------------------------------------------------------------
pxa_defconfig (arm, gcc-8) — PASS, 0 errors, 0 warnings, 0 section mismatches

--------------------------------------------------------------------------------
qcom_defconfig (arm, gcc-8) — PASS, 0 errors, 0 warnings, 0 section mismatches

--------------------------------------------------------------------------------
qi_lb60_defconfig (mips, gcc-8) — PASS, 0 errors, 0 warnings, 0 section mismatches

--------------------------------------------------------------------------------
rb532_defconfig (mips, gcc-8) — PASS, 0 errors, 0 warnings, 0 section mismatches

--------------------------------------------------------------------------------
rbtx49xx_defconfig (mips, gcc-8) — PASS, 0 errors, 1 warning, 0 section mismatches

Warnings:
    sound/soc/txx9/txx9aclc.c:54:30: warning: unused variable 'rtd' [-Wunused-variable]

--------------------------------------------------------------------------------
realview_defconfig (arm, gcc-8) — PASS, 0 errors, 0 warnings, 0 section mismatches

--------------------------------------------------------------------------------
rm200_defconfig (mips, gcc-8) — PASS, 0 errors, 0 warnings, 0 section mismatches

--------------------------------------------------------------------------------
rpc_defconfig (arm, gcc-8) — PASS, 0 errors, 0 warnings, 0 section mismatches

Section mismatches:
    WARNING: vmlinux.o(.text.unlikely+0x8e4): Section mismatch in reference from the function free_memmap() to the function .meminit.text:memblock_free()

--------------------------------------------------------------------------------
rt305x_defconfig (mips, gcc-8) — PASS, 0 errors, 0 warnings, 0 section mismatches

--------------------------------------------------------------------------------
rv32_defconfig (riscv, gcc-8) — PASS, 0 errors, 8 warnings, 0 section mismatches

Warnings:
    <stdin>:830:2: warning: #warning syscall fstat64 not implemented [-Wcpp]
    <stdin>:1127:2: warning: #warning syscall fstatat64 not implemented [-Wcpp]
    <stdin>:1511:2: warning: #warning syscall clone3 not implemented [-Wcpp]
    drivers/net/ethernet/intel/e1000e/netdev.c:6405:13: warning: 'e1000e_s0ix_exit_flow' defined but not used [-Wunused-function]
    drivers/net/ethernet/intel/e1000e/netdev.c:6298:13: warning: 'e1000e_s0ix_entry_flow' defined but not used [-Wunused-function]
    <stdin>:830:2: warning: #warning syscall fstat64 not implemented [-Wcpp]
    <stdin>:1127:2: warning: #warning syscall fstatat64 not implemented [-Wcpp]
    <stdin>:1511:2: warning: #warning syscall clone3 not implemented [-Wcpp]

--------------------------------------------------------------------------------
s3c2410_defconfig (arm, gcc-8) — PASS, 0 errors, 1 warning, 0 section mismatches

Warnings:
    sound/soc/soc-pcm.c:1185:8: warning: unused variable 'name' [-Wunused-variable]

--------------------------------------------------------------------------------
s3c6400_defconfig (arm, gcc-8) — PASS, 0 errors, 1 warning, 0 section mismatches

Warnings:
    sound/soc/soc-pcm.c:1185:8: warning: unused variable 'name' [-Wunused-variable]

--------------------------------------------------------------------------------
s5pv210_defconfig (arm, gcc-8) — PASS, 0 errors, 0 warnings, 0 section mismatches

--------------------------------------------------------------------------------
sama5_defconfig (arm, gcc-8) — PASS, 0 errors, 0 warnings, 0 section mismatches

--------------------------------------------------------------------------------
sb1250_swarm_defconfig (mips, gcc-8) — PASS, 0 errors, 0 warnings, 0 section mismatches

--------------------------------------------------------------------------------
shannon_defconfig (arm, gcc-8) — PASS, 0 errors, 0 warnings, 0 section mismatches

Section mismatches:
    WARNING: vmlinux.o(.text.unlikely+0x8c4): Section mismatch in reference from the function free_memmap() to the function .meminit.text:memblock_free()

--------------------------------------------------------------------------------
shmobile_defconfig (arm, gcc-8) — PASS, 0 errors, 0 warnings, 0 section mismatches

--------------------------------------------------------------------------------
simpad_defconfig (arm, gcc-8) — PASS, 0 errors, 0 warnings, 0 section mismatches

Section mismatches:
    WARNING: vmlinux.o(.text.unlikely+0x84c): Section mismatch in reference from the function free_memmap() to the function .meminit.text:memblock_free()

--------------------------------------------------------------------------------
socfpga_defconfig (arm, gcc-8) — PASS, 0 errors, 0 warnings, 0 section mismatches

--------------------------------------------------------------------------------
spear13xx_defconfig (arm, gcc-8) — PASS, 0 errors, 0 warnings, 0 section mismatches

--------------------------------------------------------------------------------
spear3xx_defconfig (arm, gcc-8) — PASS, 0 errors, 0 warnings, 0 section mismatches

--------------------------------------------------------------------------------
spear6xx_defconfig (arm, gcc-8) — PASS, 0 errors, 0 warnings, 0 section mismatches

--------------------------------------------------------------------------------
spitz_defconfig (arm, gcc-8) — PASS, 0 errors, 0 warnings, 0 section mismatches

--------------------------------------------------------------------------------
stm32_defconfig (arm, gcc-8) — PASS, 0 errors, 0 warnings, 0 section mismatches

--------------------------------------------------------------------------------
sunxi_defconfig (arm, gcc-8) — PASS, 0 errors, 0 warnings, 0 section mismatches

--------------------------------------------------------------------------------
tango4_defconfig (arm, gcc-8) — PASS, 0 errors, 0 warnings, 0 section mismatches

--------------------------------------------------------------------------------
tb0219_defconfig (mips, gcc-8) — PASS, 0 errors, 0 warnings, 0 section mismatches

--------------------------------------------------------------------------------
tb0226_defconfig (mips, gcc-8) — PASS, 0 errors, 0 warnings, 0 section mismatches

--------------------------------------------------------------------------------
tb0287_defconfig (mips, gcc-8) — PASS, 0 errors, 0 warnings, 0 section mismatches

--------------------------------------------------------------------------------
tct_hammer_defconfig (arm, gcc-8) — PASS, 0 errors, 0 warnings, 0 section mismatches

--------------------------------------------------------------------------------
tegra_defconfig (arm, gcc-8) — PASS, 0 errors, 0 warnings, 0 section mismatches

--------------------------------------------------------------------------------
tinyconfig (i386, gcc-8) — PASS, 0 errors, 0 warnings, 0 section mismatches

--------------------------------------------------------------------------------
tinyconfig (arm64, gcc-8) — PASS, 0 errors, 0 warnings, 0 section mismatches

--------------------------------------------------------------------------------
tinyconfig (x86_64, gcc-8) — PASS, 0 errors, 1 warning, 0 section mismatches

Warnings:
    .config:1165:warning: override: UNWINDER_GUESS changes choice state

--------------------------------------------------------------------------------
tinyconfig (arm, gcc-8) — PASS, 0 errors, 0 warnings, 0 section mismatches

--------------------------------------------------------------------------------
tinyconfig (mips, gcc-8) — PASS, 0 errors, 0 warnings, 0 section mismatches

--------------------------------------------------------------------------------
tinyconfig (riscv, gcc-8) — PASS, 0 errors, 0 warnings, 0 section mismatches

--------------------------------------------------------------------------------
tinyconfig (arc, gcc-8) — PASS, 0 errors, 1 warning, 0 section mismatches

Warnings:
    <stdin>:1511:2: warning: #warning syscall clone3 not implemented [-Wcpp]

--------------------------------------------------------------------------------
trizeps4_defconfig (arm, gcc-8) — PASS, 0 errors, 0 warnings, 0 section mismatches

--------------------------------------------------------------------------------
u300_defconfig (arm, gcc-8) — PASS, 0 errors, 0 warnings, 0 section mismatches

--------------------------------------------------------------------------------
u8500_defconfig (arm, gcc-8) — PASS, 0 errors, 0 warnings, 0 section mismatches

--------------------------------------------------------------------------------
vdk_hs38_defconfig (arc, gcc-8) — PASS, 0 errors, 1 warning, 0 section mismatches

Warnings:
    <stdin>:1511:2: warning: #warning syscall clone3 not implemented [-Wcpp]

--------------------------------------------------------------------------------
vdk_hs38_smp_defconfig (arc, gcc-8) — PASS, 0 errors, 1 warning, 0 section mismatches

Warnings:
    <stdin>:1511:2: warning: #warning syscall clone3 not implemented [-Wcpp]

--------------------------------------------------------------------------------
versatile_defconfig (arm, gcc-8) — PASS, 0 errors, 0 warnings, 0 section mismatches

--------------------------------------------------------------------------------
vexpress_defconfig (arm, gcc-8) — PASS, 0 errors, 0 warnings, 0 section mismatches

--------------------------------------------------------------------------------
vf610m4_defconfig (arm, gcc-8) — PASS, 0 errors, 0 warnings, 0 section mismatches

--------------------------------------------------------------------------------
viper_defconfig (arm, gcc-8) — PASS, 0 errors, 0 warnings, 0 section mismatches

--------------------------------------------------------------------------------
vocore2_defconfig (mips, gcc-8) — PASS, 0 errors, 0 warnings, 0 section mismatches

--------------------------------------------------------------------------------
vt8500_v6_v7_defconfig (arm, gcc-8) — PASS, 0 errors, 0 warnings, 0 section mismatches

--------------------------------------------------------------------------------
workpad_defconfig (mips, gcc-8) — PASS, 0 errors, 0 warnings, 0 section mismatches

--------------------------------------------------------------------------------
x86_64_defconfig (x86_64, gcc-8) — PASS, 0 errors, 0 warnings, 0 section mismatches

--------------------------------------------------------------------------------
x86_64_defconfig+kselftest (x86_64, gcc-8) — PASS, 0 errors, 29 warnings, 0 section mismatches

Warnings:
    ./.tmp.config.EhvFnj8w1Q:4567:warning: override: reassigning to symbol BPF_SYSCALL
    ./.tmp.config.EhvFnj8w1Q:4570:warning: override: reassigning to symbol NET_VRF
    ./.tmp.config.EhvFnj8w1Q:4571:warning: override: reassigning to symbol NET_L3_MASTER_DEV
    ./.tmp.config.EhvFnj8w1Q:4573:warning: override: reassigning to symbol IPV6_MULTIPLE_TABLES
    ./.tmp.config.EhvFnj8w1Q:4574:warning: override: reassigning to symbol VETH
    ./.tmp.config.EhvFnj8w1Q:4578:warning: override: reassigning to symbol BRIDGE
    ./.tmp.config.EhvFnj8w1Q:4579:warning: override: reassigning to symbol VLAN_8021Q
    ./.tmp.config.EhvFnj8w1Q:4634:warning: override: reassigning to symbol NF_CONNTRACK
    ./.tmp.config.EhvFnj8w1Q:4638:warning: override: reassigning to symbol NF_NAT
    ./.tmp.config.EhvFnj8w1Q:4646:warning: override: reassigning to symbol NET_SCH_INGRESS
    ./.tmp.config.EhvFnj8w1Q:4667:warning: override: reassigning to symbol NET_ACT_GACT
    ./.tmp.config.EhvFnj8w1Q:4693:warning: override: reassigning to symbol USER_NS
    ./.tmp.config.EhvFnj8w1Q:4697:warning: override: reassigning to symbol NET_NS
    ./.tmp.config.EhvFnj8w1Q:4805:warning: override: reassigning to symbol USER_NS
    ./.tmp.config.EhvFnj8w1Q:4816:warning: override: reassigning to symbol NOTIFIER_ERROR_INJECTION
    ./.tmp.config.EhvFnj8w1Q:4826:warning: override: reassigning to symbol ANDROID
    ./.tmp.config.EhvFnj8w1Q:4833:warning: override: reassigning to symbol BPF_SYSCALL
    ./.tmp.config.EhvFnj8w1Q:4836:warning: override: reassigning to symbol TEST_BPF
    ./.tmp.config.EhvFnj8w1Q:4837:warning: override: reassigning to symbol CGROUP_BPF
    ./.tmp.config.EhvFnj8w1Q:4839:warning: override: reassigning to symbol NET_CLS_ACT
    ./.tmp.config.EhvFnj8w1Q:4840:warning: override: reassigning to symbol NET_SCHED
    ./.tmp.config.EhvFnj8w1Q:4841:warning: override: reassigning to symbol NET_SCH_INGRESS
    ./.tmp.config.EhvFnj8w1Q:4843:warning: override: reassigning to symbol IPV6
    ./.tmp.config.EhvFnj8w1Q:4852:warning: override: reassigning to symbol NET_CLS_FLOWER
    ./.tmp.config.EhvFnj8w1Q:4858:warning: override: reassigning to symbol IPV6_GRE
    ./.tmp.config.EhvFnj8w1Q:4878:warning: override: reassigning to symbol SECURITYFS
    ./.tmp.config.EhvFnj8w1Q:4882:warning: override: reassigning to symbol STAGING
    ./.tmp.config.EhvFnj8w1Q:4883:warning: override: reassigning to symbol ANDROID
    ./.tmp.config.EhvFnj8w1Q:4900:warning: override: reassigning to symbol USER_NS

--------------------------------------------------------------------------------
x86_64_defconfig+kvm_guest (x86_64, gcc-8) — PASS, 0 errors, 0 warnings, 0 section mismatches

--------------------------------------------------------------------------------
xcep_defconfig (arm, gcc-8) — PASS, 0 errors, 0 warnings, 0 section mismatches

--------------------------------------------------------------------------------
xway_defconfig (mips, gcc-8) — PASS, 0 errors, 0 warnings, 0 section mismatches

--------------------------------------------------------------------------------
zeus_defconfig (arm, gcc-8) — PASS, 0 errors, 1 warning, 0 section mismatches

Warnings:
    sound/soc/soc-pcm.c:1185:8: warning: unused variable 'name' [-Wunused-variable]

--------------------------------------------------------------------------------
zx_defconfig (arm, gcc-8) — PASS, 0 errors, 0 warnings, 0 section mismatches

---
For more info write to <info@kernelci.org>

^ permalink raw reply	[flat|nested] only message in thread

only message in thread, back to index

Thread overview: (only message) (download: mbox.gz / follow: Atom feed)
-- links below jump to the message on this page --
2019-10-31  9:03 next/master build: 216 builds: 4 failed, 212 passed, 19 errors, 277 warnings (next-20191031) kernelci.org bot

Linux-Next Archive on lore.kernel.org

Archives are clonable:
	git clone --mirror https://lore.kernel.org/linux-next/0 linux-next/git/0.git

	# If you have public-inbox 1.1+ installed, you may
	# initialize and index your mirror using the following commands:
	public-inbox-init -V2 linux-next linux-next/ https://lore.kernel.org/linux-next \
		linux-next@vger.kernel.org
	public-inbox-index linux-next

Example config snippet for mirrors

Newsgroup available over NNTP:
	nntp://nntp.lore.kernel.org/org.kernel.vger.linux-next


AGPL code for this site: git clone https://public-inbox.org/public-inbox.git