Linux-Next Archive on lore.kernel.org
 help / color / Atom feed
From: "kernelci.org bot" <bot@kernelci.org>
To: linux-next@vger.kernel.org
Subject: next/master build: 227 builds: 17 failed, 210 passed, 41 errors, 497 warnings (next-20200326)
Date: Thu, 26 Mar 2020 06:43:17 -0700 (PDT)
Message-ID: <5e7cb175.1c69fb81.1c299.68fe@mx.google.com> (raw)

next/master build: 227 builds: 17 failed, 210 passed, 41 errors, 497 warnings (next-20200326)

Full Build Summary: https://kernelci.org/build/next/branch/master/kernel/next-20200326/

Tree: next
Branch: master
Git Describe: next-20200326
Git Commit: 89295c59c1f063b533d071ca49d0fa0c0783ca6f
Git URL: https://git.kernel.org/pub/scm/linux/kernel/git/next/linux-next.git
Built: 7 unique architectures

Build Failures Detected:

arm64:
    allmodconfig: (clang-9) FAIL
    allmodconfig: (gcc-8) FAIL

arm:
    allmodconfig: (clang-9) FAIL
    allmodconfig: (gcc-8) FAIL
    cm_x300_defconfig: (gcc-8) FAIL
    em_x270_defconfig: (gcc-8) FAIL
    eseries_pxa_defconfig: (gcc-8) FAIL
    mmp2_defconfig: (gcc-8) FAIL
    pxa168_defconfig: (gcc-8) FAIL
    pxa910_defconfig: (gcc-8) FAIL
    pxa_defconfig: (gcc-8) FAIL
    qcom_defconfig: (gcc-8) FAIL
    vf610m4_defconfig: (gcc-8) FAIL

mips:
    mtx1_defconfig: (gcc-8) FAIL

riscv:
    allnoconfig: (gcc-8) FAIL
    tinyconfig: (gcc-8) FAIL

x86_64:
    defconfig: (clang-9) FAIL

Errors and Warnings Detected:

arc:

arm64:
    allmodconfig (gcc-8): 2 errors
    allmodconfig (clang-9): 2 errors
    defconfig (gcc-8): 29 warnings
    defconfig (clang-9): 29 warnings
    defconfig (gcc-8): 29 warnings
    defconfig (gcc-8): 29 warnings
    defconfig (gcc-8): 29 warnings

arm:
    allmodconfig (gcc-8): 2 errors, 18 warnings
    allmodconfig (clang-9): 2 errors, 21 warnings
    aspeed_g4_defconfig (gcc-8): 4 warnings
    aspeed_g5_defconfig (clang-9): 4 warnings
    aspeed_g5_defconfig (gcc-8): 4 warnings
    bcm2835_defconfig (gcc-8): 14 warnings
    cm_x300_defconfig (gcc-8): 1 error, 2 warnings
    em_x270_defconfig (gcc-8): 1 error, 2 warnings
    eseries_pxa_defconfig (gcc-8): 14 errors, 12 warnings
    integrator_defconfig (gcc-8): 1 warning
    mmp2_defconfig (gcc-8): 1 error
    multi_v4t_defconfig (gcc-8): 1 warning
    multi_v5_defconfig (gcc-8): 4 warnings
    multi_v5_defconfig (clang-9): 4 warnings
    multi_v7_defconfig (gcc-8): 18 warnings
    multi_v7_defconfig (clang-9): 20 warnings
    multi_v7_defconfig (gcc-8): 18 warnings
    multi_v7_defconfig (gcc-8): 18 warnings
    multi_v7_defconfig (gcc-8): 18 warnings
    multi_v7_defconfig (gcc-8): 19 warnings
    pxa168_defconfig (gcc-8): 1 error
    pxa910_defconfig (gcc-8): 1 error
    pxa_defconfig (gcc-8): 3 errors, 6 warnings
    qcom_defconfig (gcc-8): 1 error
    vf610m4_defconfig (gcc-8): 4 errors, 5 warnings

i386:

mips:
    32r2el_defconfig (gcc-8): 3 warnings
    32r2el_defconfig (gcc-8): 3 warnings
    allnoconfig (gcc-8): 1 warning
    ar7_defconfig (gcc-8): 2 warnings
    ath25_defconfig (gcc-8): 2 warnings
    ath79_defconfig (gcc-8): 2 warnings
    bcm47xx_defconfig (gcc-8): 2 warnings
    bcm63xx_defconfig (gcc-8): 1 warning
    bigsur_defconfig (gcc-8): 2 warnings
    bmips_be_defconfig (gcc-8): 1 warning
    bmips_stb_defconfig (gcc-8): 1 warning
    capcella_defconfig (gcc-8): 2 warnings
    cavium_octeon_defconfig (gcc-8): 2 warnings
    ci20_defconfig (gcc-8): 3 warnings
    cobalt_defconfig (gcc-8): 2 warnings
    cu1000-neo_defconfig (gcc-8): 1 warning
    db1xxx_defconfig (gcc-8): 1 warning
    decstation_64_defconfig (gcc-8): 2 warnings
    decstation_defconfig (gcc-8): 2 warnings
    decstation_r4k_defconfig (gcc-8): 2 warnings
    e55_defconfig (gcc-8): 2 warnings
    fuloong2e_defconfig (gcc-8): 2 warnings
    gcw0_defconfig (gcc-8): 1 warning
    gpr_defconfig (gcc-8): 2 warnings
    ip22_defconfig (gcc-8): 2 warnings
    ip27_defconfig (gcc-8): 2 warnings
    ip28_defconfig (gcc-8): 2 warnings
    ip32_defconfig (gcc-8): 2 warnings
    jazz_defconfig (gcc-8): 2 warnings
    jmr3927_defconfig (gcc-8): 1 warning
    lasat_defconfig (gcc-8): 1 warning
    lemote2f_defconfig (gcc-8): 2 warnings
    loongson1b_defconfig (gcc-8): 2 warnings
    loongson1c_defconfig (gcc-8): 2 warnings
    loongson3_defconfig (gcc-8): 2 warnings
    malta_defconfig (gcc-8): 2 warnings
    malta_kvm_defconfig (gcc-8): 2 warnings
    malta_kvm_guest_defconfig (gcc-8): 2 warnings
    malta_qemu_32r6_defconfig (gcc-8): 3 warnings
    maltaaprp_defconfig (gcc-8): 2 warnings
    maltasmvp_defconfig (gcc-8): 2 warnings
    maltasmvp_eva_defconfig (gcc-8): 2 warnings
    maltaup_defconfig (gcc-8): 2 warnings
    maltaup_xpa_defconfig (gcc-8): 2 warnings
    markeins_defconfig (gcc-8): 2 warnings
    mips_paravirt_defconfig (gcc-8): 2 warnings
    mpc30x_defconfig (gcc-8): 2 warnings
    msp71xx_defconfig (gcc-8): 2 warnings
    mtx1_defconfig (gcc-8): 2 errors, 1 warning
    nlm_xlp_defconfig (gcc-8): 2 warnings
    nlm_xlr_defconfig (gcc-8): 2 warnings
    omega2p_defconfig (gcc-8): 1 warning
    pic32mzda_defconfig (gcc-8): 2 warnings
    pistachio_defconfig (gcc-8): 2 warnings
    pnx8335_stb225_defconfig (gcc-8): 2 warnings
    qi_lb60_defconfig (gcc-8): 2 warnings
    rb532_defconfig (gcc-8): 2 warnings
    rbtx49xx_defconfig (gcc-8): 2 warnings
    rm200_defconfig (gcc-8): 3 warnings
    rt305x_defconfig (gcc-8): 2 warnings
    sb1250_swarm_defconfig (gcc-8): 2 warnings
    tb0219_defconfig (gcc-8): 2 warnings
    tb0226_defconfig (gcc-8): 2 warnings
    tb0287_defconfig (gcc-8): 2 warnings
    tinyconfig (gcc-8): 1 warning
    vocore2_defconfig (gcc-8): 1 warning
    workpad_defconfig (gcc-8): 2 warnings
    xway_defconfig (gcc-8): 2 warnings

riscv:
    allnoconfig (gcc-8): 1 error
    rv32_defconfig (gcc-8): 6 warnings
    tinyconfig (gcc-8): 1 error

x86_64:
    allmodconfig (clang-9): 4 warnings
    defconfig (clang-9): 2 errors
    tinyconfig (gcc-8): 1 warning

Errors summary:

    4    ERROR: modpost: "mtk_mmsys_ddp_disconnect" [drivers/gpu/drm/mediatek/mediatek-drm.ko] undefined!
    4    ERROR: modpost: "mtk_mmsys_ddp_connect" [drivers/gpu/drm/mediatek/mediatek-drm.ko] undefined!
    3    ERROR: modpost: "snd_ac97_reset" [sound/soc/codecs/snd-soc-wm9712.ko] undefined!
    2    arch/riscv/kernel/stacktrace.c:78:8: error: ‘sp_in_global’ undeclared (first use in this function); did you mean ‘spin_lock’?
    2    /home/buildslave/workspace/kernel-build@2/linux/build/../drivers/clk/mmp/clk.c:192: undefined reference to `mmp_clk_register_pll'
    1    sound/soc/codecs/wm9712.c:94:3: error: ‘const struct regmap_config’ has no member named ‘num_reg_defaults’
    1    sound/soc/codecs/wm9712.c:93:3: error: ‘const struct regmap_config’ has no member named ‘reg_defaults’
    1    sound/soc/codecs/wm9712.c:91:3: error: ‘const struct regmap_config’ has no member named ‘volatile_reg’
    1    sound/soc/codecs/wm9712.c:89:3: error: ‘const struct regmap_config’ has no member named ‘cache_type’
    1    sound/soc/codecs/wm9712.c:88:3: error: ‘const struct regmap_config’ has no member named ‘max_register’
    1    sound/soc/codecs/wm9712.c:87:3: error: ‘const struct regmap_config’ has no member named ‘val_bits’
    1    sound/soc/codecs/wm9712.c:86:3: error: ‘const struct regmap_config’ has no member named ‘reg_stride’
    1    sound/soc/codecs/wm9712.c:85:3: error: ‘const struct regmap_config’ has no member named ‘reg_bits’
    1    sound/soc/codecs/wm9712.c:84:35: error: storage size of ‘wm9712_regmap_config’ isn’t known
    1    sound/soc/codecs/wm9712.c:84:21: error: variable ‘wm9712_regmap_config’ has initializer but incomplete type
    1    sound/soc/codecs/wm9712.c:80:10: error: implicit declaration of function ‘regmap_ac97_default_volatile’ [-Werror=implicit-function-declaration]
    1    sound/soc/codecs/wm9712.c:675:3: error: implicit declaration of function ‘snd_soc_component_exit_regmap’; did you mean ‘snd_soc_component_trigger’? [-Werror=implicit-function-declaration]
    1    sound/soc/codecs/wm9712.c:662:2: error: implicit declaration of function ‘snd_soc_component_init_regmap’; did you mean ‘snd_soc_component_trigger’? [-Werror=implicit-function-declaration]
    1    sound/soc/codecs/wm9712.c:653:12: error: implicit declaration of function ‘regmap_init_ac97’; did you mean ‘memmap_init_zone’? [-Werror=implicit-function-declaration]
    1    drivers/clocksource/timer-vf-pit.c:194: error: unterminated argument list invoking macro "BUG_ON"
    1    drivers/clocksource/timer-vf-pit.c:131:8: error: expected ‘;’ at end of input
    1    drivers/clocksource/timer-vf-pit.c:131:2: error: ‘BUG_ON’ undeclared (first use in this function)
    1    drivers/clocksource/timer-vf-pit.c:131:2: error: expected declaration or statement at end of input
    1    clang: error: assembler command failed with exit code 1 (use -v to see invocation)
    1    ERROR: modpost: "sysrq_toggle_support" [drivers/tty/serial/serial_core.ko] undefined!
    1    ERROR: modpost: "sysrq_mask" [drivers/tty/serial/serial_core.ko] undefined!
    1    ERROR: modpost: "snd_ac97_reset" [sound/soc/codecs/snd-soc-wm9713.ko] undefined!
    1    ERROR: modpost: "snd_ac97_reset" [sound/soc/codecs/snd-soc-wm9705.ko] undefined!
    1    ERROR: modpost: "rd_full" [drivers/gpu/drm/msm/msm.ko] undefined!
    1    /tmp/cpudeadline-9c7247.s:76: Error: `%ecx' not allowed with `orb'
    1    /home/buildslave/workspace/workspace/kernel-build@3/linux/build/../drivers/clk/mmp/clk.c:192: undefined reference to `mmp_clk_register_pll'

Warnings summary:

    125  <stdin>:1520:2: warning: #warning syscall process_madvise not implemented [-Wcpp]
    98   arch/arm/boot/dts/bcm2835-rpi.dtsi:18.4-15: Warning (dma_ranges_format): /soc/firmware:dma-ranges: empty "dma-ranges" property but its #address-cells (2) differs from /soc (1)
    80   arch/arm64/boot/dts/allwinner/sun50i-a64.dtsi:1086.4-52: Warning (dma_ranges_format): /soc/dram-controller@1c62000:dma-ranges: "dma-ranges" property has invalid length (12 bytes) (parent #address-cells == 1, child #address-cells == 2, #size-cells == 1)
    25   scripts/dtc/include-prefixes/arm/bcm2835-rpi.dtsi:18.4-15: Warning (dma_ranges_format): /soc/firmware:dma-ranges: empty "dma-ranges" property but its #address-cells (2) differs from /soc (1)
    15   arch/arm64/boot/dts/broadcom/stingray/stingray-usb.dtsi:7.3-14: Warning (dma_ranges_format): /usb:dma-ranges: empty "dma-ranges" property but its #size-cells (1) differs from / (2)
    15   arch/arm64/boot/dts/broadcom/stingray/stingray-usb.dtsi:7.3-14: Warning (dma_ranges_format): /usb:dma-ranges: empty "dma-ranges" property but its #address-cells (1) differs from / (2)
    11   arch/arm/boot/dts/aspeed-bmc-facebook-tiogapass.dts:523.3-30: Warning (i2c_bus_reg): /ahb/apb/bus@1e78a000/i2c-bus@380/ipmb0@10:reg: I2C address must be less than 10-bits, got "0x40000010"
    11   arch/arm/boot/dts/aspeed-bmc-facebook-tiogapass.dts:521.11-525.4: Warning (i2c_bus_reg): /ahb/apb/bus@1e78a000/i2c-bus@380/ipmb0@10: I2C bus unit address format error, expected "40000010"
    11   arch/arm/boot/dts/aspeed-bmc-facebook-tiogapass.dts:437.3-30: Warning (i2c_bus_reg): /ahb/apb/bus@1e78a000/i2c-bus@140/ipmb0@10:reg: I2C address must be less than 10-bits, got "0x40000010"
    11   arch/arm/boot/dts/aspeed-bmc-facebook-tiogapass.dts:435.11-439.4: Warning (i2c_bus_reg): /ahb/apb/bus@1e78a000/i2c-bus@140/ipmb0@10: I2C bus unit address format error, expected "40000010"
    9    drivers/net/phy/mdio-cavium.h:113:48: warning: cast to pointer from integer of different size [-Wint-to-pointer-cast]
    8    WARNING: unmet direct dependencies detected for SND_SOC_WM9712
    8    1 warning generated.
    5    arch/arm64/boot/dts/qcom/ipq6018.dtsi:127.3-14: Warning (dma_ranges_format): /soc:dma-ranges: empty "dma-ranges" property but its #size-cells (1) differs from / (2)
    5    arch/arm64/boot/dts/qcom/ipq6018.dtsi:127.3-14: Warning (dma_ranges_format): /soc:dma-ranges: empty "dma-ranges" property but its #address-cells (1) differs from / (2)
    4    drivers/net/phy/mdio-cavium.h:114:37: warning: cast to pointer from integer of different size [-Wint-to-pointer-cast]
    2    arch/arm/lib/xor-neon.c:30:2: warning: This code requires at least version 4.6 of GCC [-W#warnings]
    2    arch/arm/boot/dts/integratorap.dts:12.2-43: Warning (dma_ranges_format): /:dma-ranges: Root node has a "dma-ranges" property
    2    WARNING: unmet direct dependencies detected for SND_SOC_WM9713
    2    WARNING: unmet direct dependencies detected for SND_SOC_WM9705
    2    <stdin>:830:2: warning: #warning syscall fstat64 not implemented [-Wcpp]
    2    <stdin>:1511:2: warning: #warning syscall clone3 not implemented [-Wcpp]
    2    <stdin>:1127:2: warning: #warning syscall fstatat64 not implemented [-Wcpp]
    2    #warning This code requires at least version 4.6 of GCC
    1    {standard input}:141: Warning: macro instruction expanded into multiple instructions
    1    sound/soc/codecs/wm9712.c:93:18: warning: excess elements in struct initializer
    1    sound/soc/codecs/wm9712.c:91:18: warning: excess elements in struct initializer
    1    sound/soc/codecs/wm9712.c:89:16: warning: excess elements in struct initializer
    1    sound/soc/codecs/wm9712.c:88:18: warning: excess elements in struct initializer
    1    sound/soc/codecs/wm9712.c:87:14: warning: excess elements in struct initializer
    1    sound/soc/codecs/wm9712.c:86:16: warning: excess elements in struct initializer
    1    sound/soc/codecs/wm9712.c:85:14: warning: excess elements in struct initializer
    1    sound/soc/codecs/wm9712.c:653:10: warning: assignment to ‘struct regmap *’ from ‘int’ makes pointer from integer without a cast [-Wint-conversion]
    1    sound/soc/codecs/cros_ec_codec.c:776:12: warning: stack frame size of 1152 bytes in function 'wov_hotword_model_put' [-Wframe-larger-than=]
    1    security/integrity/ima/ima_crypto.c:512:5: warning: stack frame size of 1152 bytes in function 'ima_calc_field_array_hash' [-Wframe-larger-than=]
    1    net/sched/cls_flower.c:331:1: warning: the frame size of 1032 bytes is larger than 1024 bytes [-Wframe-larger-than=]
    1    mm/kasan/common.o: warning: objtool: kasan_report()+0x87: call to __stack_chk_fail() with UACCESS enabled
    1    include/linux/kernel.h:47:25: warning: excess elements in struct initializer
    1    include/linux/kern_levels.h:5:18: warning: format ‘%lu’ expects argument of type ‘long unsigned int’, but argument 2 has type ‘unsigned int’ [-Wformat=]
    1    drivers/soc/fsl/dpio/qbman-portal.c:870:14: warning: cast from pointer to integer of different size [-Wpointer-to-int-cast]
    1    drivers/soc/fsl/dpio/dpio-service.c:476:5: warning: stack frame size of 1072 bytes in function 'dpaa2_io_service_enqueue_multiple_desc_fq' [-Wframe-larger-than=]
    1    drivers/scsi/bfa/bfa_fcs_lport.c:1900:1: warning: stack frame size of 1824 bytes in function 'bfa_fcs_lport_fdmi_build_rhba_pyld' [-Wframe-larger-than=]
    1    drivers/net/phy/mdio-octeon.c:48:3: warning: cast from pointer to integer of different size [-Wpointer-to-int-cast]
    1    drivers/gpu/drm/amd/amdgpu/../display/dc/calcs/dce_calcs.c:77:13: warning: stack frame size of 5648 bytes in function 'calculate_bandwidth' [-Wframe-larger-than=]
    1    drivers/gpu/drm/amd/amdgpu/../display/dc/calcs/dce_calcs.c:3014:6: warning: stack frame size of 1376 bytes in function 'bw_calcs' [-Wframe-larger-than=]
    1    drivers/firmware/efi/libstub/file.c:123:21: warning: stack frame size of 1232 bytes in function 'handle_cmdline_files' [-Wframe-larger-than=]
    1    drivers/crypto/inside-secure/safexcel_cipher.c:404:12: warning: stack frame size of 1136 bytes in function 'safexcel_aead_setkey' [-Wframe-larger-than=]
    1    drivers/clocksource/timer-vf-pit.c:97:20: warning: ‘pit_timer_interrupt’ defined but not used [-Wunused-function]
    1    drivers/clocksource/timer-vf-pit.c:56:19: warning: ‘pit_clocksource_init’ defined but not used [-Wunused-function]
    1    drivers/clocksource/timer-vf-pit.c:131:2: warning: no return statement in function returning non-void [-Wreturn-type]
    1    drivers/clocksource/timer-vf-pit.c:126:19: warning: ‘pit_clockevent_init’ defined but not used [-Wunused-function]
    1    drivers/clocksource/timer-vf-pit.c:117:34: warning: ‘clockevent_pit’ defined but not used [-Wunused-variable]
    1    drivers/block/paride/bpck.c:32: warning: "PC" redefined
    1    cc1: some warnings being treated as errors
    1    arch/x86/kernel/signal.o: warning: objtool: x32_setup_rt_frame()+0x1fa: call to memset() with UACCESS enabled
    1    arch/x86/kernel/signal.o: warning: objtool: __setup_rt_frame()+0x1f8: call to memset() with UACCESS enabled
    1    arch/x86/ia32/ia32_signal.o: warning: objtool: ia32_setup_rt_frame()+0x1ef: call to memset() with UACCESS enabled
    1    arch/mips/configs/ci20_defconfig:178:warning: override: reassigning to symbol LEDS_TRIGGER_ONESHOT
    1    2 warnings generated.
    1    /tmp/test-arm-e023be.s:18788: Warning: using r15 results in unpredictable behaviour
    1    /tmp/test-arm-e023be.s:18713: Warning: using r15 results in unpredictable behaviour
    1    /tmp/ccbU4HdL.s:18191: Warning: using r15 results in unpredictable behaviour
    1    /tmp/ccbU4HdL.s:18119: Warning: using r15 results in unpredictable behaviour
    1    .config:1161:warning: override: UNWINDER_GUESS changes choice state

Section mismatches summary:

    1    WARNING: modpost: vmlinux.o(.text.unlikely+0x39dc): Section mismatch in reference from the function pmax_setup_memory_region() to the function .init.text:add_memory_region()
    1    WARNING: modpost: vmlinux.o(.text.unlikely+0x3684): Section mismatch in reference from the function pmax_setup_memory_region() to the function .init.text:add_memory_region()

---
For more info write to <info@kernelci.org>

                 reply index

Thread overview: [no followups] expand[flat|nested]  mbox.gz  Atom feed

Reply instructions:

You may reply publicly to this message via plain-text email
using any one of the following methods:

* Save the following mbox file, import it into your mail client,
  and reply-to-all from there: mbox

  Avoid top-posting and favor interleaved quoting:
  https://en.wikipedia.org/wiki/Posting_style#Interleaved_style

* Reply using the --to, --cc, and --in-reply-to
  switches of git-send-email(1):

  git send-email \
    --in-reply-to=5e7cb175.1c69fb81.1c299.68fe@mx.google.com \
    --to=bot@kernelci.org \
    --cc=linux-next@vger.kernel.org \
    /path/to/YOUR_REPLY

  https://kernel.org/pub/software/scm/git/docs/git-send-email.html

* If your mail client supports setting the In-Reply-To header
  via mailto: links, try the mailto: link

Linux-Next Archive on lore.kernel.org

Archives are clonable:
	git clone --mirror https://lore.kernel.org/linux-next/0 linux-next/git/0.git

	# If you have public-inbox 1.1+ installed, you may
	# initialize and index your mirror using the following commands:
	public-inbox-init -V2 linux-next linux-next/ https://lore.kernel.org/linux-next \
		linux-next@vger.kernel.org
	public-inbox-index linux-next

Example config snippet for mirrors

Newsgroup available over NNTP:
	nntp://nntp.lore.kernel.org/org.kernel.vger.linux-next


AGPL code for this site: git clone https://public-inbox.org/public-inbox.git