Linux-Next Archive on lore.kernel.org
 help / color / Atom feed
From: "kernelci.org bot" <bot@kernelci.org>
To: linux-next@vger.kernel.org
Subject: next/master build: 231 builds: 3 failed, 228 passed, 11 errors, 184 warnings (next-20210322)
Date: Mon, 22 Mar 2021 03:59:08 -0700 (PDT)
Message-ID: <6058787c.1c69fb81.d3f10.8c6d@mx.google.com> (raw)

next/master build: 231 builds: 3 failed, 228 passed, 11 errors, 184 warnings (next-20210322)

Full Build Summary: https://kernelci.org/build/next/branch/master/kernel/next-20210322/

Tree: next
Branch: master
Git Describe: next-20210322
Git Commit: e3128d2f068ed56299c7277138d1eb88e3cfae1b
Git URL: https://git.kernel.org/pub/scm/linux/kernel/git/next/linux-next.git
Built: 7 unique architectures

Build Failures Detected:

arm:
    aspeed_g5_defconfig: (clang-10) FAIL

mips:
    decstation_64_defconfig: (gcc-8) FAIL
    lemote2f_defconfig: (gcc-8) FAIL

Errors and Warnings Detected:

arc:
    vdk_hs38_smp_defconfig (gcc-8): 1 warning

arm64:
    allmodconfig (clang-10): 10 warnings
    allmodconfig (clang-11): 6 warnings
    allmodconfig (gcc-8): 1 warning
    allnoconfig (gcc-8): 1 warning
    allnoconfig (clang-10): 2 warnings
    allnoconfig (clang-11): 2 warnings
    defconfig (gcc-8): 1 warning
    defconfig (clang-11): 3 warnings
    defconfig (clang-10): 3 warnings
    defconfig+CONFIG_ARM64_64K_PAGES=y (gcc-8): 1 warning
    defconfig+CONFIG_ARM64_64K_PAGES=y (clang-10): 3 warnings
    defconfig+CONFIG_ARM64_64K_PAGES=y (clang-11): 3 warnings
    defconfig+CONFIG_CPU_BIG_ENDIAN=y (gcc-8): 1 warning
    defconfig+CONFIG_RANDOMIZE_BASE=y (gcc-8): 1 warning
    tinyconfig (gcc-8): 1 warning

arm:
    allmodconfig (clang-10): 32 warnings
    aspeed_g5_defconfig (clang-10): 11 errors
    axm55xx_defconfig (gcc-8): 1 warning
    keystone_defconfig (gcc-8): 1 warning
    multi_v7_defconfig (clang-11): 2 warnings
    multi_v7_defconfig (gcc-8): 1 warning
    multi_v7_defconfig (clang-10): 2 warnings
    multi_v7_defconfig+CONFIG_CPU_BIG_ENDIAN=y (gcc-8): 1 warning
    multi_v7_defconfig+CONFIG_EFI=y+CONFIG_ARM_LPAE=y (gcc-8): 1 warning
    multi_v7_defconfig+CONFIG_SMP=n (gcc-8): 1 warning
    mvebu_v7_defconfig (gcc-8): 1 warning
    omap1_defconfig (gcc-8): 2 warnings
    socfpga_defconfig (gcc-8): 1 warning
    spear13xx_defconfig (gcc-8): 1 warning
    vexpress_defconfig (gcc-8): 1 warning

i386:
    allmodconfig (clang-10): 23 warnings
    allmodconfig (clang-11): 25 warnings

mips:
    32r2el_defconfig (gcc-8): 1 warning
    cavium_octeon_defconfig (gcc-8): 1 warning
    malta_qemu_32r6_defconfig (gcc-8): 1 warning
    maltaaprp_defconfig (gcc-8): 1 warning
    rm200_defconfig (gcc-8): 1 warning
    sb1250_swarm_defconfig (gcc-8): 1 warning
    xway_defconfig (gcc-8): 3 warnings

riscv:
    defconfig+CONFIG_EFI=n (clang-11): 1 warning
    nommu_k210_defconfig (gcc-8): 1 warning
    nommu_k210_sdcard_defconfig (gcc-8): 1 warning
    nommu_virt_defconfig (gcc-8): 1 warning
    rv32_defconfig (gcc-8): 6 warnings

x86_64:
    allmodconfig (gcc-8): 1 warning
    allmodconfig (clang-10): 6 warnings
    allmodconfig (clang-11): 11 warnings
    allnoconfig (gcc-8): 1 warning
    allnoconfig (clang-10): 2 warnings
    allnoconfig (clang-11): 2 warnings
    tinyconfig (gcc-8): 2 warnings
    x86_64_defconfig (clang-11): 2 warnings
    x86_64_defconfig (clang-10): 2 warnings

Errors summary:

    1    ld.lld: error: .tmp_vmlinux.kallsyms1:(.ARM.exidx+0x37AD4): relocation R_ARM_PREL31 out of range: 2135588452 is not in [-1073741824, 1073741823]
    1    ld.lld: error: .tmp_vmlinux.kallsyms1:(.ARM.exidx+0x37A34): relocation R_ARM_PREL31 out of range: 2135588612 is not in [-1073741824, 1073741823]
    1    ld.lld: error: .tmp_vmlinux.kallsyms1:(.ARM.exidx+0x37A24): relocation R_ARM_PREL31 out of range: 2135588628 is not in [-1073741824, 1073741823]
    1    ld.lld: error: .tmp_vmlinux.kallsyms1:(.ARM.exidx+0x379D4): relocation R_ARM_PREL31 out of range: 2135588708 is not in [-1073741824, 1073741823]
    1    ld.lld: error: .tmp_vmlinux.kallsyms1:(.ARM.exidx+0x379C4): relocation R_ARM_PREL31 out of range: 2135588724 is not in [-1073741824, 1073741823]
    1    ld.lld: error: .tmp_vmlinux.kallsyms1:(.ARM.exidx+0x379AC): relocation R_ARM_PREL31 out of range: 2135588748 is not in [-1073741824, 1073741823]
    1    ld.lld: error: .tmp_vmlinux.kallsyms1:(.ARM.exidx+0x37994): relocation R_ARM_PREL31 out of range: 2135588772 is not in [-1073741824, 1073741823]
    1    ld.lld: error: .tmp_vmlinux.kallsyms1:(.ARM.exidx+0x37964): relocation R_ARM_PREL31 out of range: 2135588820 is not in [-1073741824, 1073741823]
    1    ld.lld: error: .tmp_vmlinux.kallsyms1:(.ARM.exidx+0x37934): relocation R_ARM_PREL31 out of range: 2135588868 is not in [-1073741824, 1073741823]
    1    ld.lld: error: .tmp_vmlinux.kallsyms1:(.ARM.exidx+0x378EC): relocation R_ARM_PREL31 out of range: 2135588940 is not in [-1073741824, 1073741823]
    1    ld.lld: error: .tmp_vmlinux.kallsyms1:(.ARM.exidx+0x352B8): relocation R_ARM_PREL31 out of range: 2135533184 is not in [-1073741824, 1073741823]

Warnings summary:

    48   1 warning generated.
    16   kernel/sched/fair.c:8387:13: warning: ‘update_nohz_stats’ defined but not used [-Wunused-function]
    13   drivers/gpu/drm/rockchip/rockchip_drm_vop.c:882:26: warning: unused variable 'old_state' [-Wunused-variable]
    10   drivers/gpu/drm/rockchip/rockchip_drm_vop.c:882:26: warning: unused variable ‘old_state’ [-Wunused-variable]
    9    2 warnings generated.
    6    drivers/platform/surface/surface_aggregator_registry.c:496:25: warning: implicit conversion from 'int' to '__u8' (aka 'unsigned char') changes value from 65535 to 255 [-Wconstant-conversion]
    5    aarch64-linux-gnu-strip: warning: /tmp/kci/linux/_modules_/lib/modules/5.12.0-rc4-next-20210322/kernel/drivers/media/tuners/tuner-types.ko: unsupported GNU_PROPERTY_TYPE (5) type: 0xc0000000
    2    kernel/static_call.c:153:18: warning: unused variable ‘mod’ [-Wunused-variable]
    2    kernel/static_call.c:153:18: warning: unused variable 'mod' [-Wunused-variable]
    2    kernel/sched/fair.c:8387:13: warning: unused function 'update_nohz_stats' [-Wunused-function]
    2    drivers/staging/greybus/audio_topology.c:977:12: warning: stack frame size of 3304 bytes in function 'gbaudio_tplg_create_widget' [-Wframe-larger-than=]
    2    drivers/staging/greybus/audio_topology.c:977:12: warning: stack frame size of 1828 bytes in function 'gbaudio_tplg_create_widget' [-Wframe-larger-than=]
    2    drivers/gpu/drm/amd/amdgpu/../display/dc/calcs/dcn_calcs.c:450:13: warning: stack frame size of 1564 bytes in function 'dcn_bw_calc_rq_dlg_ttu' [-Wframe-larger-than=]
    2    arch/arm/lib/xor-neon.c:30:2: warning: This code requires at least version 4.6 of GCC [-W#warnings]
    2    <stdin>:834:2: warning: #warning syscall fstat64 not implemented [-Wcpp]
    2    <stdin>:1515:2: warning: #warning syscall clone3 not implemented [-Wcpp]
    2    <stdin>:1131:2: warning: #warning syscall fstatat64 not implemented [-Wcpp]
    2    #warning This code requires at least version 4.6 of GCC
    1    {standard input}:39: Warning: macro instruction expanded into multiple instructions
    1    net/rose/rose_subr.o: warning: objtool: rose_write_internal() falls through to next function rose_decode()
    1    kernel/trace/trace_events_hist.c:4594:13: warning: stack frame size of 1304 bytes in function 'hist_trigger_print_key' [-Wframe-larger-than=]
    1    kernel/trace/trace_events_hist.c:4594:13: warning: stack frame size of 1252 bytes in function 'hist_trigger_print_key' [-Wframe-larger-than=]
    1    kernel/trace/trace_events_hist.c:4594:13: warning: stack frame size of 1248 bytes in function 'hist_trigger_print_key' [-Wframe-larger-than=]
    1    fs/reiserfs/do_balan.o: warning: objtool: balance_leaf_when_delete()+0x114d: stack state mismatch: cfa1=4+184 cfa2=4+176
    1    drivers/staging/wlan-ng/cfg80211.c:272:12: warning: stack frame size of 1032 bytes in function 'prism2_scan' [-Wframe-larger-than=]
    1    drivers/staging/media/atomisp/pci/atomisp_cmd.c:5600:5: warning: stack frame size of 1060 bytes in function 'atomisp_set_fmt' [-Wframe-larger-than=]
    1    drivers/staging/media/atomisp/pci/atomisp_cmd.c:5600:5: warning: stack frame size of 1044 bytes in function 'atomisp_set_fmt' [-Wframe-larger-than=]
    1    drivers/staging/greybus/audio_topology.c:977:12: warning: stack frame size of 3344 bytes in function 'gbaudio_tplg_create_widget' [-Wframe-larger-than=]
    1    drivers/staging/greybus/audio_topology.c:977:12: warning: stack frame size of 3328 bytes in function 'gbaudio_tplg_create_widget' [-Wframe-larger-than=]
    1    drivers/staging/fbtft/fbtft-core.c:995:5: warning: stack frame size of 1216 bytes in function 'fbtft_init_display' [-Wframe-larger-than=]
    1    drivers/staging/fbtft/fbtft-core.c:903:12: warning: stack frame size of 1072 bytes in function 'fbtft_init_display_from_property' [-Wframe-larger-than=]
    1    drivers/net/wireless/cisco/airo.c:3075:12: warning: stack frame size of 1056 bytes in function 'airo_thread' [-Wframe-larger-than=]
    1    drivers/net/ethernet/mellanox/mlx5/core/ipoib/ipoib.c:137:6: warning: stack frame size of 1040 bytes in function 'mlx5i_get_stats' [-Wframe-larger-than=]
    1    drivers/net/ethernet/lantiq_etop.c:281:4: warning: ignoring return value of ‘request_irq’, declared with attribute warn_unused_result [-Wunused-result]
    1    drivers/net/ethernet/lantiq_etop.c:273:4: warning: ignoring return value of ‘request_irq’, declared with attribute warn_unused_result [-Wunused-result]
    1    drivers/mtd/chips/cfi_cmdset_0001.c:1871:12: warning: stack frame size of 1056 bytes in function 'cfi_intelext_writev' [-Wframe-larger-than=]
    1    drivers/gpu/drm/selftests/test-drm_mm.c:372:12: warning: stack frame size of 1040 bytes in function '__igt_reserve' [-Wframe-larger-than=]
    1    drivers/gpu/drm/i915/gem/i915_gem_execbuffer.o: warning: objtool: eb_prefault_relocations()+0xc6: stack state mismatch: cfa1=4+8 cfa2=-1+0
    1    drivers/gpu/drm/i915/gem/i915_gem_execbuffer.o: warning: objtool: eb_prefault_relocations()+0xb8: stack state mismatch: cfa1=4+8 cfa2=-1+0
    1    drivers/gpu/drm/i915/gem/i915_gem_execbuffer.o: warning: objtool: eb_copy_relocations()+0x259: stack state mismatch: cfa1=4+104 cfa2=-1+0
    1    drivers/gpu/drm/i915/gem/i915_gem_execbuffer.o: warning: objtool: eb_copy_relocations()+0x249: stack state mismatch: cfa1=4+104 cfa2=-1+0
    1    drivers/gpu/drm/amd/amdgpu/../display/dc/dml/dml1_display_rq_dlg_calc.c:979:6: warning: stack frame size of 1228 bytes in function 'dml1_rq_dlg_get_dlg_params' [-Wframe-larger-than=]
    1    drivers/gpu/drm/amd/amdgpu/../display/dc/dml/dml1_display_rq_dlg_calc.c:979:6: warning: stack frame size of 1180 bytes in function 'dml1_rq_dlg_get_dlg_params' [-Wframe-larger-than=]
    1    drivers/gpu/drm/amd/amdgpu/../display/dc/dml/dcn30/display_rq_dlg_calc_30.c:963:13: warning: stack frame size of 1068 bytes in function 'dml_rq_dlg_get_dlg_params' [-Wframe-larger-than=]
    1    drivers/gpu/drm/amd/amdgpu/../display/dc/dml/dcn21/display_mode_vba_21.c:3393:6: warning: stack frame size of 1548 bytes in function 'dml21_ModeSupportAndSystemConfigurationFull' [-Wframe-larger-than=]
    1    drivers/gpu/drm/amd/amdgpu/../display/dc/dml/dcn21/display_mode_vba_21.c:3393:6: warning: stack frame size of 1532 bytes in function 'dml21_ModeSupportAndSystemConfigurationFull' [-Wframe-larger-than=]
    1    drivers/gpu/drm/amd/amdgpu/../display/dc/dml/dcn21/display_mode_vba_21.c:1463:13: warning: stack frame size of 1196 bytes in function 'DISPCLKDPPCLKDCFCLKDeepSleepPrefetchParametersWatermarksAndPerformanceCalculation' [-Wframe-larger-than=]
    1    drivers/gpu/drm/amd/amdgpu/../display/dc/dml/dcn21/display_mode_vba_21.c:1463:13: warning: stack frame size of 1148 bytes in function 'DISPCLKDPPCLKDCFCLKDeepSleepPrefetchParametersWatermarksAndPerformanceCalculation' [-Wframe-larger-than=]
    1    drivers/gpu/drm/amd/amdgpu/../display/dc/dml/dcn20/display_mode_vba_20v2.c:3393:6: warning: stack frame size of 1452 bytes in function 'dml20v2_ModeSupportAndSystemConfigurationFull' [-Wframe-larger-than=]
    1    drivers/gpu/drm/amd/amdgpu/../display/dc/dml/dcn20/display_mode_vba_20v2.c:3393:6: warning: stack frame size of 1436 bytes in function 'dml20v2_ModeSupportAndSystemConfigurationFull' [-Wframe-larger-than=]
    1    drivers/gpu/drm/amd/amdgpu/../display/dc/dml/dcn20/display_mode_vba_20v2.c:1145:13: warning: stack frame size of 1212 bytes in function 'dml20v2_DISPCLKDPPCLKDCFCLKDeepSleepPrefetchParametersWatermarksAndPerformanceCalculation' [-Wframe-larger-than=]
    1    drivers/gpu/drm/amd/amdgpu/../display/dc/dml/dcn20/display_mode_vba_20v2.c:1145:13: warning: stack frame size of 1196 bytes in function 'dml20v2_DISPCLKDPPCLKDCFCLKDeepSleepPrefetchParametersWatermarksAndPerformanceCalculation' [-Wframe-larger-than=]
    1    drivers/gpu/drm/amd/amdgpu/../display/dc/dml/dcn20/display_mode_vba_20.c:3286:6: warning: stack frame size of 1436 bytes in function 'dml20_ModeSupportAndSystemConfigurationFull' [-Wframe-larger-than=]
    1    drivers/gpu/drm/amd/amdgpu/../display/dc/dml/dcn20/display_mode_vba_20.c:3286:6: warning: stack frame size of 1420 bytes in function 'dml20_ModeSupportAndSystemConfigurationFull' [-Wframe-larger-than=]
    1    drivers/gpu/drm/amd/amdgpu/../display/dc/dml/dcn20/display_mode_vba_20.c:1085:13: warning: stack frame size of 1228 bytes in function 'dml20_DISPCLKDPPCLKDCFCLKDeepSleepPrefetchParametersWatermarksAndPerformanceCalculation' [-Wframe-larger-than=]
    1    drivers/gpu/drm/amd/amdgpu/../display/dc/dml/dcn20/display_mode_vba_20.c:1085:13: warning: stack frame size of 1196 bytes in function 'dml20_DISPCLKDPPCLKDCFCLKDeepSleepPrefetchParametersWatermarksAndPerformanceCalculation' [-Wframe-larger-than=]
    1    drivers/gpu/drm/amd/amdgpu/../display/dc/calcs/dce_calcs.c:77:13: warning: stack frame size of 5536 bytes in function 'calculate_bandwidth' [-Wframe-larger-than=]
    1    drivers/gpu/drm/amd/amdgpu/../display/dc/calcs/dce_calcs.c:3041:6: warning: stack frame size of 1384 bytes in function 'bw_calcs' [-Wframe-larger-than=]
    1    drivers/firmware/tegra/bpmp-debugfs.c:321:16: warning: stack frame size of 1264 bytes in function 'bpmp_debug_store' [-Wframe-larger-than=]
    1    drivers/block/paride/bpck.c:32: warning: "PC" redefined
    1    crypto/wp512.c:782:13: warning: stack frame size of 1192 bytes in function 'wp512_process_buffer' [-Wframe-larger-than=]
    1    clang: warning: argument unused during compilation: '-no-pie' [-Wunused-command-line-argument]
    1    arch/arm/mach-omap1/board-h2.c:347:34: warning: ‘isp1301_gpiod_table’ defined but not used [-Wunused-variable]
    1    arch/arm/mach-omap1/board-ams-delta.c:462:12: warning: ‘ams_delta_camera_power’ defined but not used [-Wunused-function]
    1    aarch64-linux-gnu-strip: warning: /tmp/kci/linux/_modules_/lib/modules/5.12.0-rc4-next-20210322/kernel/drivers/clk/keystone/pll.ko: unsupported GNU_PROPERTY_TYPE (5) type: 0xc0000000
    1    aarch64-linux-gnu-strip: warning: /tmp/kci/linux/_modules_/lib/modules/5.12.0-rc4-next-20210322/kernel/drivers/clk/keystone/gate.ko: unsupported GNU_PROPERTY_TYPE (5) type: 0xc0000000
    1    aarch64-linux-gnu-strip: warning: /tmp/kci/linux/_modules_/lib/modules/5.12.0-rc4-next-20210322/kernel/crypto/cast_common.ko: unsupported GNU_PROPERTY_TYPE (5) type: 0xc0000000
    1    WARNING: modpost: Symbol info of vmlinux is missing. Unresolved symbol check will be entirely skipped.
    1    /tmp/test-arm-614b28.s:18794: Warning: using r15 results in unpredictable behaviour
    1    /tmp/test-arm-614b28.s:18719: Warning: using r15 results in unpredictable behaviour
    1    .config:1196:warning: override: UNWINDER_GUESS changes choice state
    1    ./usr/include/linux/bcache.h:355:2: warning: field '' with variable sized type 'union jset::(anonymous at ./usr/include/linux/bcache.h:355:2)' not at the end of a struct or class is a GNU extension [-Wgnu-variable-sized-type-not-at-end]
    1    ./usr/include/linux/bcache.h:354:2: warning: field '' with variable sized type 'union jset::(anonymous at ./usr/include/linux/bcache.h:354:2)' not at the end of a struct or class is a GNU extension [-Wgnu-variable-sized-type-not-at-end]

================================================================================

Detailed per-defconfig build reports:

--------------------------------------------------------------------------------
32r2el_defconfig (mips, gcc-8) — PASS, 0 errors, 1 warning, 0 section mismatches

Warnings:
    WARNING: modpost: Symbol info of vmlinux is missing. Unresolved symbol check will be entirely skipped.

--------------------------------------------------------------------------------
allmodconfig (arm, clang-10) — PASS, 0 errors, 32 warnings, 0 section mismatches

Warnings:
    kernel/trace/trace_events_hist.c:4594:13: warning: stack frame size of 1304 bytes in function 'hist_trigger_print_key' [-Wframe-larger-than=]
    1 warning generated.
    drivers/firmware/tegra/bpmp-debugfs.c:321:16: warning: stack frame size of 1264 bytes in function 'bpmp_debug_store' [-Wframe-larger-than=]
    1 warning generated.
    /tmp/test-arm-614b28.s:18719: Warning: using r15 results in unpredictable behaviour
    /tmp/test-arm-614b28.s:18794: Warning: using r15 results in unpredictable behaviour
    arch/arm/lib/xor-neon.c:30:2: warning: This code requires at least version 4.6 of GCC [-W#warnings]
    #warning This code requires at least version 4.6 of GCC
    1 warning generated.
    arch/arm/lib/xor-neon.c:30:2: warning: This code requires at least version 4.6 of GCC [-W#warnings]
    #warning This code requires at least version 4.6 of GCC
    1 warning generated.
    crypto/wp512.c:782:13: warning: stack frame size of 1192 bytes in function 'wp512_process_buffer' [-Wframe-larger-than=]
    1 warning generated.
    drivers/gpu/drm/selftests/test-drm_mm.c:372:12: warning: stack frame size of 1040 bytes in function '__igt_reserve' [-Wframe-larger-than=]
    1 warning generated.
    drivers/gpu/drm/rockchip/rockchip_drm_vop.c:882:26: warning: unused variable 'old_state' [-Wunused-variable]
    1 warning generated.
    drivers/net/wireless/cisco/airo.c:3075:12: warning: stack frame size of 1056 bytes in function 'airo_thread' [-Wframe-larger-than=]
    1 warning generated.
    drivers/gpu/drm/amd/amdgpu/../display/dc/calcs/dce_calcs.c:3041:6: warning: stack frame size of 1384 bytes in function 'bw_calcs' [-Wframe-larger-than=]
    drivers/gpu/drm/amd/amdgpu/../display/dc/calcs/dce_calcs.c:77:13: warning: stack frame size of 5536 bytes in function 'calculate_bandwidth' [-Wframe-larger-than=]
    2 warnings generated.
    drivers/net/ethernet/mellanox/mlx5/core/ipoib/ipoib.c:137:6: warning: stack frame size of 1040 bytes in function 'mlx5i_get_stats' [-Wframe-larger-than=]
    1 warning generated.
    drivers/staging/wlan-ng/cfg80211.c:272:12: warning: stack frame size of 1032 bytes in function 'prism2_scan' [-Wframe-larger-than=]
    1 warning generated.
    drivers/mtd/chips/cfi_cmdset_0001.c:1871:12: warning: stack frame size of 1056 bytes in function 'cfi_intelext_writev' [-Wframe-larger-than=]
    1 warning generated.
    drivers/staging/fbtft/fbtft-core.c:995:5: warning: stack frame size of 1216 bytes in function 'fbtft_init_display' [-Wframe-larger-than=]
    drivers/staging/fbtft/fbtft-core.c:903:12: warning: stack frame size of 1072 bytes in function 'fbtft_init_display_from_property' [-Wframe-larger-than=]
    2 warnings generated.

--------------------------------------------------------------------------------
allmodconfig (i386, clang-10) — PASS, 0 errors, 23 warnings, 0 section mismatches

Warnings:
    kernel/trace/trace_events_hist.c:4594:13: warning: stack frame size of 1248 bytes in function 'hist_trigger_print_key' [-Wframe-larger-than=]
    1 warning generated.
    drivers/gpu/drm/rockchip/rockchip_drm_vop.c:882:26: warning: unused variable 'old_state' [-Wunused-variable]
    1 warning generated.
    drivers/gpu/drm/amd/amdgpu/../display/dc/calcs/dcn_calcs.c:450:13: warning: stack frame size of 1564 bytes in function 'dcn_bw_calc_rq_dlg_ttu' [-Wframe-larger-than=]
    1 warning generated.
    drivers/gpu/drm/amd/amdgpu/../display/dc/dml/dml1_display_rq_dlg_calc.c:979:6: warning: stack frame size of 1180 bytes in function 'dml1_rq_dlg_get_dlg_params' [-Wframe-larger-than=]
    1 warning generated.
    drivers/gpu/drm/amd/amdgpu/../display/dc/dml/dcn20/display_mode_vba_20.c:1085:13: warning: stack frame size of 1196 bytes in function 'dml20_DISPCLKDPPCLKDCFCLKDeepSleepPrefetchParametersWatermarksAndPerformanceCalculation' [-Wframe-larger-than=]
    drivers/gpu/drm/amd/amdgpu/../display/dc/dml/dcn20/display_mode_vba_20.c:3286:6: warning: stack frame size of 1420 bytes in function 'dml20_ModeSupportAndSystemConfigurationFull' [-Wframe-larger-than=]
    2 warnings generated.
    drivers/gpu/drm/amd/amdgpu/../display/dc/dml/dcn21/display_mode_vba_21.c:1463:13: warning: stack frame size of 1148 bytes in function 'DISPCLKDPPCLKDCFCLKDeepSleepPrefetchParametersWatermarksAndPerformanceCalculation' [-Wframe-larger-than=]
    drivers/gpu/drm/amd/amdgpu/../display/dc/dml/dcn21/display_mode_vba_21.c:3393:6: warning: stack frame size of 1548 bytes in function 'dml21_ModeSupportAndSystemConfigurationFull' [-Wframe-larger-than=]
    drivers/gpu/drm/amd/amdgpu/../display/dc/dml/dcn20/display_mode_vba_20v2.c:1145:13: warning: stack frame size of 1196 bytes in function 'dml20v2_DISPCLKDPPCLKDCFCLKDeepSleepPrefetchParametersWatermarksAndPerformanceCalculation' [-Wframe-larger-than=]
    2 warnings generated.
    drivers/gpu/drm/amd/amdgpu/../display/dc/dml/dcn20/display_mode_vba_20v2.c:3393:6: warning: stack frame size of 1436 bytes in function 'dml20v2_ModeSupportAndSystemConfigurationFull' [-Wframe-larger-than=]
    2 warnings generated.
    drivers/staging/media/atomisp/pci/atomisp_cmd.c:5600:5: warning: stack frame size of 1060 bytes in function 'atomisp_set_fmt' [-Wframe-larger-than=]
    1 warning generated.
    drivers/platform/surface/surface_aggregator_registry.c:496:25: warning: implicit conversion from 'int' to '__u8' (aka 'unsigned char') changes value from 65535 to 255 [-Wconstant-conversion]
    1 warning generated.
    drivers/staging/greybus/audio_topology.c:977:12: warning: stack frame size of 1828 bytes in function 'gbaudio_tplg_create_widget' [-Wframe-larger-than=]
    1 warning generated.

--------------------------------------------------------------------------------
allmodconfig (i386, clang-11) — PASS, 0 errors, 25 warnings, 0 section mismatches

Warnings:
    kernel/trace/trace_events_hist.c:4594:13: warning: stack frame size of 1252 bytes in function 'hist_trigger_print_key' [-Wframe-larger-than=]
    1 warning generated.
    drivers/staging/media/atomisp/pci/atomisp_cmd.c:5600:5: warning: stack frame size of 1044 bytes in function 'atomisp_set_fmt' [-Wframe-larger-than=]
    1 warning generated.
    drivers/gpu/drm/amd/amdgpu/../display/dc/calcs/dcn_calcs.c:450:13: warning: stack frame size of 1564 bytes in function 'dcn_bw_calc_rq_dlg_ttu' [-Wframe-larger-than=]
    1 warning generated.
    drivers/platform/surface/surface_aggregator_registry.c:496:25: warning: implicit conversion from 'int' to '__u8' (aka 'unsigned char') changes value from 65535 to 255 [-Wconstant-conversion]
    1 warning generated.
    drivers/gpu/drm/rockchip/rockchip_drm_vop.c:882:26: warning: unused variable 'old_state' [-Wunused-variable]
    1 warning generated.
    drivers/gpu/drm/amd/amdgpu/../display/dc/dml/dml1_display_rq_dlg_calc.c:979:6: warning: stack frame size of 1228 bytes in function 'dml1_rq_dlg_get_dlg_params' [-Wframe-larger-than=]
    1 warning generated.
    drivers/gpu/drm/amd/amdgpu/../display/dc/dml/dcn20/display_mode_vba_20.c:1085:13: warning: stack frame size of 1228 bytes in function 'dml20_DISPCLKDPPCLKDCFCLKDeepSleepPrefetchParametersWatermarksAndPerformanceCalculation' [-Wframe-larger-than=]
    drivers/gpu/drm/amd/amdgpu/../display/dc/dml/dcn21/display_mode_vba_21.c:1463:13: warning: stack frame size of 1196 bytes in function 'DISPCLKDPPCLKDCFCLKDeepSleepPrefetchParametersWatermarksAndPerformanceCalculation' [-Wframe-larger-than=]
    drivers/gpu/drm/amd/amdgpu/../display/dc/dml/dcn20/display_mode_vba_20.c:3286:6: warning: stack frame size of 1436 bytes in function 'dml20_ModeSupportAndSystemConfigurationFull' [-Wframe-larger-than=]
    drivers/gpu/drm/amd/amdgpu/../display/dc/dml/dcn21/display_mode_vba_21.c:3393:6: warning: stack frame size of 1532 bytes in function 'dml21_ModeSupportAndSystemConfigurationFull' [-Wframe-larger-than=]
    2 warnings generated.
    drivers/gpu/drm/amd/amdgpu/../display/dc/dml/dcn20/display_mode_vba_20v2.c:1145:13: warning: stack frame size of 1212 bytes in function 'dml20v2_DISPCLKDPPCLKDCFCLKDeepSleepPrefetchParametersWatermarksAndPerformanceCalculation' [-Wframe-larger-than=]
    2 warnings generated.
    drivers/gpu/drm/amd/amdgpu/../display/dc/dml/dcn20/display_mode_vba_20v2.c:3393:6: warning: stack frame size of 1452 bytes in function 'dml20v2_ModeSupportAndSystemConfigurationFull' [-Wframe-larger-than=]
    2 warnings generated.
    drivers/gpu/drm/amd/amdgpu/../display/dc/dml/dcn30/display_rq_dlg_calc_30.c:963:13: warning: stack frame size of 1068 bytes in function 'dml_rq_dlg_get_dlg_params' [-Wframe-larger-than=]
    1 warning generated.
    drivers/staging/greybus/audio_topology.c:977:12: warning: stack frame size of 1828 bytes in function 'gbaudio_tplg_create_widget' [-Wframe-larger-than=]
    1 warning generated.

--------------------------------------------------------------------------------
allmodconfig (arm64, clang-10) — PASS, 0 errors, 10 warnings, 0 section mismatches

Warnings:
    drivers/gpu/drm/rockchip/rockchip_drm_vop.c:882:26: warning: unused variable 'old_state' [-Wunused-variable]
    1 warning generated.
    drivers/platform/surface/surface_aggregator_registry.c:496:25: warning: implicit conversion from 'int' to '__u8' (aka 'unsigned char') changes value from 65535 to 255 [-Wconstant-conversion]
    1 warning generated.
    drivers/staging/greybus/audio_topology.c:977:12: warning: stack frame size of 3328 bytes in function 'gbaudio_tplg_create_widget' [-Wframe-larger-than=]
    1 warning generated.
    aarch64-linux-gnu-strip: warning: /tmp/kci/linux/_modules_/lib/modules/5.12.0-rc4-next-20210322/kernel/crypto/cast_common.ko: unsupported GNU_PROPERTY_TYPE (5) type: 0xc0000000
    aarch64-linux-gnu-strip: warning: /tmp/kci/linux/_modules_/lib/modules/5.12.0-rc4-next-20210322/kernel/drivers/clk/keystone/gate.ko: unsupported GNU_PROPERTY_TYPE (5) type: 0xc0000000
    aarch64-linux-gnu-strip: warning: /tmp/kci/linux/_modules_/lib/modules/5.12.0-rc4-next-20210322/kernel/drivers/clk/keystone/pll.ko: unsupported GNU_PROPERTY_TYPE (5) type: 0xc0000000
    aarch64-linux-gnu-strip: warning: /tmp/kci/linux/_modules_/lib/modules/5.12.0-rc4-next-20210322/kernel/drivers/media/tuners/tuner-types.ko: unsupported GNU_PROPERTY_TYPE (5) type: 0xc0000000

--------------------------------------------------------------------------------
allmodconfig (arm64, clang-11) — PASS, 0 errors, 6 warnings, 0 section mismatches

Warnings:
    drivers/platform/surface/surface_aggregator_registry.c:496:25: warning: implicit conversion from 'int' to '__u8' (aka 'unsigned char') changes value from 65535 to 255 [-Wconstant-conversion]
    1 warning generated.
    drivers/gpu/drm/rockchip/rockchip_drm_vop.c:882:26: warning: unused variable 'old_state' [-Wunused-variable]
    1 warning generated.
    drivers/staging/greybus/audio_topology.c:977:12: warning: stack frame size of 3344 bytes in function 'gbaudio_tplg_create_widget' [-Wframe-larger-than=]
    1 warning generated.

--------------------------------------------------------------------------------
allmodconfig (arm64, gcc-8) — PASS, 0 errors, 1 warning, 0 section mismatches

Warnings:
    drivers/gpu/drm/rockchip/rockchip_drm_vop.c:882:26: warning: unused variable ‘old_state’ [-Wunused-variable]

--------------------------------------------------------------------------------
allmodconfig (x86_64, gcc-8) — PASS, 0 errors, 1 warning, 0 section mismatches

Warnings:
    drivers/gpu/drm/rockchip/rockchip_drm_vop.c:882:26: warning: unused variable ‘old_state’ [-Wunused-variable]

--------------------------------------------------------------------------------
allmodconfig (x86_64, clang-10) — PASS, 0 errors, 6 warnings, 0 section mismatches

Warnings:
    drivers/gpu/drm/rockchip/rockchip_drm_vop.c:882:26: warning: unused variable 'old_state' [-Wunused-variable]
    1 warning generated.
    drivers/platform/surface/surface_aggregator_registry.c:496:25: warning: implicit conversion from 'int' to '__u8' (aka 'unsigned char') changes value from 65535 to 255 [-Wconstant-conversion]
    1 warning generated.
    drivers/staging/greybus/audio_topology.c:977:12: warning: stack frame size of 3304 bytes in function 'gbaudio_tplg_create_widget' [-Wframe-larger-than=]
    1 warning generated.

--------------------------------------------------------------------------------
allmodconfig (x86_64, clang-11) — PASS, 0 errors, 11 warnings, 0 section mismatches

Warnings:
    ./usr/include/linux/bcache.h:354:2: warning: field '' with variable sized type 'union jset::(anonymous at ./usr/include/linux/bcache.h:354:2)' not at the end of a struct or class is a GNU extension [-Wgnu-variable-sized-type-not-at-end]
    ./usr/include/linux/bcache.h:355:2: warning: field '' with variable sized type 'union jset::(anonymous at ./usr/include/linux/bcache.h:355:2)' not at the end of a struct or class is a GNU extension [-Wgnu-variable-sized-type-not-at-end]
    2 warnings generated.
    fs/reiserfs/do_balan.o: warning: objtool: balance_leaf_when_delete()+0x114d: stack state mismatch: cfa1=4+184 cfa2=4+176
    drivers/gpu/drm/rockchip/rockchip_drm_vop.c:882:26: warning: unused variable 'old_state' [-Wunused-variable]
    1 warning generated.
    net/rose/rose_subr.o: warning: objtool: rose_write_internal() falls through to next function rose_decode()
    drivers/platform/surface/surface_aggregator_registry.c:496:25: warning: implicit conversion from 'int' to '__u8' (aka 'unsigned char') changes value from 65535 to 255 [-Wconstant-conversion]
    1 warning generated.
    drivers/staging/greybus/audio_topology.c:977:12: warning: stack frame size of 3304 bytes in function 'gbaudio_tplg_create_widget' [-Wframe-larger-than=]
    1 warning generated.

--------------------------------------------------------------------------------
allnoconfig (x86_64, gcc-8) — PASS, 0 errors, 1 warning, 0 section mismatches

Warnings:
    kernel/static_call.c:153:18: warning: unused variable ‘mod’ [-Wunused-variable]

--------------------------------------------------------------------------------
allnoconfig (arm, gcc-8) — PASS, 0 errors, 0 warnings, 0 section mismatches

--------------------------------------------------------------------------------
allnoconfig (i386, clang-10) — PASS, 0 errors, 0 warnings, 0 section mismatches

--------------------------------------------------------------------------------
allnoconfig (arm64, gcc-8) — PASS, 0 errors, 1 warning, 0 section mismatches

Warnings:
    kernel/sched/fair.c:8387:13: warning: ‘update_nohz_stats’ defined but not used [-Wunused-function]

--------------------------------------------------------------------------------
allnoconfig (mips, gcc-8) — PASS, 0 errors, 0 warnings, 0 section mismatches

--------------------------------------------------------------------------------
allnoconfig (i386, gcc-8) — PASS, 0 errors, 0 warnings, 0 section mismatches

--------------------------------------------------------------------------------
allnoconfig (riscv, clang-11) — PASS, 0 errors, 0 warnings, 0 section mismatches

--------------------------------------------------------------------------------
allnoconfig (i386, clang-11) — PASS, 0 errors, 0 warnings, 0 section mismatches

--------------------------------------------------------------------------------
allnoconfig (arm, clang-10) — PASS, 0 errors, 0 warnings, 0 section mismatches

--------------------------------------------------------------------------------
allnoconfig (arm, clang-11) — PASS, 0 errors, 0 warnings, 0 section mismatches

--------------------------------------------------------------------------------
allnoconfig (arc, gcc-8) — PASS, 0 errors, 0 warnings, 0 section mismatches

--------------------------------------------------------------------------------
allnoconfig (riscv, gcc-8) — PASS, 0 errors, 0 warnings, 0 section mismatches

--------------------------------------------------------------------------------
allnoconfig (x86_64, clang-10) — PASS, 0 errors, 2 warnings, 0 section mismatches

Warnings:
    kernel/static_call.c:153:18: warning: unused variable 'mod' [-Wunused-variable]
    1 warning generated.

--------------------------------------------------------------------------------
allnoconfig (arm64, clang-10) — PASS, 0 errors, 2 warnings, 0 section mismatches

Warnings:
    kernel/sched/fair.c:8387:13: warning: unused function 'update_nohz_stats' [-Wunused-function]
    1 warning generated.

--------------------------------------------------------------------------------
allnoconfig (x86_64, clang-11) — PASS, 0 errors, 2 warnings, 0 section mismatches

Warnings:
    kernel/static_call.c:153:18: warning: unused variable 'mod' [-Wunused-variable]
    1 warning generated.

--------------------------------------------------------------------------------
allnoconfig (arm64, clang-11) — PASS, 0 errors, 2 warnings, 0 section mismatches

Warnings:
    kernel/sched/fair.c:8387:13: warning: unused function 'update_nohz_stats' [-Wunused-function]
    1 warning generated.

--------------------------------------------------------------------------------
am200epdkit_defconfig (arm, gcc-8) — PASS, 0 errors, 0 warnings, 0 section mismatches

--------------------------------------------------------------------------------
ar7_defconfig (mips, gcc-8) — PASS, 0 errors, 0 warnings, 0 section mismatches

--------------------------------------------------------------------------------
aspeed_g4_defconfig (arm, gcc-8) — PASS, 0 errors, 0 warnings, 0 section mismatches

--------------------------------------------------------------------------------
aspeed_g5_defconfig (arm, gcc-8) — PASS, 0 errors, 0 warnings, 0 section mismatches

--------------------------------------------------------------------------------
aspeed_g5_defconfig (arm, clang-11) — PASS, 0 errors, 0 warnings, 0 section mismatches

--------------------------------------------------------------------------------
aspeed_g5_defconfig (arm, clang-10) — FAIL, 11 errors, 0 warnings, 0 section mismatches

Errors:
    ld.lld: error: .tmp_vmlinux.kallsyms1:(.ARM.exidx+0x352B8): relocation R_ARM_PREL31 out of range: 2135533184 is not in [-1073741824, 1073741823]
    ld.lld: error: .tmp_vmlinux.kallsyms1:(.ARM.exidx+0x378EC): relocation R_ARM_PREL31 out of range: 2135588940 is not in [-1073741824, 1073741823]
    ld.lld: error: .tmp_vmlinux.kallsyms1:(.ARM.exidx+0x37934): relocation R_ARM_PREL31 out of range: 2135588868 is not in [-1073741824, 1073741823]
    ld.lld: error: .tmp_vmlinux.kallsyms1:(.ARM.exidx+0x37964): relocation R_ARM_PREL31 out of range: 2135588820 is not in [-1073741824, 1073741823]
    ld.lld: error: .tmp_vmlinux.kallsyms1:(.ARM.exidx+0x37994): relocation R_ARM_PREL31 out of range: 2135588772 is not in [-1073741824, 1073741823]
    ld.lld: error: .tmp_vmlinux.kallsyms1:(.ARM.exidx+0x379AC): relocation R_ARM_PREL31 out of range: 2135588748 is not in [-1073741824, 1073741823]
    ld.lld: error: .tmp_vmlinux.kallsyms1:(.ARM.exidx+0x379C4): relocation R_ARM_PREL31 out of range: 2135588724 is not in [-1073741824, 1073741823]
    ld.lld: error: .tmp_vmlinux.kallsyms1:(.ARM.exidx+0x379D4): relocation R_ARM_PREL31 out of range: 2135588708 is not in [-1073741824, 1073741823]
    ld.lld: error: .tmp_vmlinux.kallsyms1:(.ARM.exidx+0x37A24): relocation R_ARM_PREL31 out of range: 2135588628 is not in [-1073741824, 1073741823]
    ld.lld: error: .tmp_vmlinux.kallsyms1:(.ARM.exidx+0x37A34): relocation R_ARM_PREL31 out of range: 2135588612 is not in [-1073741824, 1073741823]
    ld.lld: error: .tmp_vmlinux.kallsyms1:(.ARM.exidx+0x37AD4): relocation R_ARM_PREL31 out of range: 2135588452 is not in [-1073741824, 1073741823]

--------------------------------------------------------------------------------
assabet_defconfig (arm, gcc-8) — PASS, 0 errors, 0 warnings, 0 section mismatches

--------------------------------------------------------------------------------
at91_dt_defconfig (arm, gcc-8) — PASS, 0 errors, 0 warnings, 0 section mismatches

--------------------------------------------------------------------------------
ath25_defconfig (mips, gcc-8) — PASS, 0 errors, 0 warnings, 0 section mismatches

--------------------------------------------------------------------------------
ath79_defconfig (mips, gcc-8) — PASS, 0 errors, 0 warnings, 0 section mismatches

--------------------------------------------------------------------------------
axm55xx_defconfig (arm, gcc-8) — PASS, 0 errors, 1 warning, 0 section mismatches

Warnings:
    kernel/sched/fair.c:8387:13: warning: ‘update_nohz_stats’ defined but not used [-Wunused-function]

--------------------------------------------------------------------------------
axs103_defconfig (arc, gcc-8) — PASS, 0 errors, 0 warnings, 0 section mismatches

--------------------------------------------------------------------------------
axs103_smp_defconfig (arc, gcc-8) — PASS, 0 errors, 0 warnings, 0 section mismatches

--------------------------------------------------------------------------------
badge4_defconfig (arm, gcc-8) — PASS, 0 errors, 0 warnings, 0 section mismatches

--------------------------------------------------------------------------------
bcm2835_defconfig (arm, gcc-8) — PASS, 0 errors, 0 warnings, 0 section mismatches

--------------------------------------------------------------------------------
bcm47xx_defconfig (mips, gcc-8) — PASS, 0 errors, 0 warnings, 0 section mismatches

--------------------------------------------------------------------------------
bcm63xx_defconfig (mips, gcc-8) — PASS, 0 errors, 0 warnings, 0 section mismatches

--------------------------------------------------------------------------------
bigsur_defconfig (mips, gcc-8) — PASS, 0 errors, 0 warnings, 0 section mismatches

--------------------------------------------------------------------------------
bmips_be_defconfig (mips, gcc-8) — PASS, 0 errors, 0 warnings, 0 section mismatches

--------------------------------------------------------------------------------
bmips_stb_defconfig (mips, gcc-8) — PASS, 0 errors, 0 warnings, 0 section mismatches

--------------------------------------------------------------------------------
capcella_defconfig (mips, gcc-8) — PASS, 0 errors, 0 warnings, 0 section mismatches

--------------------------------------------------------------------------------
cavium_octeon_defconfig (mips, gcc-8) — PASS, 0 errors, 1 warning, 0 section mismatches

Warnings:
    kernel/sched/fair.c:8387:13: warning: ‘update_nohz_stats’ defined but not used [-Wunused-function]

--------------------------------------------------------------------------------
cerfcube_defconfig (arm, gcc-8) — PASS, 0 errors, 0 warnings, 0 section mismatches

--------------------------------------------------------------------------------
ci20_defconfig (mips, gcc-8) — PASS, 0 errors, 0 warnings, 0 section mismatches

--------------------------------------------------------------------------------
clps711x_defconfig (arm, gcc-8) — PASS, 0 errors, 0 warnings, 0 section mismatches

--------------------------------------------------------------------------------
cm_x300_defconfig (arm, gcc-8) — PASS, 0 errors, 0 warnings, 0 section mismatches

--------------------------------------------------------------------------------
cns3420vb_defconfig (arm, gcc-8) — PASS, 0 errors, 0 warnings, 0 section mismatches

--------------------------------------------------------------------------------
cobalt_defconfig (mips, gcc-8) — PASS, 0 errors, 0 warnings, 0 section mismatches

--------------------------------------------------------------------------------
colibri_pxa270_defconfig (arm, gcc-8) — PASS, 0 errors, 0 warnings, 0 section mismatches

--------------------------------------------------------------------------------
colibri_pxa300_defconfig (arm, gcc-8) — PASS, 0 errors, 0 warnings, 0 section mismatches

--------------------------------------------------------------------------------
collie_defconfig (arm, gcc-8) — PASS, 0 errors, 0 warnings, 0 section mismatches

--------------------------------------------------------------------------------
corgi_defconfig (arm, gcc-8) — PASS, 0 errors, 0 warnings, 0 section mismatches

--------------------------------------------------------------------------------
cu1000-neo_defconfig (mips, gcc-8) — PASS, 0 errors, 0 warnings, 0 section mismatches

--------------------------------------------------------------------------------
cu1830-neo_defconfig (mips, gcc-8) — PASS, 0 errors, 0 warnings, 0 section mismatches

--------------------------------------------------------------------------------
davinci_all_defconfig (arm, gcc-8) — PASS, 0 errors, 0 warnings, 0 section mismatches

--------------------------------------------------------------------------------
db1xxx_defconfig (mips, gcc-8) — PASS, 0 errors, 0 warnings, 0 section mismatches

--------------------------------------------------------------------------------
decstation_64_defconfig (mips, gcc-8) — FAIL, 0 errors, 0 warnings, 0 section mismatches

--------------------------------------------------------------------------------
decstation_defconfig (mips, gcc-8) — PASS, 0 errors, 0 warnings, 0 section mismatches

--------------------------------------------------------------------------------
decstation_r4k_defconfig (mips, gcc-8) — PASS, 0 errors, 0 warnings, 0 section mismatches

--------------------------------------------------------------------------------
defconfig (riscv, gcc-8) — PASS, 0 errors, 0 warnings, 0 section mismatches

--------------------------------------------------------------------------------
defconfig (arm64, gcc-8) — PASS, 0 errors, 1 warning, 0 section mismatches

Warnings:
    drivers/gpu/drm/rockchip/rockchip_drm_vop.c:882:26: warning: unused variable ‘old_state’ [-Wunused-variable]

--------------------------------------------------------------------------------
defconfig (arm64, clang-11) — PASS, 0 errors, 3 warnings, 0 section mismatches

Warnings:
    drivers/gpu/drm/rockchip/rockchip_drm_vop.c:882:26: warning: unused variable 'old_state' [-Wunused-variable]
    1 warning generated.
    aarch64-linux-gnu-strip: warning: /tmp/kci/linux/_modules_/lib/modules/5.12.0-rc4-next-20210322/kernel/drivers/media/tuners/tuner-types.ko: unsupported GNU_PROPERTY_TYPE (5) type: 0xc0000000

--------------------------------------------------------------------------------
defconfig (arm64, clang-10) — PASS, 0 errors, 3 warnings, 0 section mismatches

Warnings:
    drivers/gpu/drm/rockchip/rockchip_drm_vop.c:882:26: warning: unused variable 'old_state' [-Wunused-variable]
    1 warning generated.
    aarch64-linux-gnu-strip: warning: /tmp/kci/linux/_modules_/lib/modules/5.12.0-rc4-next-20210322/kernel/drivers/media/tuners/tuner-types.ko: unsupported GNU_PROPERTY_TYPE (5) type: 0xc0000000

--------------------------------------------------------------------------------
defconfig+CONFIG_ARM64_64K_PAGES=y (arm64, gcc-8) — PASS, 0 errors, 1 warning, 0 section mismatches

Warnings:
    drivers/gpu/drm/rockchip/rockchip_drm_vop.c:882:26: warning: unused variable ‘old_state’ [-Wunused-variable]

--------------------------------------------------------------------------------
defconfig+CONFIG_ARM64_64K_PAGES=y (arm64, clang-10) — PASS, 0 errors, 3 warnings, 0 section mismatches

Warnings:
    drivers/gpu/drm/rockchip/rockchip_drm_vop.c:882:26: warning: unused variable 'old_state' [-Wunused-variable]
    1 warning generated.
    aarch64-linux-gnu-strip: warning: /tmp/kci/linux/_modules_/lib/modules/5.12.0-rc4-next-20210322/kernel/drivers/media/tuners/tuner-types.ko: unsupported GNU_PROPERTY_TYPE (5) type: 0xc0000000

--------------------------------------------------------------------------------
defconfig+CONFIG_ARM64_64K_PAGES=y (arm64, clang-11) — PASS, 0 errors, 3 warnings, 0 section mismatches

Warnings:
    drivers/gpu/drm/rockchip/rockchip_drm_vop.c:882:26: warning: unused variable 'old_state' [-Wunused-variable]
    1 warning generated.
    aarch64-linux-gnu-strip: warning: /tmp/kci/linux/_modules_/lib/modules/5.12.0-rc4-next-20210322/kernel/drivers/media/tuners/tuner-types.ko: unsupported GNU_PROPERTY_TYPE (5) type: 0xc0000000

--------------------------------------------------------------------------------
defconfig+CONFIG_CPU_BIG_ENDIAN=y (arm64, gcc-8) — PASS, 0 errors, 1 warning, 0 section mismatches

Warnings:
    drivers/gpu/drm/rockchip/rockchip_drm_vop.c:882:26: warning: unused variable ‘old_state’ [-Wunused-variable]

--------------------------------------------------------------------------------
defconfig+CONFIG_EFI=n (riscv, clang-11) — PASS, 0 errors, 1 warning, 0 section mismatches

Warnings:
    clang: warning: argument unused during compilation: '-no-pie' [-Wunused-command-line-argument]

--------------------------------------------------------------------------------
defconfig+CONFIG_RANDOMIZE_BASE=y (arm64, gcc-8) — PASS, 0 errors, 1 warning, 0 section mismatches

Warnings:
    drivers/gpu/drm/rockchip/rockchip_drm_vop.c:882:26: warning: unused variable ‘old_state’ [-Wunused-variable]

--------------------------------------------------------------------------------
dove_defconfig (arm, gcc-8) — PASS, 0 errors, 0 warnings, 0 section mismatches

--------------------------------------------------------------------------------
e55_defconfig (mips, gcc-8) — PASS, 0 errors, 0 warnings, 0 section mismatches

--------------------------------------------------------------------------------
ep93xx_defconfig (arm, gcc-8) — PASS, 0 errors, 0 warnings, 0 section mismatches

--------------------------------------------------------------------------------
eseries_pxa_defconfig (arm, gcc-8) — PASS, 0 errors, 0 warnings, 0 section mismatches

--------------------------------------------------------------------------------
exynos_defconfig (arm, gcc-8) — PASS, 0 errors, 0 warnings, 0 section mismatches

--------------------------------------------------------------------------------
ezx_defconfig (arm, gcc-8) — PASS, 0 errors, 0 warnings, 0 section mismatches

--------------------------------------------------------------------------------
footbridge_defconfig (arm, gcc-8) — PASS, 0 errors, 0 warnings, 0 section mismatches

--------------------------------------------------------------------------------
fuloong2e_defconfig (mips, gcc-8) — PASS, 0 errors, 0 warnings, 0 section mismatches

--------------------------------------------------------------------------------
gcw0_defconfig (mips, gcc-8) — PASS, 0 errors, 0 warnings, 0 section mismatches

--------------------------------------------------------------------------------
gemini_defconfig (arm, gcc-8) — PASS, 0 errors, 0 warnings, 0 section mismatches

--------------------------------------------------------------------------------
gpr_defconfig (mips, gcc-8) — PASS, 0 errors, 0 warnings, 0 section mismatches

--------------------------------------------------------------------------------
h3600_defconfig (arm, gcc-8) — PASS, 0 errors, 0 warnings, 0 section mismatches

--------------------------------------------------------------------------------
h5000_defconfig (arm, gcc-8) — PASS, 0 errors, 0 warnings, 0 section mismatches

--------------------------------------------------------------------------------
hackkit_defconfig (arm, gcc-8) — PASS, 0 errors, 0 warnings, 0 section mismatches

--------------------------------------------------------------------------------
haps_hs_defconfig (arc, gcc-8) — PASS, 0 errors, 0 warnings, 0 section mismatches

--------------------------------------------------------------------------------
haps_hs_smp_defconfig (arc, gcc-8) — PASS, 0 errors, 0 warnings, 0 section mismatches

--------------------------------------------------------------------------------
hisi_defconfig (arm, gcc-8) — PASS, 0 errors, 0 warnings, 0 section mismatches

--------------------------------------------------------------------------------
hsdk_defconfig (arc, gcc-8) — PASS, 0 errors, 0 warnings, 0 section mismatches

--------------------------------------------------------------------------------
i386_defconfig (i386, gcc-8) — PASS, 0 errors, 0 warnings, 0 section mismatches

--------------------------------------------------------------------------------
i386_defconfig (i386, clang-11) — PASS, 0 errors, 0 warnings, 0 section mismatches

--------------------------------------------------------------------------------
i386_defconfig (i386, clang-10) — PASS, 0 errors, 0 warnings, 0 section mismatches

--------------------------------------------------------------------------------
imote2_defconfig (arm, gcc-8) — PASS, 0 errors, 0 warnings, 0 section mismatches

--------------------------------------------------------------------------------
imx_v4_v5_defconfig (arm, gcc-8) — PASS, 0 errors, 0 warnings, 0 section mismatches

--------------------------------------------------------------------------------
imx_v6_v7_defconfig (arm, gcc-8) — PASS, 0 errors, 0 warnings, 0 section mismatches

--------------------------------------------------------------------------------
integrator_defconfig (arm, gcc-8) — PASS, 0 errors, 0 warnings, 0 section mismatches

--------------------------------------------------------------------------------
iop32x_defconfig (arm, gcc-8) — PASS, 0 errors, 0 warnings, 0 section mismatches

--------------------------------------------------------------------------------
ip22_defconfig (mips, gcc-8) — PASS, 0 errors, 0 warnings, 0 section mismatches

--------------------------------------------------------------------------------
ip27_defconfig (mips, gcc-8) — PASS, 0 errors, 0 warnings, 0 section mismatches

--------------------------------------------------------------------------------
ip28_defconfig (mips, gcc-8) — PASS, 0 errors, 0 warnings, 0 section mismatches

--------------------------------------------------------------------------------
ip32_defconfig (mips, gcc-8) — PASS, 0 errors, 0 warnings, 0 section mismatches

--------------------------------------------------------------------------------
ixp4xx_defconfig (arm, gcc-8) — PASS, 0 errors, 0 warnings, 0 section mismatches

--------------------------------------------------------------------------------
jazz_defconfig (mips, gcc-8) — PASS, 0 errors, 0 warnings, 0 section mismatches

--------------------------------------------------------------------------------
jmr3927_defconfig (mips, gcc-8) — PASS, 0 errors, 0 warnings, 0 section mismatches

--------------------------------------------------------------------------------
jornada720_defconfig (arm, gcc-8) — PASS, 0 errors, 0 warnings, 0 section mismatches

--------------------------------------------------------------------------------
keystone_defconfig (arm, gcc-8) — PASS, 0 errors, 1 warning, 0 section mismatches

Warnings:
    kernel/sched/fair.c:8387:13: warning: ‘update_nohz_stats’ defined but not used [-Wunused-function]

--------------------------------------------------------------------------------
lart_defconfig (arm, gcc-8) — PASS, 0 errors, 0 warnings, 0 section mismatches

--------------------------------------------------------------------------------
lemote2f_defconfig (mips, gcc-8) — FAIL, 0 errors, 0 warnings, 0 section mismatches

--------------------------------------------------------------------------------
loongson1b_defconfig (mips, gcc-8) — PASS, 0 errors, 0 warnings, 0 section mismatches

--------------------------------------------------------------------------------
loongson1c_defconfig (mips, gcc-8) — PASS, 0 errors, 0 warnings, 0 section mismatches

--------------------------------------------------------------------------------
loongson3_defconfig (mips, gcc-8) — PASS, 0 errors, 0 warnings, 0 section mismatches

--------------------------------------------------------------------------------
lpc18xx_defconfig (arm, gcc-8) — PASS, 0 errors, 0 warnings, 0 section mismatches

--------------------------------------------------------------------------------
lpc32xx_defconfig (arm, gcc-8) — PASS, 0 errors, 0 warnings, 0 section mismatches

--------------------------------------------------------------------------------
lpd270_defconfig (arm, gcc-8) — PASS, 0 errors, 0 warnings, 0 section mismatches

--------------------------------------------------------------------------------
lubbock_defconfig (arm, gcc-8) — PASS, 0 errors, 0 warnings, 0 section mismatches

--------------------------------------------------------------------------------
magician_defconfig (arm, gcc-8) — PASS, 0 errors, 0 warnings, 0 section mismatches

--------------------------------------------------------------------------------
mainstone_defconfig (arm, gcc-8) — PASS, 0 errors, 0 warnings, 0 section mismatches

--------------------------------------------------------------------------------
malta_defconfig (mips, gcc-8) — PASS, 0 errors, 0 warnings, 0 section mismatches

--------------------------------------------------------------------------------
malta_kvm_defconfig (mips, gcc-8) — PASS, 0 errors, 0 warnings, 0 section mismatches

--------------------------------------------------------------------------------
malta_qemu_32r6_defconfig (mips, gcc-8) — PASS, 0 errors, 1 warning, 0 section mismatches

Warnings:
    {standard input}:39: Warning: macro instruction expanded into multiple instructions

--------------------------------------------------------------------------------
maltaaprp_defconfig (mips, gcc-8) — PASS, 0 errors, 1 warning, 0 section mismatches

Warnings:
    kernel/sched/fair.c:8387:13: warning: ‘update_nohz_stats’ defined but not used [-Wunused-function]

--------------------------------------------------------------------------------
maltasmvp_defconfig (mips, gcc-8) — PASS, 0 errors, 0 warnings, 0 section mismatches

--------------------------------------------------------------------------------
maltasmvp_eva_defconfig (mips, gcc-8) — PASS, 0 errors, 0 warnings, 0 section mismatches

--------------------------------------------------------------------------------
maltaup_defconfig (mips, gcc-8) — PASS, 0 errors, 0 warnings, 0 section mismatches

--------------------------------------------------------------------------------
maltaup_xpa_defconfig (mips, gcc-8) — PASS, 0 errors, 0 warnings, 0 section mismatches

--------------------------------------------------------------------------------
milbeaut_m10v_defconfig (arm, gcc-8) — PASS, 0 errors, 0 warnings, 0 section mismatches

--------------------------------------------------------------------------------
mini2440_defconfig (arm, gcc-8) — PASS, 0 errors, 0 warnings, 0 section mismatches

--------------------------------------------------------------------------------
mmp2_defconfig (arm, gcc-8) — PASS, 0 errors, 0 warnings, 0 section mismatches

--------------------------------------------------------------------------------
moxart_defconfig (arm, gcc-8) — PASS, 0 errors, 0 warnings, 0 section mismatches

--------------------------------------------------------------------------------
mpc30x_defconfig (mips, gcc-8) — PASS, 0 errors, 0 warnings, 0 section mismatches

--------------------------------------------------------------------------------
mps2_defconfig (arm, gcc-8) — PASS, 0 errors, 0 warnings, 0 section mismatches

--------------------------------------------------------------------------------
mtx1_defconfig (mips, gcc-8) — PASS, 0 errors, 0 warnings, 0 section mismatches

--------------------------------------------------------------------------------
multi_v4t_defconfig (arm, gcc-8) — PASS, 0 errors, 0 warnings, 0 section mismatches

--------------------------------------------------------------------------------
multi_v5_defconfig (arm, clang-10) — PASS, 0 errors, 0 warnings, 0 section mismatches

--------------------------------------------------------------------------------
multi_v5_defconfig (arm, gcc-8) — PASS, 0 errors, 0 warnings, 0 section mismatches

--------------------------------------------------------------------------------
multi_v5_defconfig (arm, clang-11) — PASS, 0 errors, 0 warnings, 0 section mismatches

--------------------------------------------------------------------------------
multi_v7_defconfig (arm, clang-11) — PASS, 0 errors, 2 warnings, 0 section mismatches

Warnings:
    drivers/gpu/drm/rockchip/rockchip_drm_vop.c:882:26: warning: unused variable 'old_state' [-Wunused-variable]
    1 warning generated.

--------------------------------------------------------------------------------
multi_v7_defconfig (arm, gcc-8) — PASS, 0 errors, 1 warning, 0 section mismatches

Warnings:
    drivers/gpu/drm/rockchip/rockchip_drm_vop.c:882:26: warning: unused variable ‘old_state’ [-Wunused-variable]

--------------------------------------------------------------------------------
multi_v7_defconfig (arm, clang-10) — PASS, 0 errors, 2 warnings, 0 section mismatches

Warnings:
    drivers/gpu/drm/rockchip/rockchip_drm_vop.c:882:26: warning: unused variable 'old_state' [-Wunused-variable]
    1 warning generated.

--------------------------------------------------------------------------------
multi_v7_defconfig+CONFIG_CPU_BIG_ENDIAN=y (arm, gcc-8) — PASS, 0 errors, 1 warning, 0 section mismatches

Warnings:
    drivers/gpu/drm/rockchip/rockchip_drm_vop.c:882:26: warning: unused variable ‘old_state’ [-Wunused-variable]

--------------------------------------------------------------------------------
multi_v7_defconfig+CONFIG_EFI=y+CONFIG_ARM_LPAE=y (arm, gcc-8) — PASS, 0 errors, 1 warning, 0 section mismatches

Warnings:
    drivers/gpu/drm/rockchip/rockchip_drm_vop.c:882:26: warning: unused variable ‘old_state’ [-Wunused-variable]

--------------------------------------------------------------------------------
multi_v7_defconfig+CONFIG_SMP=n (arm, gcc-8) — PASS, 0 errors, 1 warning, 0 section mismatches

Warnings:
    drivers/gpu/drm/rockchip/rockchip_drm_vop.c:882:26: warning: unused variable ‘old_state’ [-Wunused-variable]

--------------------------------------------------------------------------------
mv78xx0_defconfig (arm, gcc-8) — PASS, 0 errors, 0 warnings, 0 section mismatches

--------------------------------------------------------------------------------
mvebu_v5_defconfig (arm, gcc-8) — PASS, 0 errors, 0 warnings, 0 section mismatches

--------------------------------------------------------------------------------
mvebu_v7_defconfig (arm, gcc-8) — PASS, 0 errors, 1 warning, 0 section mismatches

Warnings:
    kernel/sched/fair.c:8387:13: warning: ‘update_nohz_stats’ defined but not used [-Wunused-function]

--------------------------------------------------------------------------------
mxs_defconfig (arm, gcc-8) — PASS, 0 errors, 0 warnings, 0 section mismatches

--------------------------------------------------------------------------------
neponset_defconfig (arm, gcc-8) — PASS, 0 errors, 0 warnings, 0 section mismatches

--------------------------------------------------------------------------------
netwinder_defconfig (arm, gcc-8) — PASS, 0 errors, 0 warnings, 0 section mismatches

--------------------------------------------------------------------------------
nhk8815_defconfig (arm, gcc-8) — PASS, 0 errors, 0 warnings, 0 section mismatches

--------------------------------------------------------------------------------
nlm_xlp_defconfig (mips, gcc-8) — PASS, 0 errors, 0 warnings, 0 section mismatches

--------------------------------------------------------------------------------
nlm_xlr_defconfig (mips, gcc-8) — PASS, 0 errors, 0 warnings, 0 section mismatches

--------------------------------------------------------------------------------
nommu_k210_defconfig (riscv, gcc-8) — PASS, 0 errors, 1 warning, 0 section mismatches

Warnings:
    kernel/sched/fair.c:8387:13: warning: ‘update_nohz_stats’ defined but not used [-Wunused-function]

--------------------------------------------------------------------------------
nommu_k210_sdcard_defconfig (riscv, gcc-8) — PASS, 0 errors, 1 warning, 0 section mismatches

Warnings:
    kernel/sched/fair.c:8387:13: warning: ‘update_nohz_stats’ defined but not used [-Wunused-function]

--------------------------------------------------------------------------------
nommu_virt_defconfig (riscv, gcc-8) — PASS, 0 errors, 1 warning, 0 section mismatches

Warnings:
    kernel/sched/fair.c:8387:13: warning: ‘update_nohz_stats’ defined but not used [-Wunused-function]

--------------------------------------------------------------------------------
nsimosci_hs_defconfig (arc, gcc-8) — PASS, 0 errors, 0 warnings, 0 section mismatches

--------------------------------------------------------------------------------
nsimosci_hs_smp_defconfig (arc, gcc-8) — PASS, 0 errors, 0 warnings, 0 section mismatches

--------------------------------------------------------------------------------
omap1_defconfig (arm, gcc-8) — PASS, 0 errors, 2 warnings, 0 section mismatches

Warnings:
    arch/arm/mach-omap1/board-h2.c:347:34: warning: ‘isp1301_gpiod_table’ defined but not used [-Wunused-variable]
    arch/arm/mach-omap1/board-ams-delta.c:462:12: warning: ‘ams_delta_camera_power’ defined but not used [-Wunused-function]

--------------------------------------------------------------------------------
omap2plus_defconfig (arm, gcc-8) — PASS, 0 errors, 0 warnings, 0 section mismatches

--------------------------------------------------------------------------------
omega2p_defconfig (mips, gcc-8) — PASS, 0 errors, 0 warnings, 0 section mismatches

--------------------------------------------------------------------------------
orion5x_defconfig (arm, gcc-8) — PASS, 0 errors, 0 warnings, 0 section mismatches

--------------------------------------------------------------------------------
oxnas_v6_defconfig (arm, gcc-8) — PASS, 0 errors, 0 warnings, 0 section mismatches

--------------------------------------------------------------------------------
palmz72_defconfig (arm, gcc-8) — PASS, 0 errors, 0 warnings, 0 section mismatches

--------------------------------------------------------------------------------
pcm027_defconfig (arm, gcc-8) — PASS, 0 errors, 0 warnings, 0 section mismatches

--------------------------------------------------------------------------------
pic32mzda_defconfig (mips, gcc-8) — PASS, 0 errors, 0 warnings, 0 section mismatches

--------------------------------------------------------------------------------
pistachio_defconfig (mips, gcc-8) — PASS, 0 errors, 0 warnings, 0 section mismatches

--------------------------------------------------------------------------------
pleb_defconfig (arm, gcc-8) — PASS, 0 errors, 0 warnings, 0 section mismatches

--------------------------------------------------------------------------------
pxa168_defconfig (arm, gcc-8) — PASS, 0 errors, 0 warnings, 0 section mismatches

--------------------------------------------------------------------------------
pxa255-idp_defconfig (arm, gcc-8) — PASS, 0 errors, 0 warnings, 0 section mismatches

--------------------------------------------------------------------------------
pxa3xx_defconfig (arm, gcc-8) — PASS, 0 errors, 0 warnings, 0 section mismatches

--------------------------------------------------------------------------------
pxa910_defconfig (arm, gcc-8) — PASS, 0 errors, 0 warnings, 0 section mismatches

--------------------------------------------------------------------------------
pxa_defconfig (arm, gcc-8) — PASS, 0 errors, 0 warnings, 0 section mismatches

--------------------------------------------------------------------------------
qcom_defconfig (arm, gcc-8) — PASS, 0 errors, 0 warnings, 0 section mismatches

--------------------------------------------------------------------------------
qi_lb60_defconfig (mips, gcc-8) — PASS, 0 errors, 0 warnings, 0 section mismatches

--------------------------------------------------------------------------------
rb532_defconfig (mips, gcc-8) — PASS, 0 errors, 0 warnings, 0 section mismatches

--------------------------------------------------------------------------------
rbtx49xx_defconfig (mips, gcc-8) — PASS, 0 errors, 0 warnings, 0 section mismatches

--------------------------------------------------------------------------------
realview_defconfig (arm, gcc-8) — PASS, 0 errors, 0 warnings, 0 section mismatches

--------------------------------------------------------------------------------
rm200_defconfig (mips, gcc-8) — PASS, 0 errors, 1 warning, 0 section mismatches

Warnings:
    drivers/block/paride/bpck.c:32: warning: "PC" redefined

--------------------------------------------------------------------------------
rpc_defconfig (arm, gcc-8) — PASS, 0 errors, 0 warnings, 0 section mismatches

--------------------------------------------------------------------------------
rs90_defconfig (mips, gcc-8) — PASS, 0 errors, 0 warnings, 0 section mismatches

--------------------------------------------------------------------------------
rt305x_defconfig (mips, gcc-8) — PASS, 0 errors, 0 warnings, 0 section mismatches

--------------------------------------------------------------------------------
rv32_defconfig (riscv, gcc-8) — PASS, 0 errors, 6 warnings, 0 section mismatches

Warnings:
    <stdin>:834:2: warning: #warning syscall fstat64 not implemented [-Wcpp]
    <stdin>:1131:2: warning: #warning syscall fstatat64 not implemented [-Wcpp]
    <stdin>:1515:2: warning: #warning syscall clone3 not implemented [-Wcpp]
    <stdin>:834:2: warning: #warning syscall fstat64 not implemented [-Wcpp]
    <stdin>:1131:2: warning: #warning syscall fstatat64 not implemented [-Wcpp]
    <stdin>:1515:2: warning: #warning syscall clone3 not implemented [-Wcpp]

--------------------------------------------------------------------------------
s3c2410_defconfig (arm, gcc-8) — PASS, 0 errors, 0 warnings, 0 section mismatches

--------------------------------------------------------------------------------
s3c6400_defconfig (arm, gcc-8) — PASS, 0 errors, 0 warnings, 0 section mismatches

--------------------------------------------------------------------------------
s5pv210_defconfig (arm, gcc-8) — PASS, 0 errors, 0 warnings, 0 section mismatches

--------------------------------------------------------------------------------
sama5_defconfig (arm, gcc-8) — PASS, 0 errors, 0 warnings, 0 section mismatches

--------------------------------------------------------------------------------
sb1250_swarm_defconfig (mips, gcc-8) — PASS, 0 errors, 1 warning, 0 section mismatches

Warnings:
    kernel/sched/fair.c:8387:13: warning: ‘update_nohz_stats’ defined but not used [-Wunused-function]

--------------------------------------------------------------------------------
shannon_defconfig (arm, gcc-8) — PASS, 0 errors, 0 warnings, 0 section mismatches

--------------------------------------------------------------------------------
shmobile_defconfig (arm, gcc-8) — PASS, 0 errors, 0 warnings, 0 section mismatches

--------------------------------------------------------------------------------
simpad_defconfig (arm, gcc-8) — PASS, 0 errors, 0 warnings, 0 section mismatches

--------------------------------------------------------------------------------
socfpga_defconfig (arm, gcc-8) — PASS, 0 errors, 1 warning, 0 section mismatches

Warnings:
    kernel/sched/fair.c:8387:13: warning: ‘update_nohz_stats’ defined but not used [-Wunused-function]

--------------------------------------------------------------------------------
spear13xx_defconfig (arm, gcc-8) — PASS, 0 errors, 1 warning, 0 section mismatches

Warnings:
    kernel/sched/fair.c:8387:13: warning: ‘update_nohz_stats’ defined but not used [-Wunused-function]

--------------------------------------------------------------------------------
spear3xx_defconfig (arm, gcc-8) — PASS, 0 errors, 0 warnings, 0 section mismatches

--------------------------------------------------------------------------------
spear6xx_defconfig (arm, gcc-8) — PASS, 0 errors, 0 warnings, 0 section mismatches

--------------------------------------------------------------------------------
spitz_defconfig (arm, gcc-8) — PASS, 0 errors, 0 warnings, 0 section mismatches

--------------------------------------------------------------------------------
stm32_defconfig (arm, gcc-8) — PASS, 0 errors, 0 warnings, 0 section mismatches

--------------------------------------------------------------------------------
sunxi_defconfig (arm, gcc-8) — PASS, 0 errors, 0 warnings, 0 section mismatches

--------------------------------------------------------------------------------
tb0219_defconfig (mips, gcc-8) — PASS, 0 errors, 0 warnings, 0 section mismatches

--------------------------------------------------------------------------------
tb0226_defconfig (mips, gcc-8) — PASS, 0 errors, 0 warnings, 0 section mismatches

--------------------------------------------------------------------------------
tb0287_defconfig (mips, gcc-8) — PASS, 0 errors, 0 warnings, 0 section mismatches

--------------------------------------------------------------------------------
tct_hammer_defconfig (arm, gcc-8) — PASS, 0 errors, 0 warnings, 0 section mismatches

--------------------------------------------------------------------------------
tegra_defconfig (arm, gcc-8) — PASS, 0 errors, 0 warnings, 0 section mismatches

--------------------------------------------------------------------------------
tinyconfig (riscv, gcc-8) — PASS, 0 errors, 0 warnings, 0 section mismatches

--------------------------------------------------------------------------------
tinyconfig (i386, gcc-8) — PASS, 0 errors, 0 warnings, 0 section mismatches

--------------------------------------------------------------------------------
tinyconfig (arc, gcc-8) — PASS, 0 errors, 0 warnings, 0 section mismatches

--------------------------------------------------------------------------------
tinyconfig (mips, gcc-8) — PASS, 0 errors, 0 warnings, 0 section mismatches

--------------------------------------------------------------------------------
tinyconfig (arm, gcc-8) — PASS, 0 errors, 0 warnings, 0 section mismatches

--------------------------------------------------------------------------------
tinyconfig (arm64, gcc-8) — PASS, 0 errors, 1 warning, 0 section mismatches

Warnings:
    kernel/sched/fair.c:8387:13: warning: ‘update_nohz_stats’ defined but not used [-Wunused-function]

--------------------------------------------------------------------------------
tinyconfig (x86_64, gcc-8) — PASS, 0 errors, 2 warnings, 0 section mismatches

Warnings:
    .config:1196:warning: override: UNWINDER_GUESS changes choice state
    kernel/static_call.c:153:18: warning: unused variable ‘mod’ [-Wunused-variable]

--------------------------------------------------------------------------------
trizeps4_defconfig (arm, gcc-8) — PASS, 0 errors, 0 warnings, 0 section mismatches

--------------------------------------------------------------------------------
u8500_defconfig (arm, gcc-8) — PASS, 0 errors, 0 warnings, 0 section mismatches

--------------------------------------------------------------------------------
vdk_hs38_defconfig (arc, gcc-8) — PASS, 0 errors, 0 warnings, 0 section mismatches

--------------------------------------------------------------------------------
vdk_hs38_smp_defconfig (arc, gcc-8) — PASS, 0 errors, 1 warning, 0 section mismatches

Warnings:
    kernel/sched/fair.c:8387:13: warning: ‘update_nohz_stats’ defined but not used [-Wunused-function]

--------------------------------------------------------------------------------
versatile_defconfig (arm, gcc-8) — PASS, 0 errors, 0 warnings, 0 section mismatches

--------------------------------------------------------------------------------
vexpress_defconfig (arm, gcc-8) — PASS, 0 errors, 1 warning, 0 section mismatches

Warnings:
    kernel/sched/fair.c:8387:13: warning: ‘update_nohz_stats’ defined but not used [-Wunused-function]

--------------------------------------------------------------------------------
vf610m4_defconfig (arm, gcc-8) — PASS, 0 errors, 0 warnings, 0 section mismatches

--------------------------------------------------------------------------------
viper_defconfig (arm, gcc-8) — PASS, 0 errors, 0 warnings, 0 section mismatches

--------------------------------------------------------------------------------
vocore2_defconfig (mips, gcc-8) — PASS, 0 errors, 0 warnings, 0 section mismatches

--------------------------------------------------------------------------------
vt8500_v6_v7_defconfig (arm, gcc-8) — PASS, 0 errors, 0 warnings, 0 section mismatches

--------------------------------------------------------------------------------
workpad_defconfig (mips, gcc-8) — PASS, 0 errors, 0 warnings, 0 section mismatches

--------------------------------------------------------------------------------
x86_64_defconfig (x86_64, gcc-8) — PASS, 0 errors, 0 warnings, 0 section mismatches

--------------------------------------------------------------------------------
x86_64_defconfig (x86_64, clang-11) — PASS, 0 errors, 2 warnings, 0 section mismatches

Warnings:
    drivers/gpu/drm/i915/gem/i915_gem_execbuffer.o: warning: objtool: eb_prefault_relocations()+0xb8: stack state mismatch: cfa1=4+8 cfa2=-1+0
    drivers/gpu/drm/i915/gem/i915_gem_execbuffer.o: warning: objtool: eb_copy_relocations()+0x259: stack state mismatch: cfa1=4+104 cfa2=-1+0

--------------------------------------------------------------------------------
x86_64_defconfig (x86_64, clang-10) — PASS, 0 errors, 2 warnings, 0 section mismatches

Warnings:
    drivers/gpu/drm/i915/gem/i915_gem_execbuffer.o: warning: objtool: eb_prefault_relocations()+0xc6: stack state mismatch: cfa1=4+8 cfa2=-1+0
    drivers/gpu/drm/i915/gem/i915_gem_execbuffer.o: warning: objtool: eb_copy_relocations()+0x249: stack state mismatch: cfa1=4+104 cfa2=-1+0

--------------------------------------------------------------------------------
x86_64_defconfig+kvm_guest (x86_64, gcc-8) — PASS, 0 errors, 0 warnings, 0 section mismatches

--------------------------------------------------------------------------------
x86_64_defconfig+x86-chromebook (x86_64, gcc-8) — PASS, 0 errors, 0 warnings, 0 section mismatches

--------------------------------------------------------------------------------
xcep_defconfig (arm, gcc-8) — PASS, 0 errors, 0 warnings, 0 section mismatches

--------------------------------------------------------------------------------
xway_defconfig (mips, gcc-8) — PASS, 0 errors, 3 warnings, 0 section mismatches

Warnings:
    kernel/sched/fair.c:8387:13: warning: ‘update_nohz_stats’ defined but not used [-Wunused-function]
    drivers/net/ethernet/lantiq_etop.c:273:4: warning: ignoring return value of ‘request_irq’, declared with attribute warn_unused_result [-Wunused-result]
    drivers/net/ethernet/lantiq_etop.c:281:4: warning: ignoring return value of ‘request_irq’, declared with attribute warn_unused_result [-Wunused-result]

--------------------------------------------------------------------------------
zeus_defconfig (arm, gcc-8) — PASS, 0 errors, 0 warnings, 0 section mismatches

---
For more info write to <info@kernelci.org>

                 reply index

Thread overview: [no followups] expand[flat|nested]  mbox.gz  Atom feed

Reply instructions:

You may reply publicly to this message via plain-text email
using any one of the following methods:

* Save the following mbox file, import it into your mail client,
  and reply-to-all from there: mbox

  Avoid top-posting and favor interleaved quoting:
  https://en.wikipedia.org/wiki/Posting_style#Interleaved_style

* Reply using the --to, --cc, and --in-reply-to
  switches of git-send-email(1):

  git send-email \
    --in-reply-to=6058787c.1c69fb81.d3f10.8c6d@mx.google.com \
    --to=bot@kernelci.org \
    --cc=linux-next@vger.kernel.org \
    /path/to/YOUR_REPLY

  https://kernel.org/pub/software/scm/git/docs/git-send-email.html

* If your mail client supports setting the In-Reply-To header
  via mailto: links, try the mailto: link

Linux-Next Archive on lore.kernel.org

Archives are clonable:
	git clone --mirror https://lore.kernel.org/linux-next/0 linux-next/git/0.git

	# If you have public-inbox 1.1+ installed, you may
	# initialize and index your mirror using the following commands:
	public-inbox-init -V2 linux-next linux-next/ https://lore.kernel.org/linux-next \
		linux-next@vger.kernel.org
	public-inbox-index linux-next

Example config snippet for mirrors

Newsgroup available over NNTP:
	nntp://nntp.lore.kernel.org/org.kernel.vger.linux-next


AGPL code for this site: git clone https://public-inbox.org/public-inbox.git