linux-next.vger.kernel.org archive mirror
 help / color / mirror / Atom feed
* next/master build: 222 builds: 11 failed, 211 passed, 34 errors, 119 warnings (next-20220512)
@ 2022-05-12 11:54 kernelci.org bot
  0 siblings, 0 replies; only message in thread
From: kernelci.org bot @ 2022-05-12 11:54 UTC (permalink / raw)
  To: linux-next

next/master build: 222 builds: 11 failed, 211 passed, 34 errors, 119 warnings (next-20220512)

Full Build Summary: https://kernelci.org/build/next/branch/master/kernel/next-20220512/

Tree: next
Branch: master
Git Describe: next-20220512
Git Commit: 187b9ac8c348383f7f36c8413d73ad89e9b1e90a
Git URL: https://git.kernel.org/pub/scm/linux/kernel/git/next/linux-next.git
Built: 7 unique architectures

Build Failures Detected:

arm64:
    allmodconfig: (clang-14) FAIL

arm:
    cros://chromeos-5.10/armel/chromiumos-arm.flavour.config: (clang-13) FAIL
    cros://chromeos-5.10/armel/chromiumos-rockchip.flavour.config: (clang-13) FAIL
    allmodconfig: (clang-14) FAIL
    allmodconfig: (gcc-10) FAIL
    rpc_defconfig: (gcc-10) FAIL
    spear3xx_defconfig: (gcc-10) FAIL

i386:
    allmodconfig: (clang-14) FAIL
    i386_defconfig+kselftest: (gcc-10) FAIL

mips:
    decstation_64_defconfig: (gcc-10) FAIL

x86_64:
    allmodconfig: (clang-14) FAIL

Errors and Warnings Detected:

arc:
    haps_hs_smp_defconfig+kselftest (gcc-10): 4 warnings

arm64:
    allmodconfig (clang-14): 3 errors, 1 warning
    defconfig+CONFIG_ARM64_16K_PAGES=y (gcc-10): 3 warnings
    defconfig+CONFIG_ARM64_64K_PAGES=y (gcc-10): 3 warnings
    defconfig+CONFIG_ARM64_64K_PAGES=y (clang-14): 3 warnings
    defconfig+CONFIG_CPU_BIG_ENDIAN=y (gcc-10): 3 warnings
    defconfig+arm64-chromebook (gcc-10): 3 warnings
    defconfig+crypto (gcc-10): 3 warnings
    defconfig+debug (gcc-10): 3 warnings
    defconfig+ima (gcc-10): 3 warnings

arm:
    allmodconfig (gcc-10): 5 errors, 2 warnings
    allmodconfig (clang-14): 1 error, 13 warnings
    aspeed_g5_defconfig (clang-14): 10 warnings
    bcm2835_defconfig (gcc-10): 1 warning
    cros://chromeos-5.10/armel/chromiumos-arm.flavour.config (clang-13): 1 error, 5 warnings
    cros://chromeos-5.10/armel/chromiumos-rockchip.flavour.config (clang-13): 1 error, 5 warnings
    multi_v5_defconfig (clang-14): 5 warnings
    multi_v7_defconfig (clang-14): 15 warnings
    multi_v7_defconfig+kselftest (gcc-10): 6 warnings
    rpc_defconfig (gcc-10): 2 errors
    spear3xx_defconfig (gcc-10): 10 errors

i386:
    allmodconfig (clang-14): 1 error
    allnoconfig (clang-14): 2 warnings
    i386_defconfig+kselftest (gcc-10): 4 errors, 1 warning

mips:
    32r2el_defconfig (gcc-10): 1 warning
    32r2el_defconfig+debug (gcc-10): 1 warning
    32r2el_defconfig+kselftest (gcc-10): 5 warnings
    fuloong2e_defconfig (gcc-10): 1 error
    lemote2f_defconfig (gcc-10): 1 error
    loongson2k_defconfig (gcc-10): 1 error
    loongson3_defconfig (gcc-10): 1 error
    rb532_defconfig (gcc-10): 1 warning

riscv:

x86_64:
    allmodconfig (clang-14): 2 errors, 17 warnings

Errors summary:

    10   ./../include/linux/compiler_types.h:352:38: error: call to ‘__compiletime_assert_256’ declared with attribute error: BUILD_BUG_ON failed: sizeof(*edid) != EDID_LENGTH
    4    drivers/misc/lkdtm/cfi.c:62:3: error: cast to pointer from integer of different size [-Werror=int-to-pointer-cast]
    4    drivers/misc/lkdtm/cfi.c:62:30: error: cast from pointer to integer of different size [-Werror=pointer-to-int-cast]
    4    cc1: error: ‘-mloongson-mmi’ must be used with ‘-mhard-float’
    2    lib/maple_tree.c:4203:20: error: stack frame size (1096) exceeds limit (1024) in function 'mas_wr_modify' [-Werror,-Wframe-larger-than]
    2    include/linux/fortify-string.h:328:4: error: call to __write_overflow_field declared with 'warning' attribute: detected write beyond size of field (1st parameter); maybe use struct_group()? [-Werror,-Wattribute-warning]
    2    drivers/i2c/busses/i2c-at91-master.c:707:6: error: variable 'dma_buf' is used uninitialized whenever 'if' condition is false [-Werror,-Wsometimes-uninitialized]
    1    sound/soc/intel/avs/path.c:815:18: error: stack frame size (2192) exceeds limit (2048) in 'avs_path_create' [-Werror,-Wframe-larger-than]
    1    lib/maple_tree.c:4203:20: error: stack frame size (1144) exceeds limit (1024) in 'mas_wr_modify' [-Werror,-Wframe-larger-than]
    1    lib/maple_tree.c:4203:20: error: stack frame size (1072) exceeds limit (1024) in 'mas_wr_modify' [-Werror,-Wframe-larger-than]
    1    include/linux/fortify-string.h:328:4: error: call to ‘__write_overflow_field’ declared with attribute warning: detected write beyond size of field (1st parameter); maybe use struct_group()? [-Werror=attribute-warning]
    1    arch/arm/kernel/head.S:319: Error: missing expression -- `ldr r7,=0x'
    1    arch/arm/kernel/head.S:319: Error: missing expression -- `ldr r3,=0x'

Warnings summary:

    24   WARNING: unmet direct dependencies detected for ARCH_ENABLE_MEMORY_HOTREMOVE
    23   clang: warning: argument unused during compilation: '-march=armv6k' [-Wunused-command-line-argument]
    20   clang: warning: argument unused during compilation: '-march=armv7-a' [-Wunused-command-line-argument]
    6    drivers/misc/lkdtm/cfi.c:62:3: warning: cast to pointer from integer of different size [-Wint-to-pointer-cast]
    6    drivers/misc/lkdtm/cfi.c:62:30: warning: cast from pointer to integer of different size [-Wpointer-to-int-cast]
    5    1 warning generated.
    4    drivers/i2c/busses/i2c-at91-master.c:659:13: note: initialize the variable 'dma_buf' to silence this warning
    3    cc1: all warnings being treated as errors
    3    arch/mips/boot/dts/img/boston.dts:128.19-178.5: Warning (pci_device_reg): /pci@14000000/pci2_root@0,0,0: PCI unit address format error, expected "0,0"
    2    include/linux/fortify-string.h:328:4: warning: call to ‘__write_overflow_field’ declared with attribute warning: detected write beyond size of field (1st parameter); maybe use struct_group()? [-Wattribute-warning]
    2    drivers/i2c/busses/i2c-at91-master.c:707:6: warning: variable 'dma_buf' is used uninitialized whenever 'if' condition is false [-Wsometimes-uninitialized]
    1    vmlinux.o: warning: objtool: vc_switch_off_ist+0x8e: call to memcpy() leaves .noinstr.text section
    1    vmlinux.o: warning: objtool: sync_regs+0x24: call to memcpy() leaves .noinstr.text section
    1    vmlinux.o: warning: objtool: fixup_bad_iret+0x36: call to memset() leaves .noinstr.text section
    1    vmlinux.o: warning: objtool: __startup_64() falls through to next function startup_64_setup_env()
    1    vmlinux.o: warning: objtool: __sev_put_ghcb+0x35: call to memcpy() leaves .noinstr.text section
    1    vmlinux.o: warning: objtool: __sev_get_ghcb+0xa0: call to memcpy() leaves .noinstr.text section
    1    lib/maple_tree.c:4203:20: warning: stack frame size (1104) exceeds limit (1024) in 'mas_wr_modify' [-Wframe-larger-than]
    1    lib/maple_tree.c:4203:20: warning: stack frame size (1088) exceeds limit (1024) in 'mas_wr_modify' [-Wframe-larger-than]
    1    lib/maple_tree.c:4203:20: warning: stack frame size (1076) exceeds limit (1024) in 'mas_wr_modify' [-Wframe-larger-than]
    1    include/linux/bitmap.h:261:2: warning: ‘memcpy’ forming offset [20, 23] is out of the bounds [0, 20] [-Warray-bounds]
    1    fs/reiserfs/reiserfs.prelink.o: warning: objtool: leaf_copy_items_entirely+0x7fd: stack state mismatch: cfa1=4+240 cfa2=4+232
    1    drivers/video/fbdev/udlfb.prelink.o: warning: objtool: dlfb_ops_write() falls through to next function dlfb_ops_setcolreg()
    1    drivers/video/fbdev/smscufx.prelink.o: warning: objtool: ufx_ops_write() falls through to next function ufx_ops_setcolreg()
    1    drivers/soc/qcom/qcom_rpmh.prelink.o: warning: objtool: rpmh_rsc_write_ctrl_data() falls through to next function trace_raw_output_rpmh_tx_done()
    1    drivers/scsi/mpi3mr/mpi3mr.prelink.o: warning: objtool: mpi3mr_op_request_post() falls through to next function mpi3mr_check_rh_fault_ioc()
    1    drivers/gpu/drm/radeon/radeon.prelink.o: warning: objtool: sumo_dpm_set_power_state() falls through to next function sumo_dpm_post_set_power_state()
    1    cc1: warning: result of ‘-117440512 << 16’ requires 44 bits to represent, but ‘int’ only has 32 bits [-Wshift-overflow=]
    1    arch/x86/kvm/kvm.prelink.o: warning: objtool: paging64_update_accessed_dirty_bits+0x39e: call to __ubsan_handle_load_invalid_value() with UACCESS enabled
    1    arch/x86/kvm/kvm.prelink.o: warning: objtool: paging32_update_accessed_dirty_bits+0x390: call to __ubsan_handle_load_invalid_value() with UACCESS enabled
    1    arch/x86/kvm/kvm.prelink.o: warning: objtool: ept_update_accessed_dirty_bits+0x435: call to __ubsan_handle_load_invalid_value() with UACCESS enabled
    1    arch/x86/kvm/kvm.prelink.o: warning: objtool: emulator_cmpxchg_emulated+0x72b: call to __ubsan_handle_load_invalid_value() with UACCESS enabled

Section mismatches summary:

    1    WARNING: modpost: vmlinux.o(.text+0x15d197): Section mismatch in reference from the function __next_node() to the variable .init.data:numa_nodes_parsed

================================================================================

Detailed per-defconfig build reports:

--------------------------------------------------------------------------------
32r2el_defconfig (mips, gcc-10) — PASS, 0 errors, 1 warning, 0 section mismatches

Warnings:
    arch/mips/boot/dts/img/boston.dts:128.19-178.5: Warning (pci_device_reg): /pci@14000000/pci2_root@0,0,0: PCI unit address format error, expected "0,0"

--------------------------------------------------------------------------------
32r2el_defconfig+debug (mips, gcc-10) — PASS, 0 errors, 1 warning, 0 section mismatches

Warnings:
    arch/mips/boot/dts/img/boston.dts:128.19-178.5: Warning (pci_device_reg): /pci@14000000/pci2_root@0,0,0: PCI unit address format error, expected "0,0"

--------------------------------------------------------------------------------
32r2el_defconfig+kselftest (mips, gcc-10) — PASS, 0 errors, 5 warnings, 0 section mismatches

Warnings:
    arch/mips/boot/dts/img/boston.dts:128.19-178.5: Warning (pci_device_reg): /pci@14000000/pci2_root@0,0,0: PCI unit address format error, expected "0,0"
    drivers/misc/lkdtm/cfi.c:62:30: warning: cast from pointer to integer of different size [-Wpointer-to-int-cast]
    drivers/misc/lkdtm/cfi.c:62:3: warning: cast to pointer from integer of different size [-Wint-to-pointer-cast]
    drivers/misc/lkdtm/cfi.c:62:30: warning: cast from pointer to integer of different size [-Wpointer-to-int-cast]
    drivers/misc/lkdtm/cfi.c:62:3: warning: cast to pointer from integer of different size [-Wint-to-pointer-cast]

--------------------------------------------------------------------------------
allmodconfig (i386, clang-14) — FAIL, 1 error, 0 warnings, 0 section mismatches

Errors:
    lib/maple_tree.c:4203:20: error: stack frame size (1072) exceeds limit (1024) in 'mas_wr_modify' [-Werror,-Wframe-larger-than]

--------------------------------------------------------------------------------
allmodconfig (x86_64, clang-14) — FAIL, 2 errors, 17 warnings, 0 section mismatches

Errors:
    include/linux/fortify-string.h:328:4: error: call to __write_overflow_field declared with 'warning' attribute: detected write beyond size of field (1st parameter); maybe use struct_group()? [-Werror,-Wattribute-warning]
    drivers/i2c/busses/i2c-at91-master.c:707:6: error: variable 'dma_buf' is used uninitialized whenever 'if' condition is false [-Werror,-Wsometimes-uninitialized]

Warnings:
    vmlinux.o: warning: objtool: __startup_64() falls through to next function startup_64_setup_env()
    vmlinux.o: warning: objtool: sync_regs+0x24: call to memcpy() leaves .noinstr.text section
    vmlinux.o: warning: objtool: vc_switch_off_ist+0x8e: call to memcpy() leaves .noinstr.text section
    vmlinux.o: warning: objtool: fixup_bad_iret+0x36: call to memset() leaves .noinstr.text section
    vmlinux.o: warning: objtool: __sev_get_ghcb+0xa0: call to memcpy() leaves .noinstr.text section
    vmlinux.o: warning: objtool: __sev_put_ghcb+0x35: call to memcpy() leaves .noinstr.text section
    arch/x86/kvm/kvm.prelink.o: warning: objtool: emulator_cmpxchg_emulated+0x72b: call to __ubsan_handle_load_invalid_value() with UACCESS enabled
    arch/x86/kvm/kvm.prelink.o: warning: objtool: paging64_update_accessed_dirty_bits+0x39e: call to __ubsan_handle_load_invalid_value() with UACCESS enabled
    arch/x86/kvm/kvm.prelink.o: warning: objtool: paging32_update_accessed_dirty_bits+0x390: call to __ubsan_handle_load_invalid_value() with UACCESS enabled
    arch/x86/kvm/kvm.prelink.o: warning: objtool: ept_update_accessed_dirty_bits+0x435: call to __ubsan_handle_load_invalid_value() with UACCESS enabled
    fs/reiserfs/reiserfs.prelink.o: warning: objtool: leaf_copy_items_entirely+0x7fd: stack state mismatch: cfa1=4+240 cfa2=4+232
    drivers/soc/qcom/qcom_rpmh.prelink.o: warning: objtool: rpmh_rsc_write_ctrl_data() falls through to next function trace_raw_output_rpmh_tx_done()
    drivers/video/fbdev/udlfb.prelink.o: warning: objtool: dlfb_ops_write() falls through to next function dlfb_ops_setcolreg()
    drivers/video/fbdev/smscufx.prelink.o: warning: objtool: ufx_ops_write() falls through to next function ufx_ops_setcolreg()
    drivers/scsi/mpi3mr/mpi3mr.prelink.o: warning: objtool: mpi3mr_op_request_post() falls through to next function mpi3mr_check_rh_fault_ioc()
    drivers/gpu/drm/radeon/radeon.prelink.o: warning: objtool: sumo_dpm_set_power_state() falls through to next function sumo_dpm_post_set_power_state()
    drivers/i2c/busses/i2c-at91-master.c:659:13: note: initialize the variable 'dma_buf' to silence this warning

Section mismatches:
    WARNING: modpost: vmlinux.o(.text+0x15d197): Section mismatch in reference from the function __next_node() to the variable .init.data:numa_nodes_parsed

--------------------------------------------------------------------------------
allmodconfig (arm, gcc-10) — FAIL, 5 errors, 2 warnings, 0 section mismatches

Errors:
    drivers/misc/lkdtm/cfi.c:62:30: error: cast from pointer to integer of different size [-Werror=pointer-to-int-cast]
    drivers/misc/lkdtm/cfi.c:62:3: error: cast to pointer from integer of different size [-Werror=int-to-pointer-cast]
    drivers/misc/lkdtm/cfi.c:62:30: error: cast from pointer to integer of different size [-Werror=pointer-to-int-cast]
    drivers/misc/lkdtm/cfi.c:62:3: error: cast to pointer from integer of different size [-Werror=int-to-pointer-cast]
    include/linux/fortify-string.h:328:4: error: call to ‘__write_overflow_field’ declared with attribute warning: detected write beyond size of field (1st parameter); maybe use struct_group()? [-Werror=attribute-warning]

Warnings:
    cc1: all warnings being treated as errors
    cc1: all warnings being treated as errors

--------------------------------------------------------------------------------
allmodconfig (arm64, gcc-10) — PASS, 0 errors, 0 warnings, 0 section mismatches

--------------------------------------------------------------------------------
allmodconfig (arm64, clang-14) — FAIL, 3 errors, 1 warning, 0 section mismatches

Errors:
    sound/soc/intel/avs/path.c:815:18: error: stack frame size (2192) exceeds limit (2048) in 'avs_path_create' [-Werror,-Wframe-larger-than]
    drivers/i2c/busses/i2c-at91-master.c:707:6: error: variable 'dma_buf' is used uninitialized whenever 'if' condition is false [-Werror,-Wsometimes-uninitialized]
    include/linux/fortify-string.h:328:4: error: call to __write_overflow_field declared with 'warning' attribute: detected write beyond size of field (1st parameter); maybe use struct_group()? [-Werror,-Wattribute-warning]

Warnings:
    drivers/i2c/busses/i2c-at91-master.c:659:13: note: initialize the variable 'dma_buf' to silence this warning

--------------------------------------------------------------------------------
allmodconfig (arm, clang-14) — FAIL, 1 error, 13 warnings, 0 section mismatches

Errors:
    lib/maple_tree.c:4203:20: error: stack frame size (1144) exceeds limit (1024) in 'mas_wr_modify' [-Werror,-Wframe-larger-than]

Warnings:
    clang: warning: argument unused during compilation: '-march=armv6k' [-Wunused-command-line-argument]
    clang: warning: argument unused during compilation: '-march=armv6k' [-Wunused-command-line-argument]
    clang: warning: argument unused during compilation: '-march=armv6k' [-Wunused-command-line-argument]
    clang: warning: argument unused during compilation: '-march=armv6k' [-Wunused-command-line-argument]
    clang: warning: argument unused during compilation: '-march=armv6k' [-Wunused-command-line-argument]
    clang: warning: argument unused during compilation: '-march=armv6k' [-Wunused-command-line-argument]
    clang: warning: argument unused during compilation: '-march=armv6k' [-Wunused-command-line-argument]
    clang: warning: argument unused during compilation: '-march=armv6k' [-Wunused-command-line-argument]
    clang: warning: argument unused during compilation: '-march=armv6k' [-Wunused-command-line-argument]
    clang: warning: argument unused during compilation: '-march=armv6k' [-Wunused-command-line-argument]
    clang: warning: argument unused during compilation: '-march=armv6k' [-Wunused-command-line-argument]
    clang: warning: argument unused during compilation: '-march=armv6k' [-Wunused-command-line-argument]
    clang: warning: argument unused during compilation: '-march=armv6k' [-Wunused-command-line-argument]

--------------------------------------------------------------------------------
allnoconfig (x86_64, gcc-10) — PASS, 0 errors, 0 warnings, 0 section mismatches

--------------------------------------------------------------------------------
allnoconfig (i386, gcc-10) — PASS, 0 errors, 0 warnings, 0 section mismatches

--------------------------------------------------------------------------------
allnoconfig (i386, clang-14) — PASS, 0 errors, 2 warnings, 0 section mismatches

Warnings:
    lib/maple_tree.c:4203:20: warning: stack frame size (1076) exceeds limit (1024) in 'mas_wr_modify' [-Wframe-larger-than]
    1 warning generated.

--------------------------------------------------------------------------------
allnoconfig (x86_64, clang-14) — PASS, 0 errors, 0 warnings, 0 section mismatches

--------------------------------------------------------------------------------
allnoconfig (arc, gcc-10) — PASS, 0 errors, 0 warnings, 0 section mismatches

--------------------------------------------------------------------------------
am200epdkit_defconfig (arm, gcc-10) — PASS, 0 errors, 0 warnings, 0 section mismatches

--------------------------------------------------------------------------------
ar7_defconfig (mips, gcc-10) — PASS, 0 errors, 0 warnings, 0 section mismatches

--------------------------------------------------------------------------------
aspeed_g4_defconfig (arm, gcc-10) — PASS, 0 errors, 0 warnings, 0 section mismatches

--------------------------------------------------------------------------------
aspeed_g5_defconfig (arm, clang-14) — PASS, 0 errors, 10 warnings, 0 section mismatches

Warnings:
    clang: warning: argument unused during compilation: '-march=armv6k' [-Wunused-command-line-argument]
    clang: warning: argument unused during compilation: '-march=armv6k' [-Wunused-command-line-argument]
    clang: warning: argument unused during compilation: '-march=armv6k' [-Wunused-command-line-argument]
    clang: warning: argument unused during compilation: '-march=armv6k' [-Wunused-command-line-argument]
    clang: warning: argument unused during compilation: '-march=armv6k' [-Wunused-command-line-argument]
    clang: warning: argument unused during compilation: '-march=armv6k' [-Wunused-command-line-argument]
    clang: warning: argument unused during compilation: '-march=armv6k' [-Wunused-command-line-argument]
    clang: warning: argument unused during compilation: '-march=armv6k' [-Wunused-command-line-argument]
    clang: warning: argument unused during compilation: '-march=armv6k' [-Wunused-command-line-argument]
    clang: warning: argument unused during compilation: '-march=armv6k' [-Wunused-command-line-argument]

--------------------------------------------------------------------------------
aspeed_g5_defconfig (arm, gcc-10) — PASS, 0 errors, 0 warnings, 0 section mismatches

--------------------------------------------------------------------------------
assabet_defconfig (arm, gcc-10) — PASS, 0 errors, 0 warnings, 0 section mismatches

--------------------------------------------------------------------------------
at91_dt_defconfig (arm, gcc-10) — PASS, 0 errors, 0 warnings, 0 section mismatches

--------------------------------------------------------------------------------
ath25_defconfig (mips, gcc-10) — PASS, 0 errors, 0 warnings, 0 section mismatches

--------------------------------------------------------------------------------
ath79_defconfig (mips, gcc-10) — PASS, 0 errors, 0 warnings, 0 section mismatches

--------------------------------------------------------------------------------
axm55xx_defconfig (arm, gcc-10) — PASS, 0 errors, 0 warnings, 0 section mismatches

--------------------------------------------------------------------------------
axs103_defconfig (arc, gcc-10) — PASS, 0 errors, 0 warnings, 0 section mismatches

--------------------------------------------------------------------------------
axs103_smp_defconfig (arc, gcc-10) — PASS, 0 errors, 0 warnings, 0 section mismatches

--------------------------------------------------------------------------------
badge4_defconfig (arm, gcc-10) — PASS, 0 errors, 0 warnings, 0 section mismatches

--------------------------------------------------------------------------------
bcm2835_defconfig (arm, gcc-10) — PASS, 0 errors, 1 warning, 0 section mismatches

Warnings:
    include/linux/bitmap.h:261:2: warning: ‘memcpy’ forming offset [20, 23] is out of the bounds [0, 20] [-Warray-bounds]

--------------------------------------------------------------------------------
bcm47xx_defconfig (mips, gcc-10) — PASS, 0 errors, 0 warnings, 0 section mismatches

--------------------------------------------------------------------------------
bcm63xx_defconfig (mips, gcc-10) — PASS, 0 errors, 0 warnings, 0 section mismatches

--------------------------------------------------------------------------------
bigsur_defconfig (mips, gcc-10) — PASS, 0 errors, 0 warnings, 0 section mismatches

--------------------------------------------------------------------------------
bmips_be_defconfig (mips, gcc-10) — PASS, 0 errors, 0 warnings, 0 section mismatches

--------------------------------------------------------------------------------
bmips_stb_defconfig (mips, gcc-10) — PASS, 0 errors, 0 warnings, 0 section mismatches

--------------------------------------------------------------------------------
capcella_defconfig (mips, gcc-10) — PASS, 0 errors, 0 warnings, 0 section mismatches

--------------------------------------------------------------------------------
cavium_octeon_defconfig (mips, gcc-10) — PASS, 0 errors, 0 warnings, 0 section mismatches

--------------------------------------------------------------------------------
cerfcube_defconfig (arm, gcc-10) — PASS, 0 errors, 0 warnings, 0 section mismatches

--------------------------------------------------------------------------------
ci20_defconfig (mips, gcc-10) — PASS, 0 errors, 0 warnings, 0 section mismatches

--------------------------------------------------------------------------------
cm_x300_defconfig (arm, gcc-10) — PASS, 0 errors, 0 warnings, 0 section mismatches

--------------------------------------------------------------------------------
cobalt_defconfig (mips, gcc-10) — PASS, 0 errors, 0 warnings, 0 section mismatches

--------------------------------------------------------------------------------
colibri_pxa270_defconfig (arm, gcc-10) — PASS, 0 errors, 0 warnings, 0 section mismatches

--------------------------------------------------------------------------------
colibri_pxa300_defconfig (arm, gcc-10) — PASS, 0 errors, 0 warnings, 0 section mismatches

--------------------------------------------------------------------------------
collie_defconfig (arm, gcc-10) — PASS, 0 errors, 0 warnings, 0 section mismatches

--------------------------------------------------------------------------------
corgi_defconfig (arm, gcc-10) — PASS, 0 errors, 0 warnings, 0 section mismatches

--------------------------------------------------------------------------------
cros://chromeos-5.10/armel/chromiumos-arm.flavour.config (arm, clang-13) — FAIL, 1 error, 5 warnings, 0 section mismatches

Errors:
    lib/maple_tree.c:4203:20: error: stack frame size (1096) exceeds limit (1024) in function 'mas_wr_modify' [-Werror,-Wframe-larger-than]

Warnings:
    clang: warning: argument unused during compilation: '-march=armv7-a' [-Wunused-command-line-argument]
    clang: warning: argument unused during compilation: '-march=armv7-a' [-Wunused-command-line-argument]
    clang: warning: argument unused during compilation: '-march=armv7-a' [-Wunused-command-line-argument]
    clang: warning: argument unused during compilation: '-march=armv7-a' [-Wunused-command-line-argument]
    clang: warning: argument unused during compilation: '-march=armv7-a' [-Wunused-command-line-argument]

--------------------------------------------------------------------------------
cros://chromeos-5.10/armel/chromiumos-rockchip.flavour.config (arm, clang-13) — FAIL, 1 error, 5 warnings, 0 section mismatches

Errors:
    lib/maple_tree.c:4203:20: error: stack frame size (1096) exceeds limit (1024) in function 'mas_wr_modify' [-Werror,-Wframe-larger-than]

Warnings:
    clang: warning: argument unused during compilation: '-march=armv7-a' [-Wunused-command-line-argument]
    clang: warning: argument unused during compilation: '-march=armv7-a' [-Wunused-command-line-argument]
    clang: warning: argument unused during compilation: '-march=armv7-a' [-Wunused-command-line-argument]
    clang: warning: argument unused during compilation: '-march=armv7-a' [-Wunused-command-line-argument]
    clang: warning: argument unused during compilation: '-march=armv7-a' [-Wunused-command-line-argument]

--------------------------------------------------------------------------------
cu1000-neo_defconfig (mips, gcc-10) — PASS, 0 errors, 0 warnings, 0 section mismatches

--------------------------------------------------------------------------------
cu1830-neo_defconfig (mips, gcc-10) — PASS, 0 errors, 0 warnings, 0 section mismatches

--------------------------------------------------------------------------------
davinci_all_defconfig (arm, gcc-10) — PASS, 0 errors, 0 warnings, 0 section mismatches

--------------------------------------------------------------------------------
db1xxx_defconfig (mips, gcc-10) — PASS, 0 errors, 0 warnings, 0 section mismatches

--------------------------------------------------------------------------------
decstation_64_defconfig (mips, gcc-10) — FAIL, 0 errors, 0 warnings, 0 section mismatches

--------------------------------------------------------------------------------
decstation_defconfig (mips, gcc-10) — PASS, 0 errors, 0 warnings, 0 section mismatches

--------------------------------------------------------------------------------
decstation_r4k_defconfig (mips, gcc-10) — PASS, 0 errors, 0 warnings, 0 section mismatches

--------------------------------------------------------------------------------
defconfig (riscv, gcc-10) — PASS, 0 errors, 0 warnings, 0 section mismatches

--------------------------------------------------------------------------------
defconfig (arm64, gcc-10) — PASS, 0 errors, 0 warnings, 0 section mismatches

--------------------------------------------------------------------------------
defconfig (arm64, clang-14) — PASS, 0 errors, 0 warnings, 0 section mismatches

--------------------------------------------------------------------------------
defconfig+CONFIG_ARM64_16K_PAGES=y (arm64, gcc-10) — PASS, 0 errors, 3 warnings, 0 section mismatches

Warnings:
    WARNING: unmet direct dependencies detected for ARCH_ENABLE_MEMORY_HOTREMOVE
    WARNING: unmet direct dependencies detected for ARCH_ENABLE_MEMORY_HOTREMOVE
    WARNING: unmet direct dependencies detected for ARCH_ENABLE_MEMORY_HOTREMOVE

--------------------------------------------------------------------------------
defconfig+CONFIG_ARM64_64K_PAGES=y (arm64, gcc-10) — PASS, 0 errors, 3 warnings, 0 section mismatches

Warnings:
    WARNING: unmet direct dependencies detected for ARCH_ENABLE_MEMORY_HOTREMOVE
    WARNING: unmet direct dependencies detected for ARCH_ENABLE_MEMORY_HOTREMOVE
    WARNING: unmet direct dependencies detected for ARCH_ENABLE_MEMORY_HOTREMOVE

--------------------------------------------------------------------------------
defconfig+CONFIG_ARM64_64K_PAGES=y (arm64, clang-14) — PASS, 0 errors, 3 warnings, 0 section mismatches

Warnings:
    WARNING: unmet direct dependencies detected for ARCH_ENABLE_MEMORY_HOTREMOVE
    WARNING: unmet direct dependencies detected for ARCH_ENABLE_MEMORY_HOTREMOVE
    WARNING: unmet direct dependencies detected for ARCH_ENABLE_MEMORY_HOTREMOVE

--------------------------------------------------------------------------------
defconfig+CONFIG_CPU_BIG_ENDIAN=y (arm64, gcc-10) — PASS, 0 errors, 3 warnings, 0 section mismatches

Warnings:
    WARNING: unmet direct dependencies detected for ARCH_ENABLE_MEMORY_HOTREMOVE
    WARNING: unmet direct dependencies detected for ARCH_ENABLE_MEMORY_HOTREMOVE
    WARNING: unmet direct dependencies detected for ARCH_ENABLE_MEMORY_HOTREMOVE

--------------------------------------------------------------------------------
defconfig+CONFIG_EFI=n (riscv, clang-14) — PASS, 0 errors, 0 warnings, 0 section mismatches

--------------------------------------------------------------------------------
defconfig+CONFIG_RANDOMIZE_BASE=y (arm64, gcc-10) — PASS, 0 errors, 0 warnings, 0 section mismatches

--------------------------------------------------------------------------------
defconfig+arm64-chromebook (arm64, gcc-10) — PASS, 0 errors, 3 warnings, 0 section mismatches

Warnings:
    WARNING: unmet direct dependencies detected for ARCH_ENABLE_MEMORY_HOTREMOVE
    WARNING: unmet direct dependencies detected for ARCH_ENABLE_MEMORY_HOTREMOVE
    WARNING: unmet direct dependencies detected for ARCH_ENABLE_MEMORY_HOTREMOVE

--------------------------------------------------------------------------------
defconfig+arm64-chromebook+kselftest (arm64, gcc-10) — PASS, 0 errors, 0 warnings, 0 section mismatches

--------------------------------------------------------------------------------
defconfig+crypto (arm64, gcc-10) — PASS, 0 errors, 3 warnings, 0 section mismatches

Warnings:
    WARNING: unmet direct dependencies detected for ARCH_ENABLE_MEMORY_HOTREMOVE
    WARNING: unmet direct dependencies detected for ARCH_ENABLE_MEMORY_HOTREMOVE
    WARNING: unmet direct dependencies detected for ARCH_ENABLE_MEMORY_HOTREMOVE

--------------------------------------------------------------------------------
defconfig+debug (riscv, gcc-10) — PASS, 0 errors, 0 warnings, 0 section mismatches

--------------------------------------------------------------------------------
defconfig+debug (arm64, gcc-10) — PASS, 0 errors, 3 warnings, 0 section mismatches

Warnings:
    WARNING: unmet direct dependencies detected for ARCH_ENABLE_MEMORY_HOTREMOVE
    WARNING: unmet direct dependencies detected for ARCH_ENABLE_MEMORY_HOTREMOVE
    WARNING: unmet direct dependencies detected for ARCH_ENABLE_MEMORY_HOTREMOVE

--------------------------------------------------------------------------------
defconfig+ima (arm64, gcc-10) — PASS, 0 errors, 3 warnings, 0 section mismatches

Warnings:
    WARNING: unmet direct dependencies detected for ARCH_ENABLE_MEMORY_HOTREMOVE
    WARNING: unmet direct dependencies detected for ARCH_ENABLE_MEMORY_HOTREMOVE
    WARNING: unmet direct dependencies detected for ARCH_ENABLE_MEMORY_HOTREMOVE

--------------------------------------------------------------------------------
defconfig+kselftest (arm64, gcc-10) — PASS, 0 errors, 0 warnings, 0 section mismatches

--------------------------------------------------------------------------------
defconfig+kselftest (riscv, gcc-10) — PASS, 0 errors, 0 warnings, 0 section mismatches

--------------------------------------------------------------------------------
e55_defconfig (mips, gcc-10) — PASS, 0 errors, 0 warnings, 0 section mismatches

--------------------------------------------------------------------------------
eseries_pxa_defconfig (arm, gcc-10) — PASS, 0 errors, 0 warnings, 0 section mismatches

--------------------------------------------------------------------------------
exynos_defconfig (arm, gcc-10) — PASS, 0 errors, 0 warnings, 0 section mismatches

--------------------------------------------------------------------------------
ezx_defconfig (arm, gcc-10) — PASS, 0 errors, 0 warnings, 0 section mismatches

--------------------------------------------------------------------------------
footbridge_defconfig (arm, gcc-10) — PASS, 0 errors, 0 warnings, 0 section mismatches

--------------------------------------------------------------------------------
fuloong2e_defconfig (mips, gcc-10) — PASS, 1 error, 0 warnings, 0 section mismatches

Errors:
    cc1: error: ‘-mloongson-mmi’ must be used with ‘-mhard-float’

--------------------------------------------------------------------------------
gcw0_defconfig (mips, gcc-10) — PASS, 0 errors, 0 warnings, 0 section mismatches

--------------------------------------------------------------------------------
gemini_defconfig (arm, gcc-10) — PASS, 0 errors, 0 warnings, 0 section mismatches

--------------------------------------------------------------------------------
gpr_defconfig (mips, gcc-10) — PASS, 0 errors, 0 warnings, 0 section mismatches

--------------------------------------------------------------------------------
h3600_defconfig (arm, gcc-10) — PASS, 0 errors, 0 warnings, 0 section mismatches

--------------------------------------------------------------------------------
h5000_defconfig (arm, gcc-10) — PASS, 0 errors, 0 warnings, 0 section mismatches

--------------------------------------------------------------------------------
hackkit_defconfig (arm, gcc-10) — PASS, 0 errors, 0 warnings, 0 section mismatches

--------------------------------------------------------------------------------
haps_hs_defconfig (arc, gcc-10) — PASS, 0 errors, 0 warnings, 0 section mismatches

--------------------------------------------------------------------------------
haps_hs_smp_defconfig (arc, gcc-10) — PASS, 0 errors, 0 warnings, 0 section mismatches

--------------------------------------------------------------------------------
haps_hs_smp_defconfig+debug (arc, gcc-10) — PASS, 0 errors, 0 warnings, 0 section mismatches

--------------------------------------------------------------------------------
haps_hs_smp_defconfig+kselftest (arc, gcc-10) — PASS, 0 errors, 4 warnings, 0 section mismatches

Warnings:
    drivers/misc/lkdtm/cfi.c:62:30: warning: cast from pointer to integer of different size [-Wpointer-to-int-cast]
    drivers/misc/lkdtm/cfi.c:62:3: warning: cast to pointer from integer of different size [-Wint-to-pointer-cast]
    drivers/misc/lkdtm/cfi.c:62:30: warning: cast from pointer to integer of different size [-Wpointer-to-int-cast]
    drivers/misc/lkdtm/cfi.c:62:3: warning: cast to pointer from integer of different size [-Wint-to-pointer-cast]

--------------------------------------------------------------------------------
hisi_defconfig (arm, gcc-10) — PASS, 0 errors, 0 warnings, 0 section mismatches

--------------------------------------------------------------------------------
hsdk_defconfig (arc, gcc-10) — PASS, 0 errors, 0 warnings, 0 section mismatches

--------------------------------------------------------------------------------
i386_defconfig (i386, gcc-10) — PASS, 0 errors, 0 warnings, 0 section mismatches

--------------------------------------------------------------------------------
i386_defconfig (i386, clang-14) — PASS, 0 errors, 0 warnings, 0 section mismatches

--------------------------------------------------------------------------------
i386_defconfig+debug (i386, gcc-10) — PASS, 0 errors, 0 warnings, 0 section mismatches

--------------------------------------------------------------------------------
i386_defconfig+kselftest (i386, gcc-10) — FAIL, 4 errors, 1 warning, 0 section mismatches

Errors:
    drivers/misc/lkdtm/cfi.c:62:30: error: cast from pointer to integer of different size [-Werror=pointer-to-int-cast]
    drivers/misc/lkdtm/cfi.c:62:3: error: cast to pointer from integer of different size [-Werror=int-to-pointer-cast]
    drivers/misc/lkdtm/cfi.c:62:30: error: cast from pointer to integer of different size [-Werror=pointer-to-int-cast]
    drivers/misc/lkdtm/cfi.c:62:3: error: cast to pointer from integer of different size [-Werror=int-to-pointer-cast]

Warnings:
    cc1: all warnings being treated as errors

--------------------------------------------------------------------------------
imx_v4_v5_defconfig (arm, gcc-10) — PASS, 0 errors, 0 warnings, 0 section mismatches

--------------------------------------------------------------------------------
imx_v6_v7_defconfig (arm, gcc-10) — PASS, 0 errors, 0 warnings, 0 section mismatches

--------------------------------------------------------------------------------
imxrt_defconfig (arm, gcc-10) — PASS, 0 errors, 0 warnings, 0 section mismatches

--------------------------------------------------------------------------------
integrator_defconfig (arm, gcc-10) — PASS, 0 errors, 0 warnings, 0 section mismatches

--------------------------------------------------------------------------------
ip22_defconfig (mips, gcc-10) — PASS, 0 errors, 0 warnings, 0 section mismatches

--------------------------------------------------------------------------------
ip27_defconfig (mips, gcc-10) — PASS, 0 errors, 0 warnings, 0 section mismatches

--------------------------------------------------------------------------------
ip28_defconfig (mips, gcc-10) — PASS, 0 errors, 0 warnings, 0 section mismatches

--------------------------------------------------------------------------------
ip32_defconfig (mips, gcc-10) — PASS, 0 errors, 0 warnings, 0 section mismatches

--------------------------------------------------------------------------------
ixp4xx_defconfig (arm, gcc-10) — PASS, 0 errors, 0 warnings, 0 section mismatches

--------------------------------------------------------------------------------
jazz_defconfig (mips, gcc-10) — PASS, 0 errors, 0 warnings, 0 section mismatches

--------------------------------------------------------------------------------
jornada720_defconfig (arm, gcc-10) — PASS, 0 errors, 0 warnings, 0 section mismatches

--------------------------------------------------------------------------------
keystone_defconfig (arm, gcc-10) — PASS, 0 errors, 0 warnings, 0 section mismatches

--------------------------------------------------------------------------------
lart_defconfig (arm, gcc-10) — PASS, 0 errors, 0 warnings, 0 section mismatches

--------------------------------------------------------------------------------
lemote2f_defconfig (mips, gcc-10) — PASS, 1 error, 0 warnings, 0 section mismatches

Errors:
    cc1: error: ‘-mloongson-mmi’ must be used with ‘-mhard-float’

--------------------------------------------------------------------------------
loongson1b_defconfig (mips, gcc-10) — PASS, 0 errors, 0 warnings, 0 section mismatches

--------------------------------------------------------------------------------
loongson1c_defconfig (mips, gcc-10) — PASS, 0 errors, 0 warnings, 0 section mismatches

--------------------------------------------------------------------------------
loongson2k_defconfig (mips, gcc-10) — PASS, 1 error, 0 warnings, 0 section mismatches

Errors:
    cc1: error: ‘-mloongson-mmi’ must be used with ‘-mhard-float’

--------------------------------------------------------------------------------
loongson3_defconfig (mips, gcc-10) — PASS, 1 error, 0 warnings, 0 section mismatches

Errors:
    cc1: error: ‘-mloongson-mmi’ must be used with ‘-mhard-float’

--------------------------------------------------------------------------------
lpc18xx_defconfig (arm, gcc-10) — PASS, 0 errors, 0 warnings, 0 section mismatches

--------------------------------------------------------------------------------
lpc32xx_defconfig (arm, gcc-10) — PASS, 0 errors, 0 warnings, 0 section mismatches

--------------------------------------------------------------------------------
lpd270_defconfig (arm, gcc-10) — PASS, 0 errors, 0 warnings, 0 section mismatches

--------------------------------------------------------------------------------
lubbock_defconfig (arm, gcc-10) — PASS, 0 errors, 0 warnings, 0 section mismatches

--------------------------------------------------------------------------------
magician_defconfig (arm, gcc-10) — PASS, 0 errors, 0 warnings, 0 section mismatches

--------------------------------------------------------------------------------
mainstone_defconfig (arm, gcc-10) — PASS, 0 errors, 0 warnings, 0 section mismatches

--------------------------------------------------------------------------------
malta_defconfig (mips, gcc-10) — PASS, 0 errors, 0 warnings, 0 section mismatches

--------------------------------------------------------------------------------
malta_kvm_defconfig (mips, gcc-10) — PASS, 0 errors, 0 warnings, 0 section mismatches

--------------------------------------------------------------------------------
malta_qemu_32r6_defconfig (mips, gcc-10) — PASS, 0 errors, 0 warnings, 0 section mismatches

--------------------------------------------------------------------------------
maltaaprp_defconfig (mips, gcc-10) — PASS, 0 errors, 0 warnings, 0 section mismatches

--------------------------------------------------------------------------------
maltasmvp_defconfig (mips, gcc-10) — PASS, 0 errors, 0 warnings, 0 section mismatches

--------------------------------------------------------------------------------
maltasmvp_eva_defconfig (mips, gcc-10) — PASS, 0 errors, 0 warnings, 0 section mismatches

--------------------------------------------------------------------------------
maltaup_defconfig (mips, gcc-10) — PASS, 0 errors, 0 warnings, 0 section mismatches

--------------------------------------------------------------------------------
maltaup_xpa_defconfig (mips, gcc-10) — PASS, 0 errors, 0 warnings, 0 section mismatches

--------------------------------------------------------------------------------
milbeaut_m10v_defconfig (arm, gcc-10) — PASS, 0 errors, 0 warnings, 0 section mismatches

--------------------------------------------------------------------------------
mini2440_defconfig (arm, gcc-10) — PASS, 0 errors, 0 warnings, 0 section mismatches

--------------------------------------------------------------------------------
mmp2_defconfig (arm, gcc-10) — PASS, 0 errors, 0 warnings, 0 section mismatches

--------------------------------------------------------------------------------
moxart_defconfig (arm, gcc-10) — PASS, 0 errors, 0 warnings, 0 section mismatches

--------------------------------------------------------------------------------
mpc30x_defconfig (mips, gcc-10) — PASS, 0 errors, 0 warnings, 0 section mismatches

--------------------------------------------------------------------------------
mps2_defconfig (arm, gcc-10) — PASS, 0 errors, 0 warnings, 0 section mismatches

--------------------------------------------------------------------------------
mtx1_defconfig (mips, gcc-10) — PASS, 0 errors, 0 warnings, 0 section mismatches

--------------------------------------------------------------------------------
multi_v4t_defconfig (arm, gcc-10) — PASS, 0 errors, 0 warnings, 0 section mismatches

--------------------------------------------------------------------------------
multi_v5_defconfig (arm, gcc-10) — PASS, 0 errors, 0 warnings, 0 section mismatches

--------------------------------------------------------------------------------
multi_v5_defconfig (arm, clang-14) — PASS, 0 errors, 5 warnings, 0 section mismatches

Warnings:
    lib/maple_tree.c:4203:20: warning: stack frame size (1088) exceeds limit (1024) in 'mas_wr_modify' [-Wframe-larger-than]
    1 warning generated.
    drivers/i2c/busses/i2c-at91-master.c:707:6: warning: variable 'dma_buf' is used uninitialized whenever 'if' condition is false [-Wsometimes-uninitialized]
    drivers/i2c/busses/i2c-at91-master.c:659:13: note: initialize the variable 'dma_buf' to silence this warning
    1 warning generated.

--------------------------------------------------------------------------------
multi_v7_defconfig (arm, gcc-10) — PASS, 0 errors, 0 warnings, 0 section mismatches

--------------------------------------------------------------------------------
multi_v7_defconfig (arm, clang-14) — PASS, 0 errors, 15 warnings, 0 section mismatches

Warnings:
    clang: warning: argument unused during compilation: '-march=armv7-a' [-Wunused-command-line-argument]
    clang: warning: argument unused during compilation: '-march=armv7-a' [-Wunused-command-line-argument]
    clang: warning: argument unused during compilation: '-march=armv7-a' [-Wunused-command-line-argument]
    clang: warning: argument unused during compilation: '-march=armv7-a' [-Wunused-command-line-argument]
    clang: warning: argument unused during compilation: '-march=armv7-a' [-Wunused-command-line-argument]
    clang: warning: argument unused during compilation: '-march=armv7-a' [-Wunused-command-line-argument]
    clang: warning: argument unused during compilation: '-march=armv7-a' [-Wunused-command-line-argument]
    clang: warning: argument unused during compilation: '-march=armv7-a' [-Wunused-command-line-argument]
    clang: warning: argument unused during compilation: '-march=armv7-a' [-Wunused-command-line-argument]
    lib/maple_tree.c:4203:20: warning: stack frame size (1104) exceeds limit (1024) in 'mas_wr_modify' [-Wframe-larger-than]
    1 warning generated.
    clang: warning: argument unused during compilation: '-march=armv7-a' [-Wunused-command-line-argument]
    drivers/i2c/busses/i2c-at91-master.c:707:6: warning: variable 'dma_buf' is used uninitialized whenever 'if' condition is false [-Wsometimes-uninitialized]
    drivers/i2c/busses/i2c-at91-master.c:659:13: note: initialize the variable 'dma_buf' to silence this warning
    1 warning generated.

--------------------------------------------------------------------------------
multi_v7_defconfig+CONFIG_CPU_BIG_ENDIAN=y (arm, gcc-10) — PASS, 0 errors, 0 warnings, 0 section mismatches

--------------------------------------------------------------------------------
multi_v7_defconfig+CONFIG_EFI=y+CONFIG_ARM_LPAE=y (arm, gcc-10) — PASS, 0 errors, 0 warnings, 0 section mismatches

--------------------------------------------------------------------------------
multi_v7_defconfig+CONFIG_SMP=n (arm, gcc-10) — PASS, 0 errors, 0 warnings, 0 section mismatches

--------------------------------------------------------------------------------
multi_v7_defconfig+CONFIG_THUMB2_KERNEL=y (arm, gcc-10) — PASS, 0 errors, 0 warnings, 0 section mismatches

--------------------------------------------------------------------------------
multi_v7_defconfig+debug (arm, gcc-10) — PASS, 0 errors, 0 warnings, 0 section mismatches

--------------------------------------------------------------------------------
multi_v7_defconfig+kselftest (arm, gcc-10) — PASS, 0 errors, 6 warnings, 0 section mismatches

Warnings:
    drivers/misc/lkdtm/cfi.c:62:30: warning: cast from pointer to integer of different size [-Wpointer-to-int-cast]
    drivers/misc/lkdtm/cfi.c:62:3: warning: cast to pointer from integer of different size [-Wint-to-pointer-cast]
    drivers/misc/lkdtm/cfi.c:62:30: warning: cast from pointer to integer of different size [-Wpointer-to-int-cast]
    drivers/misc/lkdtm/cfi.c:62:3: warning: cast to pointer from integer of different size [-Wint-to-pointer-cast]
    include/linux/fortify-string.h:328:4: warning: call to ‘__write_overflow_field’ declared with attribute warning: detected write beyond size of field (1st parameter); maybe use struct_group()? [-Wattribute-warning]
    include/linux/fortify-string.h:328:4: warning: call to ‘__write_overflow_field’ declared with attribute warning: detected write beyond size of field (1st parameter); maybe use struct_group()? [-Wattribute-warning]

--------------------------------------------------------------------------------
mvebu_v5_defconfig (arm, gcc-10) — PASS, 0 errors, 0 warnings, 0 section mismatches

--------------------------------------------------------------------------------
mvebu_v7_defconfig (arm, gcc-10) — PASS, 0 errors, 0 warnings, 0 section mismatches

--------------------------------------------------------------------------------
mxs_defconfig (arm, gcc-10) — PASS, 0 errors, 0 warnings, 0 section mismatches

--------------------------------------------------------------------------------
neponset_defconfig (arm, gcc-10) — PASS, 0 errors, 0 warnings, 0 section mismatches

--------------------------------------------------------------------------------
netwinder_defconfig (arm, gcc-10) — PASS, 0 errors, 0 warnings, 0 section mismatches

--------------------------------------------------------------------------------
nhk8815_defconfig (arm, gcc-10) — PASS, 0 errors, 0 warnings, 0 section mismatches

--------------------------------------------------------------------------------
nommu_k210_defconfig (riscv, gcc-10) — PASS, 0 errors, 0 warnings, 0 section mismatches

--------------------------------------------------------------------------------
nommu_k210_sdcard_defconfig (riscv, gcc-10) — PASS, 0 errors, 0 warnings, 0 section mismatches

--------------------------------------------------------------------------------
nsimosci_hs_defconfig (arc, gcc-10) — PASS, 0 errors, 0 warnings, 0 section mismatches

--------------------------------------------------------------------------------
nsimosci_hs_smp_defconfig (arc, gcc-10) — PASS, 0 errors, 0 warnings, 0 section mismatches

--------------------------------------------------------------------------------
omap2plus_defconfig (arm, gcc-10) — PASS, 0 errors, 0 warnings, 0 section mismatches

--------------------------------------------------------------------------------
omega2p_defconfig (mips, gcc-10) — PASS, 0 errors, 0 warnings, 0 section mismatches

--------------------------------------------------------------------------------
orion5x_defconfig (arm, gcc-10) — PASS, 0 errors, 0 warnings, 0 section mismatches

--------------------------------------------------------------------------------
oxnas_v6_defconfig (arm, gcc-10) — PASS, 0 errors, 0 warnings, 0 section mismatches

--------------------------------------------------------------------------------
palmz72_defconfig (arm, gcc-10) — PASS, 0 errors, 0 warnings, 0 section mismatches

--------------------------------------------------------------------------------
pcm027_defconfig (arm, gcc-10) — PASS, 0 errors, 0 warnings, 0 section mismatches

--------------------------------------------------------------------------------
pic32mzda_defconfig (mips, gcc-10) — PASS, 0 errors, 0 warnings, 0 section mismatches

--------------------------------------------------------------------------------
pleb_defconfig (arm, gcc-10) — PASS, 0 errors, 0 warnings, 0 section mismatches

--------------------------------------------------------------------------------
pxa168_defconfig (arm, gcc-10) — PASS, 0 errors, 0 warnings, 0 section mismatches

--------------------------------------------------------------------------------
pxa255-idp_defconfig (arm, gcc-10) — PASS, 0 errors, 0 warnings, 0 section mismatches

--------------------------------------------------------------------------------
pxa3xx_defconfig (arm, gcc-10) — PASS, 0 errors, 0 warnings, 0 section mismatches

--------------------------------------------------------------------------------
pxa910_defconfig (arm, gcc-10) — PASS, 0 errors, 0 warnings, 0 section mismatches

--------------------------------------------------------------------------------
pxa_defconfig (arm, gcc-10) — PASS, 0 errors, 0 warnings, 0 section mismatches

--------------------------------------------------------------------------------
qcom_defconfig (arm, gcc-10) — PASS, 0 errors, 0 warnings, 0 section mismatches

--------------------------------------------------------------------------------
qi_lb60_defconfig (mips, gcc-10) — PASS, 0 errors, 0 warnings, 0 section mismatches

--------------------------------------------------------------------------------
rb532_defconfig (mips, gcc-10) — PASS, 0 errors, 1 warning, 0 section mismatches

Warnings:
    cc1: warning: result of ‘-117440512 << 16’ requires 44 bits to represent, but ‘int’ only has 32 bits [-Wshift-overflow=]

--------------------------------------------------------------------------------
rbtx49xx_defconfig (mips, gcc-10) — PASS, 0 errors, 0 warnings, 0 section mismatches

--------------------------------------------------------------------------------
realview_defconfig (arm, gcc-10) — PASS, 0 errors, 0 warnings, 0 section mismatches

--------------------------------------------------------------------------------
rm200_defconfig (mips, gcc-10) — PASS, 0 errors, 0 warnings, 0 section mismatches

--------------------------------------------------------------------------------
rpc_defconfig (arm, gcc-10) — FAIL, 2 errors, 0 warnings, 0 section mismatches

Errors:
    arch/arm/kernel/head.S:319: Error: missing expression -- `ldr r7,=0x'
    arch/arm/kernel/head.S:319: Error: missing expression -- `ldr r3,=0x'

--------------------------------------------------------------------------------
rs90_defconfig (mips, gcc-10) — PASS, 0 errors, 0 warnings, 0 section mismatches

--------------------------------------------------------------------------------
rt305x_defconfig (mips, gcc-10) — PASS, 0 errors, 0 warnings, 0 section mismatches

--------------------------------------------------------------------------------
rv32_defconfig (riscv, gcc-10) — PASS, 0 errors, 0 warnings, 0 section mismatches

--------------------------------------------------------------------------------
s3c2410_defconfig (arm, gcc-10) — PASS, 0 errors, 0 warnings, 0 section mismatches

--------------------------------------------------------------------------------
s3c6400_defconfig (arm, gcc-10) — PASS, 0 errors, 0 warnings, 0 section mismatches

--------------------------------------------------------------------------------
s5pv210_defconfig (arm, gcc-10) — PASS, 0 errors, 0 warnings, 0 section mismatches

--------------------------------------------------------------------------------
sama5_defconfig (arm, gcc-10) — PASS, 0 errors, 0 warnings, 0 section mismatches

--------------------------------------------------------------------------------
sama7_defconfig (arm, gcc-10) — PASS, 0 errors, 0 warnings, 0 section mismatches

--------------------------------------------------------------------------------
sb1250_swarm_defconfig (mips, gcc-10) — PASS, 0 errors, 0 warnings, 0 section mismatches

--------------------------------------------------------------------------------
shannon_defconfig (arm, gcc-10) — PASS, 0 errors, 0 warnings, 0 section mismatches

--------------------------------------------------------------------------------
shmobile_defconfig (arm, gcc-10) — PASS, 0 errors, 0 warnings, 0 section mismatches

--------------------------------------------------------------------------------
simpad_defconfig (arm, gcc-10) — PASS, 0 errors, 0 warnings, 0 section mismatches

--------------------------------------------------------------------------------
socfpga_defconfig (arm, gcc-10) — PASS, 0 errors, 0 warnings, 0 section mismatches

--------------------------------------------------------------------------------
spear13xx_defconfig (arm, gcc-10) — PASS, 0 errors, 0 warnings, 0 section mismatches

--------------------------------------------------------------------------------
spear3xx_defconfig (arm, gcc-10) — FAIL, 10 errors, 0 warnings, 0 section mismatches

Errors:
    ./../include/linux/compiler_types.h:352:38: error: call to ‘__compiletime_assert_256’ declared with attribute error: BUILD_BUG_ON failed: sizeof(*edid) != EDID_LENGTH
    ./../include/linux/compiler_types.h:352:38: error: call to ‘__compiletime_assert_256’ declared with attribute error: BUILD_BUG_ON failed: sizeof(*edid) != EDID_LENGTH
    ./../include/linux/compiler_types.h:352:38: error: call to ‘__compiletime_assert_256’ declared with attribute error: BUILD_BUG_ON failed: sizeof(*edid) != EDID_LENGTH
    ./../include/linux/compiler_types.h:352:38: error: call to ‘__compiletime_assert_256’ declared with attribute error: BUILD_BUG_ON failed: sizeof(*edid) != EDID_LENGTH
    ./../include/linux/compiler_types.h:352:38: error: call to ‘__compiletime_assert_256’ declared with attribute error: BUILD_BUG_ON failed: sizeof(*edid) != EDID_LENGTH
    ./../include/linux/compiler_types.h:352:38: error: call to ‘__compiletime_assert_256’ declared with attribute error: BUILD_BUG_ON failed: sizeof(*edid) != EDID_LENGTH
    ./../include/linux/compiler_types.h:352:38: error: call to ‘__compiletime_assert_256’ declared with attribute error: BUILD_BUG_ON failed: sizeof(*edid) != EDID_LENGTH
    ./../include/linux/compiler_types.h:352:38: error: call to ‘__compiletime_assert_256’ declared with attribute error: BUILD_BUG_ON failed: sizeof(*edid) != EDID_LENGTH
    ./../include/linux/compiler_types.h:352:38: error: call to ‘__compiletime_assert_256’ declared with attribute error: BUILD_BUG_ON failed: sizeof(*edid) != EDID_LENGTH
    ./../include/linux/compiler_types.h:352:38: error: call to ‘__compiletime_assert_256’ declared with attribute error: BUILD_BUG_ON failed: sizeof(*edid) != EDID_LENGTH

--------------------------------------------------------------------------------
spear6xx_defconfig (arm, gcc-10) — PASS, 0 errors, 0 warnings, 0 section mismatches

--------------------------------------------------------------------------------
spitz_defconfig (arm, gcc-10) — PASS, 0 errors, 0 warnings, 0 section mismatches

--------------------------------------------------------------------------------
stm32_defconfig (arm, gcc-10) — PASS, 0 errors, 0 warnings, 0 section mismatches

--------------------------------------------------------------------------------
sunxi_defconfig (arm, gcc-10) — PASS, 0 errors, 0 warnings, 0 section mismatches

--------------------------------------------------------------------------------
tb0219_defconfig (mips, gcc-10) — PASS, 0 errors, 0 warnings, 0 section mismatches

--------------------------------------------------------------------------------
tb0226_defconfig (mips, gcc-10) — PASS, 0 errors, 0 warnings, 0 section mismatches

--------------------------------------------------------------------------------
tb0287_defconfig (mips, gcc-10) — PASS, 0 errors, 0 warnings, 0 section mismatches

--------------------------------------------------------------------------------
tct_hammer_defconfig (arm, gcc-10) — PASS, 0 errors, 0 warnings, 0 section mismatches

--------------------------------------------------------------------------------
tegra_defconfig (arm, gcc-10) — PASS, 0 errors, 0 warnings, 0 section mismatches

--------------------------------------------------------------------------------
tinyconfig (i386, gcc-10) — PASS, 0 errors, 0 warnings, 0 section mismatches

--------------------------------------------------------------------------------
tinyconfig (x86_64, gcc-10) — PASS, 0 errors, 0 warnings, 0 section mismatches

--------------------------------------------------------------------------------
tinyconfig (arc, gcc-10) — PASS, 0 errors, 0 warnings, 0 section mismatches

--------------------------------------------------------------------------------
trizeps4_defconfig (arm, gcc-10) — PASS, 0 errors, 0 warnings, 0 section mismatches

--------------------------------------------------------------------------------
u8500_defconfig (arm, gcc-10) — PASS, 0 errors, 0 warnings, 0 section mismatches

--------------------------------------------------------------------------------
vdk_hs38_defconfig (arc, gcc-10) — PASS, 0 errors, 0 warnings, 0 section mismatches

--------------------------------------------------------------------------------
vdk_hs38_smp_defconfig (arc, gcc-10) — PASS, 0 errors, 0 warnings, 0 section mismatches

--------------------------------------------------------------------------------
versatile_defconfig (arm, gcc-10) — PASS, 0 errors, 0 warnings, 0 section mismatches

--------------------------------------------------------------------------------
vexpress_defconfig (arm, gcc-10) — PASS, 0 errors, 0 warnings, 0 section mismatches

--------------------------------------------------------------------------------
vf610m4_defconfig (arm, gcc-10) — PASS, 0 errors, 0 warnings, 0 section mismatches

--------------------------------------------------------------------------------
viper_defconfig (arm, gcc-10) — PASS, 0 errors, 0 warnings, 0 section mismatches

--------------------------------------------------------------------------------
vocore2_defconfig (mips, gcc-10) — PASS, 0 errors, 0 warnings, 0 section mismatches

--------------------------------------------------------------------------------
vt8500_v6_v7_defconfig (arm, gcc-10) — PASS, 0 errors, 0 warnings, 0 section mismatches

--------------------------------------------------------------------------------
workpad_defconfig (mips, gcc-10) — PASS, 0 errors, 0 warnings, 0 section mismatches

--------------------------------------------------------------------------------
x86_64_defconfig (x86_64, gcc-10) — PASS, 0 errors, 0 warnings, 0 section mismatches

--------------------------------------------------------------------------------
x86_64_defconfig (x86_64, clang-14) — PASS, 0 errors, 0 warnings, 0 section mismatches

--------------------------------------------------------------------------------
x86_64_defconfig+amdgpu (x86_64, gcc-10) — PASS, 0 errors, 0 warnings, 0 section mismatches

--------------------------------------------------------------------------------
x86_64_defconfig+crypto (x86_64, gcc-10) — PASS, 0 errors, 0 warnings, 0 section mismatches

--------------------------------------------------------------------------------
x86_64_defconfig+debug (x86_64, gcc-10) — PASS, 0 errors, 0 warnings, 0 section mismatches

--------------------------------------------------------------------------------
x86_64_defconfig+ima (x86_64, gcc-10) — PASS, 0 errors, 0 warnings, 0 section mismatches

--------------------------------------------------------------------------------
x86_64_defconfig+kselftest (x86_64, gcc-10) — PASS, 0 errors, 0 warnings, 0 section mismatches

--------------------------------------------------------------------------------
x86_64_defconfig+x86-chromebook (x86_64, gcc-10) — PASS, 0 errors, 0 warnings, 0 section mismatches

--------------------------------------------------------------------------------
x86_64_defconfig+x86-chromebook+amdgpu (x86_64, gcc-10) — PASS, 0 errors, 0 warnings, 0 section mismatches

--------------------------------------------------------------------------------
x86_64_defconfig+x86-chromebook+kselftest (x86_64, gcc-10) — PASS, 0 errors, 0 warnings, 0 section mismatches

--------------------------------------------------------------------------------
x86_64_defconfig+x86_kvm_guest (x86_64, gcc-10) — PASS, 0 errors, 0 warnings, 0 section mismatches

--------------------------------------------------------------------------------
xcep_defconfig (arm, gcc-10) — PASS, 0 errors, 0 warnings, 0 section mismatches

--------------------------------------------------------------------------------
zeus_defconfig (arm, gcc-10) — PASS, 0 errors, 0 warnings, 0 section mismatches

---
For more info write to <info@kernelci.org>

^ permalink raw reply	[flat|nested] only message in thread

only message in thread, other threads:[~2022-05-12 11:54 UTC | newest]

Thread overview: (only message) (download: mbox.gz / follow: Atom feed)
-- links below jump to the message on this page --
2022-05-12 11:54 next/master build: 222 builds: 11 failed, 211 passed, 34 errors, 119 warnings (next-20220512) kernelci.org bot

This is a public inbox, see mirroring instructions
for how to clone and mirror all data and code used for this inbox;
as well as URLs for NNTP newsgroup(s).