llvm.lists.linux.dev archive mirror
 help / color / mirror / Atom feed
[PATCH] drm/amd/display: Disable CONFIG_DRM_AMD_DC_FP for RISC-V with clang
 2024-06-18 21:32 UTC  (3+ messages)

next/master build: 177 builds: 59 failed, 118 passed, 67 errors, 10380 warnings (next-20240618)
 2024-06-18 18:24 UTC 

[PATCH v4 7/7] Enable Driver compilation in crypto Kconfig and Makefile
 2024-06-18 18:10 UTC 

[linusw-pinctrl:b4/fix-keembay 33/35] drivers/pinctrl/freescale/pinctrl-imx-scmi.c:170:25: error: use of undeclared identifier 'pinmux_generic_get_function_count'; did you mean 'pinmux_generic_free_functions'?
 2024-06-18 18:10 UTC 

ANNOUNCE: pahole v1.27 (reproducible builds, BTF kfuncs)
 2024-06-18 14:30 UTC  (6+ messages)
    ` [PATCH/RFT] "
          ` [PATCH fyi 1/1] dwarf_loader: Add missing cus__add(cus, cu) to cus__merge_and_process_cu()

[PATCH AUTOSEL 6.1 02/29] scsi: sr: Fix unintentional arithmetic wraparound
 2024-06-18 12:39 UTC  (3+ messages)
` [PATCH AUTOSEL 6.1 06/29] efi/libstub: zboot.lds: Discard .discard sections
` [PATCH AUTOSEL 6.1 21/29] selftests/futex: pass _GNU_SOURCE without a value to the compiler

[PATCH AUTOSEL 6.6 02/35] scsi: sr: Fix unintentional arithmetic wraparound
 2024-06-18 12:37 UTC  (3+ messages)
` [PATCH AUTOSEL 6.6 06/35] efi/libstub: zboot.lds: Discard .discard sections
` [PATCH AUTOSEL 6.6 24/35] selftests/futex: pass _GNU_SOURCE without a value to the compiler

[PATCH AUTOSEL 6.9 02/44] scsi: sr: Fix unintentional arithmetic wraparound
 2024-06-18 12:35 UTC  (3+ messages)
` [PATCH AUTOSEL 6.9 06/44] efi/libstub: zboot.lds: Discard .discard sections
` [PATCH AUTOSEL 6.9 28/44] selftests/futex: pass _GNU_SOURCE without a value to the compiler

[PATCH 1/1] binfmt_elf, coredump: Log the reason of the failed core dumps
 2024-06-18 11:31 UTC 

[PATCH 0/8] riscv: ftrace: atmoic patching and preempt improvements
 2024-06-18  9:55 UTC  (13+ messages)
` [PATCH 1/8] riscv: stacktrace: convert arch_stack_walk() to noinstr
` [PATCH 2/8] tracing: do not trace kernel_text_address()
` [PATCH 3/8] riscv: ftrace: support fastcc in Clang for WITH_ARGS
` [PATCH 4/8] riscv: ftrace: align patchable functions to 4 Byte boundary

mips allmodconfig build error with llvm-18.1.7-x86_64
 2024-06-18  9:28 UTC  (3+ messages)

❌ FAIL (MISSED 11 of 192): Test report for master (6.10.0-rc4, mainline.kernel.org-clang, 14d7c92f)
 2024-06-18  8:42 UTC 

[PATCH v4 0/3] Hardening perf subsystem
 2024-06-18  8:28 UTC  (14+ messages)

[cel:nfsd-5.10.y 194/770] ld.lld: error: kernel/built-in.a(kallsyms.o):(function lookup_symbol_name: .text+0x412): relocation R_RISCV_PCREL_HI20 out of range: 33553758 is not in [-524288, 524287]; references kallsyms_names
 2024-06-18  5:23 UTC 

[PATCH v3 0/4] perf: support specify vdso path in cmdline
 2024-06-18  1:55 UTC  (5+ messages)
` [PATCH v3 1/4] "
` [PATCH v3 2/4] perf: disasm: use build_id_path if fallback failed
` [PATCH v3 3/4] perf: symbol: generalize vmlinux path searching
` [PATCH v3 4/4] perf: symbol: try to seach vdso path if not given by user

[PATCH v2] x86/traps: Enable UBSAN traps on x86
 2024-06-17 23:57 UTC  (7+ messages)

[PATCH v3 0/3] selftests/vDSO: fix clang build errors, and Makefile cleanup
 2024-06-17 20:15 UTC  (7+ messages)
` [PATCH v3 1/3] selftests/vDSO: fix clang build errors and warnings
` [PATCH v3 2/3] selftests/mm: remove partially duplicated "all:" target in Makefile
` [PATCH v3 3/3] selftests/vDSO: remove duplicate compiler invocations from Makefile
  ` Shuah, Andy L: [PATCH v3 0/3] selftests/vDSO: fix clang build errors, and Makefile cleanup

[nf-next PATCH 2/2] netfilter: xt_recent: Largely lift restrictions on max hitcount value
 2024-06-17 17:38 UTC 

[qcom:drivers-for-6.11 20/20] ld.lld: error: undefined symbol: mbox_request_channel
 2024-06-17 17:00 UTC 

❌ FAIL (MISSED 11 of 192): Test report for master (6.10.0-rc4, mainline.kernel.org-clang, 6ba59ff4)
 2024-06-17 16:52 UTC 

[PATCH] loongarch: Only select HAVE_OBJTOOL and allow ORC unwinder if the inline assembler supports R_LARCH_{32,64}_PCREL
 2024-06-17 13:47 UTC  (20+ messages)

❌ FAIL (MISSED 13 of 192): Test report for master (6.10.0-rc3, mainline.kernel.org-clang, b5beaa44)
 2024-06-17 13:33 UTC 

[PATCH AUTOSEL 6.1 02/29] scsi: sr: Fix unintentional arithmetic wraparound
 2024-06-17 13:24 UTC  (3+ messages)
` [PATCH AUTOSEL 6.1 06/29] efi/libstub: zboot.lds: Discard .discard sections
` [PATCH AUTOSEL 6.1 21/29] selftests/futex: pass _GNU_SOURCE without a value to the compiler

[PATCH PATCH 1/9] x86/cpu/topology: Add x86_cpu_type to struct cpuinfo_topology
 2024-06-17 13:24 UTC 

[PATCH AUTOSEL 6.6 02/35] scsi: sr: Fix unintentional arithmetic wraparound
 2024-06-17 13:22 UTC  (3+ messages)
` [PATCH AUTOSEL 6.6 06/35] efi/libstub: zboot.lds: Discard .discard sections
` [PATCH AUTOSEL 6.6 24/35] selftests/futex: pass _GNU_SOURCE without a value to the compiler

[PATCH AUTOSEL 6.9 02/44] scsi: sr: Fix unintentional arithmetic wraparound
 2024-06-17 13:19 UTC  (3+ messages)
` [PATCH AUTOSEL 6.9 06/44] efi/libstub: zboot.lds: Discard .discard sections
` [PATCH AUTOSEL 6.9 28/44] selftests/futex: pass _GNU_SOURCE without a value to the compiler

[mediatek:v6.10-next/dts64 53/53] Error: arch/arm64/boot/dts/mediatek/mt8188.dtsi:673.32-33 syntax error
 2024-06-17  7:34 UTC  (2+ messages)

[mediatek:v6.10-next/dts64 51/53] Error: arch/arm64/boot/dts/mediatek/mt8186.dtsi:2399.29-30 syntax error
 2024-06-17  7:33 UTC  (2+ messages)

[PATCH v2 0/4] perf: support specify vdso path in cmdline
 2024-06-17  6:31 UTC  (7+ messages)
` [PATCH v2 1/4] "
` [PATCH v2 2/4] perf: disasm: use build_id_path if fallback failed
` [PATCH v2 3/4] perf: symbol: generalize vmlinux path searching
` [PATCH v2 4/4] perf: symbol: try to seach vdso path if not given by user

[RFC 0/2] Initial LKMM atomics support in Rust
 2024-06-17  5:42 UTC  (52+ messages)
` [RFC 1/2] rust: Introduce atomic API helpers
` [RFC 2/2] rust: sync: Add atomic support

[jlayton:mgtime 4/10] fs/inode.c:2623:9: error: invalid output size for constraint '=a'
 2024-06-17  5:17 UTC 

[driver-core:const_driver 16/23] drivers/cdx/cdx.c:648:12: error: incompatible function pointer types initializing 'int (*)(struct device *, const struct device_driver *)' with an expression of type 'int (struct device *, struct device_driver *)'
 2024-06-16 23:42 UTC 

[cel:nfsd-testing 18/18] fs/nfsd/blocklayoutxdr.c:166:1: error: function definition is not allowed here
 2024-06-16 22:49 UTC 

[PATCH] slimbus: Fix struct and documentation alignment in stream.c
 2024-06-16 19:07 UTC 

[PATCH] fs/ntfs3: Remove recursion in indx_insert_into_buffer
 2024-06-16 18:35 UTC 

[sj:damon/next 9/47] mm/damon/core.c:705: warning: expecting prototype for damon_commit_quota_goals(). Prototype was for damos_commit_quota_goals() instead
 2024-06-16 15:45 UTC  (2+ messages)

[qcom:clk-for-6.11 39/42] ld.lld: error: undefined symbol: __mdiobus_write
 2024-06-16 13:07 UTC 

[PATCH v3] drm/fb-helper: Detect when lid is closed during initialization
 2024-06-16 12:24 UTC 

❌ FAIL (MISSED 11 of 192): Test report for master (6.10.0-rc3, mainline.kernel.org-clang, a3e18a54)
 2024-06-16 10:33 UTC 

[PATCH v5 05/20] leds: leds-lp55xx: generalize load_engine function
 2024-06-16  4:37 UTC 

[rust:staging/rust-device 11/12] error[E0425]: cannot find function `ioremap` in crate `bindings`
 2024-06-16  0:51 UTC 

❌ FAIL (MISSED 20 of 192): Test report for master (6.10.0-rc3, mainline.kernel.org-clang, 44ef20ba)
 2024-06-15 23:22 UTC 

[rust:staging/rust-device 5/12] error[E0425]: cannot find value `THIS_MODULE` in the crate root
 2024-06-15 21:21 UTC 

[PATCH v4 1/2] HID: hid-goodix: Add Goodix HID-over-SPI driver
 2024-06-15 18:03 UTC 

[rust:staging/rust-device 3/12] error[E0050]: method `init` has 1 parameter but the declaration in trait `rust_doctest_kernel_build_assert_rs_0::kernel::Module::init` has 2
 2024-06-15 17:53 UTC 

[linux-next:master 2997/5501] drivers/media/i2c/imx283.c:443:30: error: initializer element is not a compile-time constant
 2024-06-15 17:42 UTC 

[davidhildenbrand:page_table_reclaim 10/10] mm/pgtable_reclaim.c:437:25: error: use of undeclared identifier 'root_mem_cgroup'; did you mean 'parent_mem_cgroup'?
 2024-06-15 17:42 UTC 

[PATCH 1/3] media: rockchip: Introduce the rkvdec2 driver
 2024-06-15 17:21 UTC 

[drm-misc:topic/rust-drm 5/21] error[E0425]: cannot find value `THIS_MODULE` in the crate root
 2024-06-15 14:36 UTC 

[pinchartl:nxp/v6.10/dev/rpi-cam-mipi 46/81] drivers/media/i2c/ar0144.c:470:6: warning: variable 'ret' is used uninitialized whenever 'if' condition is false
 2024-06-15 14:36 UTC 

[tip:x86/vmware 4/8] ld.lld: error: undefined symbol: vmware_hypercall_slow
 2024-06-15 13:22 UTC 

[PATCH 5.10 178/317] perf ui: Update use of pthread mutex
 2024-06-15 11:00 UTC  (4+ messages)
` [PATCH 5.10 000/317] 5.10.219-rc1 review

[drm-misc:topic/rust-drm 3/21] error[E0050]: method `init` has 1 parameter but the declaration in trait `rust_doctest_kernel_build_assert_rs_0::kernel::Module::init` has 2
 2024-06-15  8:17 UTC 

[jarkko-tpmdd:tpm2key-v8 7/7] security/keys/process_keys.c:771:47: warning: format specifies type 'int' but the argument has type 'long'
 2024-06-15  8:17 UTC 

next/master build: 184 builds: 7 failed, 177 passed, 13 errors, 10358 warnings (next-20240613)
 2024-06-15  6:43 UTC 

[jpoimboe:objtool-diff 2/2] ERROR: modpost: "__early_static_cpu_has__thunk" [drivers/cpufreq/longhaul.ko] undefined!
 2024-06-15  0:51 UTC 

[drm-misc:topic/rust-drm 3/21] error[E0050]: method `init` has 1 parameter but the declaration in trait `kernel::Module::init` has 2
 2024-06-14 23:58 UTC 

[PATCH v2] selftests/vDSO: fix clang build errors and warnings
 2024-06-14 23:10 UTC  (5+ messages)

[RFC PATCH v1 1/2] KVM: arm64: Allow BT field in ID_AA64PFR1_EL1 writable
 2024-06-14 21:08 UTC 

[PATCH 1/2] mailbox: Add power_get/power_put API to mbox_chan_ops
 2024-06-14 16:23 UTC 

[brauner-vfs:vfs.mount.api 1/2] fs/hostfs/hostfs_kern.c:942:8: error: initializing 'char *' with an expression of type 'const char *' discards qualifiers
 2024-06-14 16:13 UTC 

[morse:mpam/snapshot/v6.10-rc1 98/114] drivers/platform/arm64/mpam/mpam_resctrl.c:350:14: warning: result of comparison of constant 65536 with expression of type 'u16' (aka 'unsigned short') is always false
 2024-06-14 16:02 UTC 

[PATCH] drm/amd/display: Increase frame-larger-than warning limit
 2024-06-14 15:55 UTC  (2+ messages)

[morse:mpam/snapshot/v6.10-rc1 95/114] drivers/platform/arm64/mpam/mpam_resctrl.c:33: warning: This comment starts with '/**', but isn't a kernel-doc comment. Refer Documentation/doc-guide/kernel-doc.rst
 2024-06-14 14:59 UTC 

[morse:mpam/snapshot/v6.10-rc1 65/114] drivers/platform/arm64/mpam/mpam_devices.c:318:17: warning: result of comparison of constant 18446744073709551615 with expression of type 'u32' (aka 'unsigned int') is always false
 2024-06-14 13:44 UTC 

❌ FAIL (MISSED 24 of 192): Test report for master (6.10.0-rc3, mainline.kernel.org-clang, d20f6b3d)
 2024-06-14 13:12 UTC 

[PATCH 12/12] block: move integrity information into queue_limits
 2024-06-14  8:47 UTC 

[PATCH 0/2] perf: support specify vdso path in cmdline
 2024-06-14  3:55 UTC  (11+ messages)
` [PATCH 1/2] "
` [PATCH 2/2] perf: disasm: prefer symsrc_filename for filename

[driver-core:const_driver 8/12] net/iucv/iucv.c:65:47: error: declaration of anonymous struct must be a definition
 2024-06-14  3:01 UTC 

[tnguy-next-queue:dev-queue 52/84] ld.lld: error: undefined symbol: ptp_clock_register
 2024-06-14  1:13 UTC 

[broonie-ci:20240612_pierre_louis_bossart_asoc_sof_pci_intel_add_pantherlake_support 48/51] sound/soc/sof/intel/pci-ptl.c:52:4: error: use of undeclared identifier 'PCI_DEVICE_ID_INTEL_HDA_PTL'
 2024-06-14  0:41 UTC 

[PATCH bpf-next 0/2] Fixes for kfunc prototype generation
 2024-06-13 18:20 UTC  (3+ messages)
` [PATCH bpf-next 2/2] bpf: selftests: Do not use generated kfunc prototypes for arena progs

[PATCH 1/3] mfd: max14577: Fix Wvoid-pointer-to-enum-cast warning (again)
 2024-06-13 17:09 UTC  (2+ messages)

[PATCH 5.15 225/402] perf ui: Update use of pthread mutex
 2024-06-13 11:33 UTC 

[PATCH 5.4 116/202] perf ui: Update use of pthread mutex
 2024-06-13 11:33 UTC 

[jarkko-tpmdd:tpm2key-v8 4/7] crypto/tpm2_key.c:66:46: warning: format specifies type 'unsigned long' but the argument has type 'size_t' (aka 'unsigned int')
 2024-06-13 11:38 UTC 

[PATCH 8/9] accel/rocket: Add job submission IOCTL
 2024-06-13  9:08 UTC 

[linux-next:master 5295/5501] security/integrity/ima/ima_policy.c:430:10: error: too many arguments to function call, expected 4, have 5
 2024-06-13  9:08 UTC 


This is a public inbox, see mirroring instructions
for how to clone and mirror all data and code used for this inbox;
as well as URLs for NNTP newsgroup(s).