oe-kbuild-all.lists.linux.dev archive mirror
 help / color / mirror / Atom feed
[linux-next:master 9158/13707] drivers/gpu/drm/i915/gt/intel_gt_mcr.c:739: warning: expecting prototype for intel_gt_mcr_wait_for_reg_fw(). Prototype was for intel_gt_mcr_wait_for_reg() instead
 2022-12-07 23:56 UTC 

[PATCH 1/3] madvise: Convert madvise_cold_or_pageout_pte_range() to use folios
 2022-12-07 23:46 UTC  (2+ messages)

drivers/net/wireless/mediatek/mt76/mt7915/mmio.c:341 __mt7915_reg_addr() warn: always true condition '(addr <= 4294967295) => (0-u32max <= u32max)'
 2022-12-07 23:36 UTC 

[RFC 2/3] pinctrl: Add support pin control for UP board CPLD/FPGA
 2022-12-07 22:55 UTC 

[PATCH] arm64: dts: qcom: sm8150: Fix iommu sid values for PCIe nodes
 2022-12-07 22:25 UTC 

[lkp] [+467 bytes kernel size regression] [i386-tinyconfig] [d68dec755e] fanotify: introduce directory entry pre-modify permission events
 2022-12-07 22:22 UTC 

[lkp] [+77 bytes kernel size regression] [i386-tinyconfig] [5a7c77eebb] fsnotify: prepare for directory entry pre-modify permission events
 2022-12-07 22:22 UTC 

[lkp] [+292 bytes kernel size regression] [i386-tinyconfig] [79db767dcf] fanotify: introduce FAN_PRE_ATTRIB permission event
 2022-12-07 22:22 UTC 

[lkp] [+346 bytes kernel size regression] [i386-tinyconfig] [91d26357eb] vfs: prepare for pre-modify permission events on write
 2022-12-07 22:21 UTC 

[lkp] [+243 bytes kernel size regression] [i386-tinyconfig] [e8a2a30b4b] vfs: implement 'vfs write barriers'
 2022-12-07 22:21 UTC 

[linux-next:master 11968/13707] drivers/net/thunderbolt.c:733:47: sparse: sparse: restricted __le32 degrades to integer
 2022-12-07 21:53 UTC  (2+ messages)

[asahilinux:bits/000-devicetree 64/71] Error: arch/arm64/boot/dts/apple/t8103.dtsi:412.32-33 syntax error
 2022-12-07 21:14 UTC 

[alobakin:fgkaslr 15/15] arch/riscv/include/asm/extable.h:35:29: warning: 'struct pt_regs' declared inside parameter list will not be visible outside of this definition or declaration
 2022-12-07 21:14 UTC 

[android-common:android14-5.15 20/25] arch/arm64/kvm/pkvm.c:565:5: warning: no previous prototype for '__pkvm_register_el2_call'
 2022-12-07 20:54 UTC 

[PATCH v11 1/6] media: platform: chips-media: Move Coda to separate folder
 2022-12-07 20:44 UTC 

[android-common:android14-5.15 12/25] arch/arm64/kvm/hyp/nvhe/serial.c:41:6: warning: no previous prototype for 'hyp_puts'
 2022-12-07 20:14 UTC 

[freescale-fslc:pr/616 12691/18686] drivers/net/ethernet/freescale/fman/mac.c:719:13: warning: format specifies type 'unsigned long long' but the argument has type 'resource_size_t' (aka 'unsigned int')
 2022-12-07 20:03 UTC 

[frank-w-bpi-r2-4.14:6.1-r3 71/72] drivers/net/wireless/mediatek/mt76/mt7915/init.c:523:6: warning: no previous prototype for 'mt7915_mac_init'
 2022-12-07 19:53 UTC 

[lunn:v6.1-rc7-net-next-inband 1/26] make[5]: *** No rule to make target 'drivers/platform/x86/intel_telemetry_core.o', needed by 'drivers/platform/x86/built-in.a'
 2022-12-07 19:43 UTC 

[android-common:android14-5.15 8/25] arch/arm64/kvm/pkvm.c:493:5: warning: no previous prototype for '__pkvm_load_el2_module'
 2022-12-07 19:33 UTC 

[PATCH net-next 10/11] sfc: implement vdpa config_ops for dma operations
 2022-12-07 19:23 UTC 

[sashal-stable:pending-4.19 113/123] arch/arm/mm/nommu.c:163:19: warning: assignment to 'void *' from 'phys_addr_t' {aka 'unsigned int'} makes pointer from integer without a cast
 2022-12-07 19:13 UTC 

[sashal-stable:pending-4.14 86/93] arch/arm/mm/nommu.c:382:12: warning: assignment makes pointer from integer without a cast
 2022-12-07 19:13 UTC 

[freescale-fslc:pr/616 12690/18686] drivers/net/ethernet/freescale/fman/fman_port.c:2042:36: warning: unused variable 'fman_port_acpi_match'
 2022-12-07 19:03 UTC 

[android-common:android14-5.15 20/23] arch/arm64/kvm/pkvm.c:565:5: warning: no previous prototype for function '__pkvm_register_el2_call'
 2022-12-07 19:03 UTC 

ld.lld: error: undefined symbol: __udivdi3
 2022-12-07 18:36 UTC  (8+ messages)

[freescale-fslc:pr/616 9878/18686] drivers/clk/imx/clk-imx8mm.c:710:26: warning: unused variable 'delta_k_fops'
 2022-12-07 18:22 UTC 

[android-common:android14-5.15 12/23] arch/arm64/kvm/hyp/nvhe/serial.c:41:6: warning: no previous prototype for function 'hyp_puts'
 2022-12-07 18:22 UTC 

error: unknown target CPU 'loongson2f'
 2022-12-07 18:12 UTC 

[freescale-fslc:pr/616 12689/18686] drivers/net/ethernet/freescale/fman/fman.c:3088:36: warning: unused variable 'acpi_fman_match'
 2022-12-07 18:02 UTC 

[android-common:android14-5.15 8/23] arch/arm64/kvm/hyp/include/nvhe/modules.h:4:58: error: expected identifier or '('
 2022-12-07 17:32 UTC 

[sashal-stable:pending-4.9 69/70] mm/khugepaged.c:1047:2: error: implicit declaration of function 'tlb_remove_table_sync_one'; did you mean 'tlb_remove_page_size'?
 2022-12-07 17:22 UTC 

[freescale-fslc:pr/616 4345/18686] drivers/vfio/fsl-mc/vfio_fsl_mc.c:360:24: error: implicit declaration of function 'pgprot_cached_ns'
 2022-12-07 17:12 UTC 

[freescale-fslc:pr/616 6176/18686] drivers/mtd/nand/raw/gpmi-nand/gpmi-nand.c:714:5: warning: no previous prototype for function 'bch_create_debugfs'
 2022-12-07 17:01 UTC 

[PATCH net-next 04/11] sfc: implement vDPA management device operations
 2022-12-07 16:31 UTC 

[PATCH] ASoc: SOF: Fix sof-audio-pci-intel-tgl shutdown timeout during hibernation
 2022-12-07 16:31 UTC  (2+ messages)

[linux-next:master 11514/13282] net/rxrpc/local_object.c:365 rxrpc_unuse_local() warn: variable dereferenced before check 'local' (see line 362)
 2022-12-07 16:18 UTC  (2+ messages)

[freescale-fslc:pr/616 135/18686] sound/soc/fsl/fsl_xcvr_sysfs.c:106:52: error: a function declaration without a prototype is deprecated in all versions of C
 2022-12-07 16:11 UTC 

[PATCH] drm/amdgpu: Retry DDC probing on DVI on failure if we got an HPD interrupt
 2022-12-07 15:51 UTC  (2+ messages)

[freescale-fslc:pr/616 160/18686] sound/soc/codecs/pcm512x.c:1595:14: warning: unused variable 'clk_name'
 2022-12-07 15:20 UTC 

[android-common:android13-5.15-arcvm 6/132] drivers/virtio/virtio_wl.c:1227:25: error: implicit declaration of function '__close_fd'; did you mean 'close_fd'?
 2022-12-07 15:10 UTC 

[driver-core:kobject-const3 25/25] drivers/bus/sunxi-rsb.c:180:13: error: incompatible function pointer types initializing 'int (*)(struct device *, struct kobj_uevent_env *)' with an expression of type 'int (const struct device *, struct kobj_uevent_env *)'
 2022-12-07 15:10 UTC 

[freescale-fslc:pr/616 4361/18686] drivers/i2c/busses/xen-i2cfront.c:148:5: warning: no previous prototype for function 'i2cfront_xfer'
 2022-12-07 15:00 UTC 

[PATCH v2 3/3] thermal: qcom-spmi-temp-alarm: add support for LITE PMIC peripherals
 2022-12-07 14:30 UTC  (2+ messages)

[freescale-fslc:pr/616 1629/18686] drivers/dma/mxs-dma.c:914:5: warning: no previous prototype for function 'mxs_dma_runtime_suspend'
 2022-12-07 14:20 UTC 

[PATCH bpf-next 06/13] bpf: Add bpf_rbtree_{add,remove,first} kfuncs
 2022-12-07 14:20 UTC 

[PATCH 5/5] staging: drivers: iio: adc: Adc MAX77541 ADC Support
 2022-12-07 12:49 UTC 

[ti:ti-android-linux-5.10.y 15/15] clang-16: warning: the flag '-enable-trivial-auto-var-init-zero-knowing-it-will-be-removed-from-clang' has been deprecated and will be ignored
 2022-12-07 12:39 UTC 

drivers/media/platform/samsung/s5p-jpeg/jpeg-core.c:3126:34: warning: unused variable 'samsung_jpeg_match'
 2022-12-07 11:58 UTC 

[tobetter:odroid-6.1.y 20/71] drivers/pwm/pwm-gpio.c:60:22: warning: no previous prototype for 'gpio_pwm_timer'
 2022-12-07 11:18 UTC 

[PATCH] f2fs: introduce hot_data_age_threshold and warm_data_age_threshold mount opt
 2022-12-07  9:57 UTC 

[intel-tdx:guest-unaccepted-memory 14/14] ld.lld: error: undefined hidden symbol: efi_is_64bit
 2022-12-07  9:27 UTC 

drivers/net/ethernet/sfc/siena/selftest.c:46:15: warning: field ip within 'struct efx_loopback_payload' is less aligned than 'struct iphdr' and is usually due to 'struct efx_loopback_payload' being packed, which can lead to unaligned accesses
 2022-12-07  9:09 UTC  (2+ messages)

[cifs:for-next 8/9] fs/cifs/cifsroot.c:17:10: fatal error: arpa/inet.h: No such file or directory
 2022-12-07  9:07 UTC 

[jsarha:topic/cros-sof-v4.14 7444/9354] drivers/firmware/google/gsmi.c:96:3: sparse: sparse: symbol 'gsmi_dev' was not declared. Should it be static?
 2022-12-07  7:36 UTC 

[intel-tdx:guest-unaccepted-memory 14/14] ld: Unexpected GOT/PLT entries detected!
 2022-12-07  7:26 UTC 

[RFC PATCH v4] vmxnet3: Add XDP support
 2022-12-07  7:06 UTC 

[intel-tdx:guest-unaccepted-memory 14/14] drivers/firmware/efi/libstub/x86-stub.c:790:14: warning: implicit declaration of function 'efi_is_64bit' is invalid in C99
 2022-12-07  6:15 UTC 

[RFC] block: Change the granularity of io ticks from ms to ns
 2022-12-07  5:55 UTC  (2+ messages)

[PATCH v4] arm64: dts: qcom: sa8540p-ride: enable PCIe support
 2022-12-07  5:55 UTC 

[intel-tdx:guest-unaccepted-memory 14/14] drivers/firmware/efi/libstub/x86-stub.c:790:21: warning: implicit declaration of function 'efi_is_64bit'
 2022-12-07  5:24 UTC 

[jolsa-perf:bpf/tracing_multi_ng_7 16/30] arch/arm64/net/bpf_jit_comp.c:1642:57: warning: 'struct bpf_tramp_link' declared inside parameter list will not be visible outside of this definition or declaration
 2022-12-07  4:44 UTC 

[jolsa-perf:bpf/tracing_multi_ng_7 30/30] kernel/bpf/trampoline.c:1282:3: error: assigning to 'struct bpf_trampoline *' from incompatible type 'void'
 2022-12-07  4:04 UTC 

[jolsa-perf:bpf/tracing_multi_ng_7 15/30] arch/arm64/net/bpf_jit_comp.c:1719:27: error: invalid use of undefined type 'struct bpf_tramp_links'
 2022-12-07  3:33 UTC 

[PATCH v3 -next] ALSA:usb-audio:add the information of KT0206 device driven by USB audio
 2022-12-07  3:21 UTC 

[PATCH] dma-buf: fix dma_buf_export init order
 2022-12-07  3:13 UTC  (6+ messages)

[freescale-fslc:pr/616 3317/18686] drivers/irqchip/irq-imx-irqsteer.c:386:28: error: 'imx_irqsteer_runtime_suspend' undeclared here (not in a function); did you mean 'pm_generic_runtime_suspend'?
 2022-12-07  3:13 UTC 

arch/mips/boot/compressed/../../../../lib/ashldi3.c:9:19: warning: no previous prototype for function '__ashldi3'
 2022-12-07  2:53 UTC 

arch/alpha/include/asm/jensen.h:187:21: warning: no previous prototype for 'jensen_inq'
 2022-12-07  1:42 UTC 

[PATCH v2 3/4] cachestat: implement cachestat syscall
 2022-12-07  1:42 UTC  (4+ messages)

[ceph-client:testing 5/6] fs/ceph/super.c:1486:9: error: no member named 's_master_keys' in 'struct super_block'
 2022-12-07  0:40 UTC  (2+ messages)

[freescale-fslc:5.15-2.1.x-imx 14450/18019] drivers/staging/ethosu/ethosu_buffer.c:104:25: error: implicit declaration of function 'of_read_number'
 2022-12-07  0:11 UTC 

sh4-linux-gcc: error: unrecognized command-line option '-Wout-of-line-declaration'; did you mean '-Wold-style-declaration'?
 2022-12-07  0:01 UTC 

[jolsa-perf:bpf/tracing_multi_ng_7 15/30] arch/arm64/net/bpf_jit_comp.c:1709:60: warning: 'struct bpf_tramp_links' declared inside parameter list will not be visible outside of this definition or declaration
 2022-12-07  0:01 UTC 

[PATCH v3 3/4] include/asm-generic/io.h: remove performing pointer arithmetic on a null pointer
 2022-12-06 22:50 UTC 

[jolsa-perf:bpf/tracing_multi_ng_7 25/30] kernel/bpf/trampoline.c:1225:16: error: implicit declaration of function 'ftrace_hash_alloc'
 2022-12-06 22:50 UTC 

[PATCH 1/7] KVM: x86/MMU: Move pte_list operations to rmap.c
 2022-12-06 22:00 UTC 

[sean-jc:vmx/nmi_mess 2/3] vmlinux.o: warning: objtool: vmx_vcpu_enter_exit+0x13d: call to is_nmi() leaves .noinstr.text section
 2022-12-06 22:00 UTC 

drivers/dma/bestcomm/ata.c:136:22: sparse: sparse: incorrect type in argument 1 (different address spaces)
 2022-12-06 21:40 UTC 

[freescale-fslc:5.15-2.1.x-imx 52/18019] drivers/soc/imx/busfreq-imx8mq.c:226:6: error: redefinition of 'request_bus_freq'
 2022-12-06 21:40 UTC 

[jolsa-perf:bpf/tracing_multi_ng_7 23/30] kernel/bpf/btf.c:8282:6: warning: variable 'err' is used uninitialized whenever 'if' condition is true
 2022-12-06 21:30 UTC 

[usb:usb-testing 2/2] drivers/usb/gadget/legacy/webcam.c:174:10: error: 'const struct uvc_format_uncompressed' has no member named 'bmInterfaceFlags'; did you mean 'bmInterlaceFlags'?
 2022-12-06 21:09 UTC 

[PATCH 2/2] gpio: max7317: Add gpio expander driver
 2022-12-06 20:29 UTC 

[PATCH] rpmsg: char: Use preallocated SKBs
 2022-12-06 19:59 UTC 

[chenhuacai-loongson:loongarch-next 16/24] arch/loongarch/kernel/ftrace.c:49:6: warning: no previous prototype for 'prepare_ftrace_return'
 2022-12-06 19:49 UTC 

[drm-misc:drm-misc-next 5/6] drivers/gpu/drm/gud/gud_pipe.c:396:36: error: implicit declaration of function 'vzalloc'; did you mean 'kvzalloc'?
 2022-12-06 19:49 UTC 

[jolsa-perf:bpf/tracing_multi_ng_7 17/30] kernel/bpf/verifier.c:16617:13: error: call to undeclared function 'is_tracing_multi'; ISO C99 and later do not support implicit function declarations
 2022-12-06 19:38 UTC 

[rgushchin:mqueue_msg_cache 1/1] ipc/msgutil.c:92:30: error: call to undeclared function 'get_current'; ISO C99 and later do not support implicit function declarations
 2022-12-06 19:38 UTC 

[PATCH 2/3] cxl/mem: Support sanitation commands
 2022-12-06 19:08 UTC 

[jolsa-perf:bpf/tracing_multi_ng_7 13/30] samples/ftrace/ftrace-direct-set.c:104:9: error: implicit declaration of function 'ftrace_test_0'; did you mean 'ftrace_stub'?
 2022-12-06 19:08 UTC 

[jolsa-perf:bpf/tracing_multi_ng_7 17/30] kernel/bpf/syscall.c:2546:22: error: implicit declaration of function 'is_tracing_multi'
 2022-12-06 18:48 UTC 

[PoC PATCH 06/11] btrfs: scrub: add the error reporting for scrub2_stripe
 2022-12-06 18:48 UTC 

[jolsa-perf:bpf/tracing_multi_ng_7 26/30] include/linux/trace_events.h:798:5: warning: no previous prototype for function 'bpf_tracing_multi_attach'
 2022-12-06 18:48 UTC 

[PATCH] mm/uffd: Always wr-protect pte in pte_mkuffd_wp()
 2022-12-06 18:38 UTC  (4+ messages)

kernel/trace/trace.h:1338:13: sparse: sparse: incorrect type in argument 1 (different address spaces)
 2022-12-06 18:27 UTC 

[jolsa-perf:bpf/tracing_multi_ng_7 26/30] include/linux/trace_events.h:798:5: error: no previous prototype for 'bpf_tracing_multi_attach'
 2022-12-06 18:17 UTC 

arch/sh/kernel/traps_32.c:574:9: sparse: sparse: incorrect type in initializer (different address spaces)
 2022-12-06 18:17 UTC 

[PATCH v3] [mm-unstable] mm: Fix memcg reclaim on memory tiered systems
 2022-12-06 18:17 UTC  (2+ messages)

[RFC PATCH 2/2] mm/ptshare: Create a new mm for shared pagetables and add basic page table sharing support
 2022-12-06 18:07 UTC  (2+ messages)

[linux-next:master 11911/13282] include/linux/signal.h:97:11: error: array index 3 is past the end of the array (that has type 'unsigned long[2]')
 2022-12-06 18:07 UTC 

[jolsa-perf:bpf/tracing_multi_ng_7 30/30] kernel/bpf/trampoline.c:1281:14: error: 'i' undeclared
 2022-12-06 17:47 UTC 

arch/arm64/kvm/hyp/nvhe/stacktrace.c:46:6: warning: no previous prototype for 'kvm_nvhe_prepare_backtrace'
 2022-12-06 17:37 UTC 

[asahilinux:bits/200-dcp 1/70] drivers/gpu/drm/apple/parser.c:172:5: warning: no previous prototype for function 'iterator_begin'
 2022-12-06 17:17 UTC 

[linux-stable-rc:linux-5.10.y 9533/9926] aperf.c:58:9: warning: 'ftime' is deprecated: Use gettimeofday or clock_gettime instead
 2022-12-06 17:06 UTC 

[jolsa-perf:bpf/tracing_multi_ng_7 25/30] kernel/bpf/trampoline.c:1260:15: error: implicit declaration of function 'set_ftrace_direct'; did you mean 'modify_ftrace_direct'?
 2022-12-06 16:56 UTC 

[rgushchin:mqueue_msg_cache 1/1] ipc/msgutil.c:92:44: error: implicit declaration of function 'get_current'; did you mean 'get_cred'?
 2022-12-06 16:16 UTC 

[PATCH 1/1] crypto: ccp - Allocate TEE ring and cmd buffer using DMA APIs
 2022-12-06 16:06 UTC 

[RFC PATCH 1/1] clk: core: use 64-bit integers
 2022-12-06 15:46 UTC  (3+ messages)

[tobetter:odroid-6.1.y 20/69] drivers/pwm/pwm-gpio.c:60:22: warning: no previous prototype for function 'gpio_pwm_timer'
 2022-12-06 15:46 UTC 

[jolsa-perf:bpf/tracing_multi_ng_7 26/30] do_mounts.c:(.text+0x38c): multiple definition of `bpf_tracing_multi_attach'; init/main.o:main.c:(.text+0x5dc): first defined here
 2022-12-06 15:25 UTC 

drivers/mux/mmio.c:76:34: error: storage size of 'field' isn't known
 2022-12-06 15:25 UTC 

[jolsa-perf:bpf/tracing_multi_ng_7 15/30] kernel/bpf/syscall.c:2916:49: error: passing argument 1 of 'bpf_trampoline_unlink_prog' from incompatible pointer type
 2022-12-06 15:25 UTC 

[PATCH] net: dsa: sja1105: fix slab-out-of-bounds in sja1105_setup
 2022-12-06 15:18 UTC 

[PATCH v2] hfsplus: Add module parameter to enable force writes
 2022-12-06 15:17 UTC  (3+ messages)

[linux-next:master 11969/13282] drivers/net/thunderbolt.c:733:47: sparse: sparse: restricted __le32 degrades to integer
 2022-12-06 15:07 UTC  (2+ messages)

[cel:topic-the-not-so-distant-future 55/82] net/sunrpc/svc.c:1466 svc_process() error: we previously assumed 'p' could be null (see line 1454)
 2022-12-06 15:07 UTC  (2+ messages)

drivers/gpu/drm/arm/display/komeda/komeda_dev.c:49:37: warning: unused variable 'komeda_register_fops'
 2022-12-06 15:05 UTC 

[linux-next:master 12241/13282] arch/riscv/kernel/crash_core.c:8:20: error: use of undeclared identifier 'VA_BITS'
 2022-12-06 14:55 UTC 

[jolsa-perf:bpf/tracing_multi_ng_7 11/30] kernel/trace/ftrace.c:5231:1: warning: no previous prototype for 'ftrace_find_direct_func_list'
 2022-12-06 14:25 UTC 

[jolsa-perf:bpf/tracing_multi_ng_7 26/30] include/linux/trace_events.h:798:5: warning: no previous prototype for 'bpf_tracing_multi_attach'
 2022-12-06 14:25 UTC 

[jolsa-perf:bpf/tracing_multi_ng_7 1/30] kernel/trace/ftrace_test.c:7:6: warning: no previous prototype for 'ftrace_test_0'
 2022-12-06 14:14 UTC 

[jolsa-perf:bpf/tracing_multi_ng_7 11/30] kernel/trace/ftrace.c:5232: warning: expecting prototype for ftrace_find_direct_func(). Prototype was for ftrace_find_direct_func_list() instead
 2022-12-06 14:04 UTC 

[PATCH] tracing: Fix complicated dependency of
 2022-12-06 12:56 UTC  (2+ messages)

[usb:usb-testing 2/2] drivers/usb/gadget/legacy/webcam.c:174:3: error: field designator 'bmInterfaceFlags' does not refer to any field in type 'const struct uvc_format_uncompressed'; did you mean 'bmInterlaceFlags'?
 2022-12-06 12:31 UTC  (3+ messages)

[linux-stable-rc:linux-5.15.y 9141/9999] memslot_modification_stress_test.c:75:32: error: expected expression before 'int'
 2022-12-06 12:23 UTC 

[Intel-gfx] [PATCH v2 3/6] drm/i915/gsc: GSC firmware loading
 2022-12-06 12:03 UTC  (3+ messages)

[linux-next:master 5267/13282] hugetlb-madvise.c:20: warning: "__USE_GNU" redefined
 2022-12-06 11:33 UTC 

net/mptcp/pm_netlink.c:1169 mptcp_pm_parse_pm_addr_attr() warn: missing error code? 'err'
 2022-12-06 10:42 UTC  (4+ messages)

[PATCH 2/2] kbuild: add -Wundef to KBUILD_CPPFLAGS for W=1 builds
 2022-12-06 10:42 UTC  (2+ messages)

[linux-next:master 12451/13282] arch/loongarch/kernel/asm-offsets.c:262:6: warning: no previous prototype for 'output_pbe_defines'
 2022-12-06 10:02 UTC 

[PATCH 1/3] cxl/mbox: Add background operation handling machinery
 2022-12-06  9:42 UTC 

[PATCH v5 06/10] nvmet: add copy command support for bdev and file ns
 2022-12-06  9:22 UTC 

[intel-tdx:guest-filter 19/29] ld.lld: error: undefined symbol: acpi_tbl_allow_setup
 2022-12-06  9:11 UTC 

[linux-next:master 10545/12617] htmldocs: Documentation/output/frontend.h.rst:6: WARNING: undefined label: fec-1-3 (if the link has no caption the label must precede a section header)
 2022-12-06  9:11 UTC  (4+ messages)

[RFC PATCH 1/5] nvme-pci: add function nvme_submit_vf_cmd to issue admin commands for VF driver
 2022-12-06  9:01 UTC  (2+ messages)

[drm-intel:drm-intel-gt-next 3/3] drivers/gpu/drm/i915/gt/intel_gt_mcr.c:370:29: error: result of comparison of constant 3142 with expression of type 'u8' (aka 'unsigned char') is always false
 2022-12-06  9:01 UTC 

[linux-stable-rc:linux-5.4.y 3529/6391] ld.lld: error: net/nfc/af_nfc.o: contains a compressed section, but zlib is not available
 2022-12-06  8:51 UTC 

[linux-next:master 10375/13282] kismet: WARNING: unmet direct dependencies detected for MUX_MMIO when selected by SPI_DW_BT1
 2022-12-06  8:41 UTC 

include/asm-generic/cmpxchg-local.h:30:42: sparse: sparse: cast truncates bits from constant value (e0f510cc becomes cc)
 2022-12-06  7:10 UTC 

[RFC] wifi: ath10k: Implement duplicate detection for non-offloaded PCIe
 2022-12-06  7:00 UTC  (2+ messages)

vmlinux.o: warning: objtool: xen_hypercall_iret+0x0: RET before UNTRAIN
 2022-12-06  7:00 UTC 

fs/reiserfs/reiserfs.o: warning: objtool: balance_leaf+0x29cc: stack state mismatch: cfa1=4+192 cfa2=4+208
 2022-12-06  6:20 UTC 

[linux-next:master 2567/13282] tools/testing/selftests/bpf/bpf_testmod/bpf_testmod.c:131:14: warning: no previous prototype for 'bpf_testmod_fentry_test1'
 2022-12-06  5:09 UTC 

[PATCH] regulator: core: Use different devices for resource allocation and DT lookup
 2022-12-06  4:59 UTC 

[linux-next:master 10375/13282] kismet: WARNING: unmet direct dependencies detected for MUX_MMIO when selected by PHY_AM654_SERDES
 2022-12-06  4:59 UTC 

[linux-stable-rc:linux-4.19.y 473/4570] ld.lld: error: drivers/usb/common/common.o: contains a compressed section, but zlib is not available
 2022-12-06  4:49 UTC 

[linux-stable-rc:linux-5.4.y 691/6391] ld.lld: error: drivers/usb/common/debug.o: contains a compressed section, but zlib is not available
 2022-12-06  4:18 UTC 

[oracle-dtrace:kallmodsyms/latest 4/13] net/dccp/ipv6.c:94:7: error: call to undeclared function '__inet6_lookup_established'; ISO C99 and later do not support implicit function declarations
 2022-12-06  3:58 UTC 

[oracle-dtrace:kallmodsyms/latest 4/13] include/net/snmp.h:163:44: error: request for member 'syncp' in something not a structure or union
 2022-12-06  3:48 UTC 

[PATCH 4/6] f2fs: refactor extent_cache to support for read and more
 2022-12-06  3:28 UTC  (3+ messages)

[jpirko-mlxsw:jiri_devel_devlink_ports_init 8/8] net/core/devlink.c:9856:16: warning: unused variable 'port_index'
 2022-12-06  3:07 UTC 

[PATCH 6/6] f2fs: add block_age-based extent cache
 2022-12-06  2:47 UTC 

[intel-tdx:kvm-upstream-workaround 96/398] arch/x86/kvm/mmu/mmu.c:6984:6: warning: no previous prototype for function 'kvm_arch_update_mem_attr'
 2022-12-06  2:37 UTC 

[PATCH 01/11] dmapool: add alloc/free performance test
 2022-12-06  2:17 UTC 

tools/testing/selftests/bpf/bpf_testmod/bpf_testmod.c:16:14: warning: no previous prototype for 'bpf_testmod_loop_test'
 2022-12-06  1:57 UTC 

[PATCH bpf-next] bpf, test_run: fix alignment problem in bpf_test_init()
 2022-12-06  1:26 UTC 

[brgl:gpio/for-next 63/65] drivers/gpio/gpio-loongson-64bit.c:250:59: sparse: sparse: Using plain integer as NULL pointer
 2022-12-06  1:16 UTC 

include/asm-generic/io.h:464:31: error: performing pointer arithmetic on a null pointer has undefined behavior
 2022-12-06  0:46 UTC 

[RFC PATCH] tcp: correct srtt and mdev_us calculation
 2022-12-06  0:46 UTC 

[PATCH] usb: gadget: uvc: Rename bmInterfaceFlags -> bmInterlaceFlags
 2022-12-05 23:45 UTC  (2+ messages)

[linux-next:master 7051/13214] drivers/mmc/host/sdhci-brcmstb.c:182:34: warning: unused variable 'sdhci_brcm_of_match'
 2022-12-05 23:25 UTC 

[PATCH 1/6] hyperv: Make remove callback of hyperv driver void returned
 2022-12-05 22:55 UTC 

[PATCH v2 net 2/2] vmxnet3: use correct intrConf reference when using extended queues
 2022-12-05 22:43 UTC 

[linux-stable-rc:queue/5.4 55/154] drivers/usb/host/bcma-hcd.c:412:24: error: implicit declaration of function 'dev_err_probe'; did you mean 'device_reprobe'?
 2022-12-05 22:34 UTC 

[PATCH 11/11] dmapool: link blocks across pages
 2022-12-05 22:34 UTC 


This is a public inbox, see mirroring instructions
for how to clone and mirror all data and code used for this inbox;
as well as URLs for NNTP newsgroup(s).