oe-kbuild-all.lists.linux.dev archive mirror
 help / color / mirror / Atom feed
 messages from 2024-03-06 02:46:55 to 2024-03-09 08:42:24 UTC [more...]

[herbert-cryptodev-2.6:master 80/80] crypto/scompress.c:174:38: warning: unused variable 'dst_page'
 2024-03-09  8:42 UTC 

[RFC PATCH net-next v1 1/2] net: mirror skb frag ref/unref helpers
 2024-03-09  8:42 UTC  (3+ messages)

[openeuler:openEuler-1.0-LTS 13425/21785] drivers/net/ethernet/huawei/hinic/hinic_main.c:249:23: error: implicit declaration of function 'vlan_dev_priv'; did you mean 'netdev_priv'?
 2024-03-09  7:07 UTC 

[chrome-os:chromeos-5.15 7/8] drivers/bluetooth/btintel.c:2573:43: warning: this statement may fall through
 2024-03-09  6:45 UTC 

[cip:linux-6.1.y-cip-rebase 142/215] undefined reference to `rz_mtu3_shared_reg_read'
 2024-03-09  6:23 UTC 

[android-common:android15-6.6 9111/9226] arch/arm64/kvm/hyp/nvhe/hyp-main.c:39:1: sparse: sparse: symbol '__pcpu_scope_host_hyp_reqs' was not declared. Should it be static?
 2024-03-09  5:51 UTC 

[asahilinux:pr/277 1/1] drivers/power/supply/macsmc_power.c:518:10: error: 'const struct power_supply_desc' has no member named 'charge_behaviours'
 2024-03-09  5:21 UTC 

[driver-core:const_work 180/183] drivers/bus/fsl-mc/fsl-mc-bus.c:409:20: sparse: sparse: incorrect type in initializer (different modifiers)
 2024-03-09  3:27 UTC 

[efi:next 1/7] drivers/firmware/efi/libstub/efi-stub-helper.c:225:26: warning: field tagged_event within 'struct efistub_measured_event' is less aligned than 'TCG_PCClientTaggedEvent' (aka 'struct tdTCG_PCClientTaggedEvent') and is usually due to 'struct efistub_measure
 2024-03-09  3:07 UTC 

[linux-next:master 10291/12944] drivers/gpio/gpio-nomadik.c:462:20: error: static declaration of 'nmk_gpio_dbg_show_one' follows non-static declaration
 2024-03-09  2:46 UTC 

[jfern:sched/dlserver.debug.mar3.2024 29987/30000] kernel/sched/deadline.c:1363:1: warning: 'update_stats_dequeue_dl' declared 'static' but never defined
 2024-03-09  2:04 UTC 

[pablo-gtp:main 15/15] drivers/net/gtp.c:605:14: warning: variable 'pctx' is uninitialized when used here
 2024-03-09  2:04 UTC 

[djwong-xfs:fsverity-cleanups-6.9 21/37] fs/xfs/libxfs/xfs_ondisk.h:19:31: error: expression in static assertion is not constant
 2024-03-09  2:04 UTC 

[opencloudos:linux-5.4/next 24725/27434] kernel/bpf/syscall.c:1804:56: sparse: sparse: incorrect type in argument 2 (different address spaces)
 2024-03-09  1:54 UTC 

[jmondi:pispbe/media-staging/be-upstream 15/143] clk-rp1.c:undefined reference to `rp1_get_platform'
 2024-03-09  1:44 UTC 

[linux-next:master 12265/12944] arch/riscv/include/asm/pgtable.h:735:16: error: implicit declaration of function 'pud_leaf'; did you mean 'pmd_leaf'?
 2024-03-09  1:11 UTC 

[groeck-staging:kunit 14/15] arch/riscv/include/asm/bug.h:73:40: error: '__BUG_FUNC' undeclared
 2024-03-09  1:11 UTC 

[driver-core:const_work 180/183] drivers/bus/fsl-mc/fsl-mc-bus.c:409:19: warning: initialization discards 'const' qualifier from pointer target type
 2024-03-09  1:11 UTC 

[linux-next:master 1444/12944] /usr/bin/ld: cannot find ../lib/api/libapi.a: No such file or directory
 2024-03-09  0:51 UTC 

[char-misc:char-misc-next 63/70] drivers/accessibility/speakup/devsynth.c:111:3: error: expected statement
 2024-03-09  0:51 UTC 

[sailus-media-tree:master 26/27] drivers/media/v4l2-core/v4l2-async.c:623:13: warning: unused variable 'ret'
 2024-03-09  0:41 UTC 

[jfern:sched/dlserver.debug.mar3.2024 29986/30000] kernel/sched/rt.c:1078:9: warning: ISO C90 forbids mixed declarations and code
 2024-03-08 23:48 UTC 

[morimoto:card2-trigger-order-2023-02-28 28/33] drivers/of/property.c:618 of_graph_get_port_by_id() warn: unsigned 'id' is never less than zero
 2024-03-08 23:28 UTC 

[linux-next:master 12610/12944] arch/mips/ralink/timer.c:136:34: error: array type has incomplete element type 'struct of_device_id'
 2024-03-08 23:17 UTC 

[djwong-xfs:fsverity-cleanups-6.9 9/37] include/trace/events/fsverity.h:18:1: sparse: sparse: incorrect type in assignment (different base types)
 2024-03-08 22:57 UTC 

[PATCH 3/5] media: imx335: Use V4L2 CCI for accessing sensor registers
 2024-03-08 22:36 UTC 

[stffrdhrn:or1k-fpu-regs 1/1] make[5]: *** No rule to make target 'arch/openrisc/kernel/fpu.o', needed by 'arch/openrisc/kernel/built-in.a'
 2024-03-08 22:36 UTC 

[djwong-xfs:fsverity-cleanups-6.9 28/37] xfs_buf_mem.c:undefined reference to `shmem_get_folio'
 2024-03-08 22:26 UTC 

[djwong-xfs:fsverity-cleanups-6.9 9/37] include/trace/events/fsverity.h:171:3: warning: format specifies type 'unsigned long' but the argument has type 'size_t' (aka 'unsigned int')
 2024-03-08 21:34 UTC 

[android-common:android15-6.6 154/176] arch/arm64/kvm/hyp/nvhe/trace.c:37:1: sparse: sparse: symbol '__pcpu_scope_trace_rb' was not declared. Should it be static?
 2024-03-08 21:13 UTC 

[PATCH 1/5] media: imx335: Support 2 or 4 lane operation modes
 2024-03-08 20:51 UTC  (3+ messages)

[opencloudos:linux-5.4/next 26653/27434] mm/memcontrol.c:6774:12: warning: 'mem_cgroup_bind_blkio_show' defined but not used
 2024-03-08 20:51 UTC 

[RFC PATCH bpf-next 1/5] bpf: Add link support for sk_msg prog
 2024-03-08 20:31 UTC 

[PATCH v5 3/4] drm/i915/gt: Disable tests for CCS engines beyond the first
 2024-03-08 20:25 UTC 

[char-misc:char-misc-next 69/70] drivers/uio/uio_dmem_genirq.c:63:39: warning: cast from pointer to integer of different size
 2024-03-08 20:09 UTC 

[android-common:android15-6.6 4/7] binfmt_elf.c:undefined reference to `__moddi3'
 2024-03-08 19:48 UTC 

[char-misc:char-misc-next 63/70] drivers/accessibility/speakup/devsynth.c:111:3: warning: label at end of compound statement is a C23 extension
 2024-03-08 19:15 UTC 

[djwong-xfs:fsverity-cleanups-6.9 28/37] fs/xfs/xfs_super.c:670:2: error: call to undeclared function 'xfs_verity_destroy_cache'; ISO C99 and later do not support implicit function declarations
 2024-03-08 19:15 UTC 

[djwong-xfs:fsverity-cleanups-6.9 9/37] include/trace/events/fsverity.h:169:19: warning: format '%lu' expects argument of type 'long unsigned int', but argument 4 has type 'size_t' {aka 'unsigned int'}
 2024-03-08 19:04 UTC 

[gustavoars:testing/WFAMNAE-next20240305 1/1] include/linux/bpf-cgroup.h:191:22: sparse: sparse: incompatible types in comparison expression (different base types):
 2024-03-08 18:44 UTC 

[openeuler:openEuler-1.0-LTS 15642/21783] kernel/sched/topology.c:1624:32: sparse: sparse: incorrect type in initializer (different base types)
 2024-03-08 18:22 UTC 

[android-common:android15-6.6 4/7] fs/binfmt_elf.c:2076: undefined reference to `__moddi3'
 2024-03-08 18:02 UTC 

[char-misc:char-misc-next 63/70] drivers/accessibility/speakup/devsynth.c:111:3: warning: label at end of compound statement is a C2x extension
 2024-03-08 17:31 UTC 

[android-common:android15-6.6 3/7] fs/binfmt_elf.c:2162:19: error: 'struct linux_binfmt' has no member named 'min_coredump'
 2024-03-08 17:21 UTC 

[PATCH 8/8] ring-buffer: Validate boot range memory events
 2024-03-08 15:39 UTC 

[linux-next:master 9129/12944] drivers/mtd/ubi/nvmem.c:34:9: error: incompatible pointer types passing 'int *' to parameter of type 'uint64_t *' (aka 'unsigned long long *')
 2024-03-08 14:27 UTC 

[char-misc:char-misc-next 68/70] drivers/uio/uio_pruss.c:194:34: warning: cast from pointer to integer of different size
 2024-03-08 13:35 UTC 

[android-common:android15-6.6 3/7] fs/binfmt_elf.c:2162:13: error: no member named 'min_coredump' in 'struct linux_binfmt'
 2024-03-08 11:51 UTC 

[PATCH v2 5/7] mpi3mr: Debug ability improvements
 2024-03-08 11:40 UTC 

[davidhildenbrand:pfn_cow 3/5] arch/x86/mm/pat/memtype.c:1018:13: error: implicit declaration of function 'vma_get_pat_info'
 2024-03-08 11:28 UTC 

drivers/vfio/pci/vfio_pci_config.c:1555:5-8: Unneeded variable: "ret". Return "0" on line 1586
 2024-03-08 11:28 UTC 

[davidhildenbrand:pfn_cow 3/5] arch/x86/mm/pat/memtype.c:199:36: warning: right shift count >= width of type
 2024-03-08 11:28 UTC 

drivers/net/wireless/intel/iwlwifi/mvm/sta.c:4307:17: warning: conditional expression between different enumeration types ('enum iwl_fw_sta_type' and 'enum iwl_sta_type')
 2024-03-08 11:28 UTC 

[PATCH 5/8] ring-buffer: Add ring_buffer_meta data
 2024-03-08 10:54 UTC  (2+ messages)

[opencloudos:linux-5.4/next 25785/27434] net/ipv4/netfilter/ipt_WH.c:41:18: sparse: sparse: cast from restricted __be32
 2024-03-08 10:31 UTC 

[jmondi:pispbe/media-staging/be-upstream 13/143] ERROR: modpost: "irq_domain_deactivate_irq" [drivers/mfd/rp1.ko] undefined!
 2024-03-08 10:31 UTC 

[opencloudos:linux-5.4/next 27126/27434] drivers/char/ipmi/ipmi_bt_sm.c:194:18: error: implicit declaration of function 'acpi_evaluate_integer'; did you mean 'acpi_evaluate_object'?
 2024-03-08 10:09 UTC 

[intel-tdx:guest-filter 29/36] arch/parisc/include/asm/io.h:128:22: error: called object is not a function or function pointer
 2024-03-08 10:09 UTC 

WARNING: modpost: "__udelay" [drivers/phy/qualcomm/phy-qcom-qmp-combo.ko] has no CRC!
 2024-03-08  9:36 UTC 

WARNING: modpost: "__udelay" [drivers/net/mdio/mdio-bcm-unimac.ko] has no CRC!
 2024-03-08  9:19 UTC 

[jmondi:pispbe/media-staging/be-upstream 15/143] clk-rp1.c:(.text+0x210): relocation truncated to fit: R_NIOS2_CALL26 against `rp1_get_platform'
 2024-03-08  9:19 UTC 

[PATCH 1/2] drm/panthor: Enable fdinfo for cycle and time measurements
 2024-03-08  8:47 UTC 

[djwong-xfs:fsverity-cleanups-6.9 21/37] fs/xfs/libxfs/xfs_ondisk.h:199:18: error: static assertion expression is not an integral constant expression
 2024-03-08  8:47 UTC 

[jmondi:pispbe/media-staging/be-upstream 21/143] ERROR: modpost: "__divdi3" [drivers/hwmon/rp1-adc.ko] undefined!
 2024-03-08  8:25 UTC 

[android-common:android15-6.6 9111/9226] arch/arm64/kvm/hyp/nvhe/hyp-main.c:39:1: sparse: sparse: symbol '__pcpu_scope_host_hyp_reqs' was not declared. Should it be static?
 2024-03-08  7:33 UTC 

[tglx-devel:x86/core 3/9] drivers/gpu/drm/i915/i915_memcpy.c:144:2: error: call to undeclared function 'BUG_ON'; ISO C99 and later do not support implicit function declarations
 2024-03-08  7:33 UTC 

[opencloudos:linux-5.4/next 26625/27434] net/core/netclassid_cgroup.c:518:5: warning: no previous prototype for 'bps_limit_dump'
 2024-03-08  7:10 UTC 

[openeuler:openEuler-1.0-LTS 15383/21781] fs/proc/etmem_scan.c:244:18: sparse: sparse: incorrect type in assignment (different address spaces)
 2024-03-08  7:10 UTC 

[riteshharjani:ext2-iomap-lsfmm-rfcv2 2/4] fs/ext2/inode.c:1000:39: sparse: sparse: symbol 'ext2_file_aops' was not declared. Should it be static?
 2024-03-08  7:10 UTC 

[RFC 3/3] arm64: dts: qcom: sa8775p-ride: Enable support for firmware managed resources
 2024-03-08  6:28 UTC 

[android-common:android15-6.1 15/57] arch/arm64/kvm/hyp/nvhe/iommu/arm-smmu-v3.c:602:5: warning: no previous prototype for function 'smmu_alloc_domain'
 2024-03-08  6:05 UTC 

[djwong-xfs:fsverity-cleanups-6.9 10/37] fs/iomap/buffered-io.c:545: warning: Excess function parameter 'wq' description in 'iomap_readahead'
 2024-03-08  6:05 UTC 

drivers/iommu/arm-smmu.c:1537:1: warning: label 'out_unlock' defined but not used
 2024-03-08  5:53 UTC 

vmlinux.o: warning: objtool: print_insn_state+0x3d6: undefined stack state
 2024-03-08  5:31 UTC 

ERROR: modpost: "ebus_dma_enable" [drivers/parport/parport_pc.ko] undefined!
 2024-03-08  5:09 UTC 

[jmondi:pispbe/media-staging/be-upstream 13/143] drivers/mfd/rp1.c:86:18: warning: format '%llx' expects argument of type 'long long unsigned int', but argument 4 has type 'resource_size_t' {aka 'unsigned int'}
 2024-03-08  3:26 UTC 

[jmondi:pispbe/media-staging/be-upstream 34/143] drivers/irqchip/irq-bcm2712-mip.c:229:61: error: passing argument 3 of 'of_property_read_u64' from incompatible pointer type
 2024-03-08  3:26 UTC 

[amir73il:fsnotify-perf 9/13] include/linux/fsnotify_backend.h:490:23: error: no member named 's_fsnotify_info' in 'struct super_block'
 2024-03-08  2:32 UTC 

drivers/iommu/rockchip-iommu.c:1130:26: error: initialization of 'void (*)(struct iommu_domain *, long unsigned int, size_t)' {aka 'void (*)(struct iommu_domain *, long unsigned int, long unsigned int)'} from incompatible pointer type 'void (*)(struct d
 2024-03-08  1:59 UTC 

[RFC 2/3] USB: dwc3: qcom: Add support for firmware managed resources
 2024-03-08  0:57 UTC 

arch/x86/platform/uv/uv_irq.c:39:27: error: no member named 'irq_dest_mode' in 'struct apic'
 2024-03-08  0:15 UTC 

[jmondi:pispbe/media-staging/be-upstream 6/143] drivers/pinctrl/bcm/pinctrl-bcm2712.c:598:39: warning: unused variable 'bcm2712_c0_aon_sgpio_pin_funcs'
 2024-03-07 23:23 UTC 

[openeuler:OLK-5.10 28904/30000] arch/x86/kernel/cpu/common.c:92:16: sparse: sparse: incorrect type in initializer (different address spaces)
 2024-03-07 22:31 UTC 

[jmondi:pispbe/media-staging/be-upstream 64/143] drivers/media/platform/raspberrypi/rp1_cfe/cfe.c:2385:12: warning: 'cfe_runtime_resume' defined but not used
 2024-03-07 22:19 UTC 

[geert-renesas-drivers:master 34/52] drivers/phy/qualcomm/phy-qcom-qmp-usb.c:1340:10: error: 'const struct qmp_phy_cfg' has no member named 'lanes'
 2024-03-07 22:19 UTC 

[l1k:spdm-future 16/34] include/crypto/internal/ecc.h:74:34: sparse: sparse: cast to restricted __be64
 2024-03-07 21:47 UTC 

[android-common:android15-6.6 154/176] arch/arm64/kvm/hyp/nvhe/trace.c:37:1: sparse: sparse: symbol '__pcpu_scope_trace_rb' was not declared. Should it be static?
 2024-03-07 21:36 UTC 

[opencloudos:linux-5.4/next 25735/27434] kernel/sched/psi.c:276:38: error: 'memory_cgrp_subsys_on_dfl_key' undeclared; did you mean 'debug_cgrp_subsys_on_dfl_key'?
 2024-03-07 21:36 UTC 

[alobakin:idpf-libie-new 6/61] drivers/net/ethernet/intel/libeth/rx.c:38: warning: Function parameter or struct member 'fq' not described in 'libeth_rx_page_pool_create'
 2024-03-07 21:25 UTC 

[opencloudos:next 25/98] net-procfs.c:undefined reference to `snmp_fold_field'
 2024-03-07 21:13 UTC 

[jmondi:pispbe/media-staging/be-upstream 6/143] drivers/pinctrl/bcm/pinctrl-bcm2712.c:1009:20: warning: variable 'arg' set but not used
 2024-03-07 20:52 UTC 

[openeuler:OLK-6.6 3862/3876] drivers/net/ethernet/mucse/rnp/rnp_main.c:2402:71: warning: '-' directive output may be truncated writing 1 byte into a region of size between 0 and 17
 2024-03-07 20:20 UTC 

[android-common:android13-5.10-2023-05 2047/27432] ERROR: modpost: "virtio_dma_buf_attach" [drivers/gpu/drm/virtio/virtio-gpu.ko] undefined!
 2024-03-07 19:38 UTC 

[PATCH 1/1] arm64: syscall: Direct PRNG kstack randomization
 2024-03-07 19:05 UTC 

[openeuler:OLK-6.6 3862/3876] drivers/net/ethernet/mucse/rnp/rnp_mbx_fw.c:1456:5: warning: no previous prototype for function 'rnp_mbx_lldp_all_ports_enable'
 2024-03-07 18:33 UTC 

[opencloudos:linux-5.4/next 24954/27434] drivers/net/bonding/bond_main.c:4259:26: sparse: sparse: incompatible types in comparison expression (different address spaces):
 2024-03-07 18:21 UTC 

[opencloudos:linux-5.4/next 24817/27434] net/toa/toa.c:213:17: sparse: sparse: incorrect type in initializer (different address spaces)
 2024-03-07 17:29 UTC 

[opencloudos:linux-5.4/next 25735/27434] kernel/sched/psi.c:275:38: error: 'cpu_cgrp_subsys_on_dfl_key' undeclared; did you mean 'cpuset_cgrp_subsys_on_dfl_key'?
 2024-03-07 17:19 UTC 

[amir73il:fsnotify-sbinfo 9/12] include/linux/fsnotify_backend.h:490:28: error: 'struct super_block' has no member named 's_fsnotify_info'
 2024-03-07 16:27 UTC 

[s390:features 97/98] Unsupported relocation type: 21
 2024-03-07 16:13 UTC  (9+ messages)

[PATCH v3 06/14] linux/mm.h: move folio_size(), ... to mm/folio_size.h
 2024-03-07 15:55 UTC 

[android-common:android15-6.1 14/57] arch/arm64/kvm/hyp/nvhe/iommu/io-pgtable-arm.c:48:5: warning: no previous prototype for function 'kvm_arm_io_pgtable_init'
 2024-03-07 15:55 UTC 

[PATCH 22/22] drm: ensure drm headers are self-contained and pass kernel-doc
 2024-03-07 15:43 UTC  (6+ messages)

[PATCH 7/7] vfio/fsl-mc: Block calling interrupt handler without trigger
 2024-03-07 15:21 UTC 

[pinchartl:rpi/v6.8/isp/v2 1/22] drivers/staging/vc04_services/vc-sm-cma/vc_sm_cma_vchi.c:476:55: sparse: sparse: Using plain integer as NULL pointer
 2024-03-07 14:49 UTC 

[PATCH 4/4] Enable Driver compilation in crypto Kconfig and Makefile file
 2024-03-07 14:24 UTC  (5+ messages)

[linux-next:master 10409/11394] ERROR: modpost: "__fentry__" [tools/testing/selftests/livepatch/test_modules/test_klp_atomic_replace.ko] undefined!
 2024-03-07 12:01 UTC  (2+ messages)

[opencloudos:next 18/98] toa.c:undefined reference to `inet_getname'
 2024-03-07 13:25 UTC 

[amir73il:fsnotify-sbinfo 10/12] include/linux/fsnotify_backend.h:496:1: warning: control reaches end of non-void function
 2024-03-07 12:53 UTC 

[linux-next:master 11882/12647] fs/btrfs/extent_io.c:3246:26: warning: 'last_extent_end' may be used uninitialized
 2024-03-07 11:59 UTC  (2+ messages)

pcap-dbus.o:undefined reference to `dbus_message_demarshal'
 2024-03-07 11:31 UTC  (8+ messages)

[PATCH v3 3/7] nvdimm: pmem: assign a parent resource for vmemmap region for the fsdax
 2024-03-07 11:08 UTC  (2+ messages)

WARNING: modpost: "__ashldi3" [drivers/ata/libahci.ko] has no CRC!
 2024-03-07 10:46 UTC 

[opencloudos:linux-5.4/next 24592/27434] ld: kernel/sysctl.o:undefined reference to `cpuset_cpuinfo_show_realinfo'
 2024-03-07 10:04 UTC 

[iwlwifi-chromeos:chromeos-6.1__release/core87_preview 26911/27032] drivers/net/wireless/iwl7000/iwlwifi/mvm/link.c:557:6: warning: no previous prototype for function 'iwl_mvm_mld_valid_link_pair'
 2024-03-07  9:42 UTC 

[android-common:android15-6.1 51/57] arch/arm64/kvm/iommu.c:63:15: warning: no previous prototype for 'kvm_get_iommu_id'
 2024-03-07  8:29 UTC 

[linux-next:master 11602/11963] ERROR: modpost: "acpi_device_notify_remove" [drivers/i2c/i2c-core.ko] undefined!
 2024-03-07  8:21 UTC  (3+ messages)

[PATCH 3/4] ASoC: fsl: Let imx-audio-rpmsg register platform device for card
 2024-03-07  7:35 UTC  (2+ messages)

[PATCH 4/4] arm64: dts: freescale: Add device tree for Compulab SB-UCM-iMX8MPLUS
 2024-03-07  7:35 UTC 

[android-common:android15-6.1 6086/21518] aarch64-linux-ld: ID map text too big or misaligned
 2024-03-07  6:53 UTC 

[RFC PATCH 1/2] sched/fair: Introduce per-task io util boost
 2024-03-07  6:20 UTC 

[robertosassu:evm-fscaps-v2 29/29] security/security.c:2375:15: error: implicit declaration of function 'ima_inode_set_fscaps'; did you mean 'evm_inode_set_fscaps'?
 2024-03-07  4:55 UTC 

[morimoto:card2-trigger-order-2023-02-28 28/33] drivers/of/property.c:618 of_graph_get_port_by_id() warn: unsigned 'id' is never less than zero
 2024-03-07  4:23 UTC 

[opencloudos:linux-5.4/next 24881/27434] drivers/virtio/virtio_balloon.c:161:5: sparse: sparse: symbol 'virtballoon_free_page_report' was not declared. Should it be static?
 2024-03-07  3:40 UTC 

[opencloudos:linux-5.4/next 24725/27434] kernel/bpf/syscall.c:1804:56: sparse: sparse: incorrect type in argument 2 (different address spaces)
 2024-03-07  3:08 UTC 

[robertosassu:evm-fscaps-v2 29/29] security/security.c:2375:8: error: call to undeclared function 'ima_inode_set_fscaps'; ISO C99 and later do not support implicit function declarations
 2024-03-07  2:56 UTC 

[linux-next:master 8264/11963] ERROR: modpost: "__fentry__" [tools/testing/selftests/bpf/bpf_test_no_cfi/bpf_test_no_cfi.ko] undefined!
 2024-03-07  2:08 UTC  (4+ messages)

[opencloudos:linux-5.4/next 25673/27434] fs/xfs/xfs_mount.c:1129:1: warning: no previous prototype for 'xfs_atomic_staging_cancel_all'
 2024-03-07  1:54 UTC 

[drm-misc:drm-misc-next 2/2] drivers/gpu/drm/amd/amdgpu/amdgpu_gfx.c:332:61: error: '%d' directive output may be truncated writing between 1 and 10 bytes into a region of size between 0 and 8
 2024-03-07  1:32 UTC 

[android-common:android15-6.1 43/57] arch/arm64/kvm/hyp/nvhe/iommu/iommu.c:55:5: warning: no previous prototype for 'kvm_iommu_refill'
 2024-03-07  1:32 UTC 

[trondmy-nfs-2.6:testing 17/25] fs/nfs/client.c:79:17: sparse: sparse: symbol 'nfs_rpcstat' was not declared. Should it be static?
 2024-03-07  0:50 UTC 

[jirislaby:devel 20/41] samples/kfifo/dma-example.c:63:10: error: use of undeclared identifier 'DMA_MAPPING_ERROR'
 2024-03-07  0:18 UTC 

[stffrdhrn:or1k-fpu-regs 1/1] arch/openrisc/kernel/entry.S:855: Error: unrecognized form of instruction `l.sw TASK_THFPU state for handler to inspect.3'
 2024-03-06 23:46 UTC 

[drm-misc:drm-misc-next 2/2] drivers/gpu/drm/amd/amdgpu/gfx_v9_0.c:1255:52: error: '%s' directive output may be truncated writing up to 29 bytes into a region of size 23
 2024-03-06 22:33 UTC 

[android-common:android15-6.6 2/8] drivers/iommu/io-pgtable-arm-common.c:139:5: sparse: sparse: symbol '__arm_lpae_map' was not declared. Should it be static?
 2024-03-06 21:51 UTC 

[linusw-pinctrl:ib-nomadik-gpio 28/28] drivers/gpio/gpio-nomadik.c:588:30: warning: format '%p' expects argument of type 'void *', but argument 3 has type 'long int'
 2024-03-06 21:19 UTC 

[linusw-pinctrl:ib-nomadik-gpio 28/28] drivers/gpio/gpio-nomadik.c:589:4: warning: format specifies type 'void *' but the argument has type 'long'
 2024-03-06 21:09 UTC 

[jirislaby:devel 20/41] include/linux/kfifo.h:740:60: error: 'DMA_MAPPING_ERROR' undeclared
 2024-03-06 18:05 UTC 

[pinchartl:rpi/v6.8/isp/v2 14/22] kismet: WARNING: unmet direct dependencies detected for BCM2835_VCHIQ_MMAL when selected by VIDEO_ISP_BCM2835
 2024-03-06 17:13 UTC 

[PATCH 5.10/5.15] scsi: add a length check for VARIABLE_LENGTH_CMD commands
 2024-03-06 13:51 UTC 

[syzbot] [ntfs3?] UBSAN: shift-out-of-bounds in ntfs_iget
 2024-03-06 12:21 UTC  (2+ messages)

[tycho:bpf_task_get_cgroup_id 1779/1781] .github/scripts/tests/test_veristat_compare.py: warning: ignored by one of the .gitignore files
 2024-03-06 10:39 UTC 

[brauner-vfs:vfs.mount.api 2/3] fs/freevxfs/vxfs_super.c:186: warning: Function parameter or struct member 'fc' not described in 'vxfs_fill_super'
 2024-03-06 10:29 UTC  (2+ messages)

drivers/vfio/platform/vfio_amba.c:78:44: error: passing argument 1 of 'vfio_platform_remove_common' from incompatible pointer type
 2024-03-06 10:07 UTC 

[linux-next:master 8491/8619] fs/xfs/xfs.o: warning: objtool: xfs_da_grow_inode_int+0x6c1: stack state mismatch: reg1[12]=-2-48 reg2[12]=-1+0
 2024-03-06  9:42 UTC  (2+ messages)

[opencloudos:linux-5.4/next 25350/27434] mm/khugepaged.c:108: warning: Function parameter or member 'nr_exec_vma' not described in 'mm_slot'
 2024-03-06  9:14 UTC 

[PATCH net-next 06/18] net: move ip_packet_offload and ipv6_packet_offload to net_hotdata
 2024-03-06  9:00 UTC  (2+ messages)

WARNING: modpost: "__udelay" [drivers/net/dsa/mt7530.ko] has no CRC!
 2024-03-06  8:42 UTC 

[android-common:android15-6.6 1/1] include/trace/stages/init.h:2:23: warning: 'str__gzvm__trace_system_name' defined but not used
 2024-03-06  8:30 UTC 

[geert-renesas-drivers:master 34/52] drivers/phy/qualcomm/phy-qcom-qmp-usb.c:1340:3: error: field designator 'lanes' does not refer to any field in type 'const struct qmp_phy_cfg'
 2024-03-06  8:00 UTC  (2+ messages)

arch/x86/ia32/ia32_signal.c:354:9: sparse: sparse: cast removes address space '<asn:1>' of expression
 2024-03-06  7:48 UTC 

[opencloudos:linux-5.4/next 23841/27434] drivers/thirdparty/bnxt/tf_ulp/ulp_flow_db.c:852:1: error: conflicting types for 'ulp_flow_db_flush_flows' due to enum/integer mismatch; have 'int(struct bnxt_ulp_context *, enum bnxt_ulp_fdb_type)'
 2024-03-06  7:37 UTC 

[morimoto:card2-trigger-order-2023-02-28 28/33] drivers/of/property.c:618 of_graph_get_port_by_id() warn: unsigned 'id' is never less than zero
 2024-03-06  7:37 UTC 

net/devlink/dev.c:248:20: warning: arithmetic between different enumeration types ('enum devlink_reload_limit' and 'enum devlink_reload_action')
 2024-03-06  7:15 UTC 

[isilence:zc/rx-latest 39/43] arceb-elf-ld: zc_rx.c:undefined reference to `tcp_recvmsg'
 2024-03-06  6:31 UTC 

[opencloudos:linux-5.4/next 24881/27434] drivers/virtio/virtio_balloon.c:161:5: sparse: sparse: symbol 'virtballoon_free_page_report' was not declared. Should it be static?
 2024-03-06  6:20 UTC 

[PATCH net-next v2 3/3] net: sched: make skip_sw actually skip software
 2024-03-06  5:57 UTC 

kernel/dma/mapping.c:557:29: sparse: sparse: macro "alloc_pages" passed 5 arguments, but takes just 2
 2024-03-06  4:53 UTC 

[PATCH 3/3] s390: supplement for ptdesc conversion
 2024-03-06  4:53 UTC  (3+ messages)

WARNING: modpost: "__udelay" [drivers/ptp/ptp_dfl_tod.ko] has no CRC!
 2024-03-06  4:42 UTC 

[opencloudos:linux-5.4/next 25544/27434] mm/unevictable.c:155:6: warning: no previous prototype for function 'del_unevict_task'
 2024-03-06  4:30 UTC 

[opencloudos:linux-5.4/next 24923/27434] drivers/hwmon/k10temp.c:143:12: sparse: sparse: symbol 'k10temp_temp_label' was not declared. Should it be static?
 2024-03-06  4:30 UTC 

[PATCH v3 3/5] drm/i915/psr: Calculate IO wake and fast wake lines for DISPLAY_VER < 12
 2024-03-06  3:46 UTC 

[android-common:android15-6.6 2/8] drivers/iommu/io-pgtable-arm-common.c:139:5: sparse: sparse: symbol '__arm_lpae_map' was not declared. Should it be static?
 2024-03-06  3:46 UTC 

[freescale-fslc:5.15-2.2.x-imx 3156/27938] drivers/edac/synopsys_edac.c:295: warning: Function parameter or member 'data_low' not described in 'ecc_error_info'
 2024-03-06  3:46 UTC 

[linusw-pinctrl:b4/fix-aw9523 29/29] FATAL: modpost: drivers/pinctrl/pinctrl-aw9523: struct of_device_id is not terminated with a NULL entry!
 2024-03-06  3:24 UTC 

[openeuler:OLK-6.6 2180/3862] kernel/sched/fair.c:8988:1: sparse: sparse: symbol 'qos_smt_expell_switch' was not declared. Should it be static?
 2024-03-06  3:12 UTC 


This is a public inbox, see mirroring instructions
for how to clone and mirror all data and code used for this inbox;
as well as URLs for NNTP newsgroup(s).