oe-kbuild.lists.linux.dev archive mirror
 help / color / mirror / Atom feed
[openeuler:openEuler-1.0-LTS 20772/22482] drivers/block/loop.c:1338 loop_set_status() warn: inconsistent returns '&loop_ctl_mutex'
 2024-05-23 15:56 UTC 

drivers/iommu/amd/iommu.c:2011 init_gcr3_table() warn: missing error code? 'ret'
 2024-05-23 15:09 UTC 

[PATCH RFC] fhandle: expose u64 mount id to name_to_handle_at(2)
 2024-05-23 14:47 UTC 

[PATCH 09/10] ext4: temporarily elevate commit thread priority
 2024-05-23 14:40 UTC 

[linux-next:master 10171/13355] drivers/dma/mcf-edma-main.c:116 mcf_edma_irq_init() warn: 'res->start' from request_irq() not released on lines: 88,93,98,105,113
 2024-05-23 13:28 UTC 

[PATCH v6 10/10] media: i2c: Add driver for mlx7502x ToF sensor
 2024-05-23 13:14 UTC 

[rafael-pm:bleeding-edge 11/15] drivers/opp/core.c:2447 _opp_attach_genpd() warn: missing unwind goto?
 2024-05-23 12:50 UTC 

[PATCH] iio:proximity:hx9031as: Add TYHX HX9031AS/HX9023S sensor driver
 2024-05-23 12:42 UTC 

drivers/bluetooth/btintel_pcie.c:386 btintel_pcie_recv_frame() warn: variable dereferenced before check 'data' (see line 380)
 2024-05-23 12:30 UTC 

[isilence:zcrx/next 47/68] net/ipv4/tcp.c:2373 tcp_xa_pool_refill() error: uninitialized symbol 'err'
 2024-05-23 11:55 UTC 

[PATCH] hostfs: convert hostfs to use the new mount api
 2024-05-23 10:43 UTC  (3+ messages)

[android-common:mirror-chromeos-5.10-arcvm 10794/30000] sound/virtio/virtio_pcm_msg.c:149:27-28: WARNING: Use struct_size
 2024-05-23 10:18 UTC 

[PATCH v4 3/3] perf annotate: LLVM-based disassembler
 2024-05-23  5:10 UTC 

[linux-next:master 13439/13737] drivers/gpu/drm/xe/xe_drm_client.c:272 show_runtime() error: uninitialized symbol 'hwe'
 2024-05-23  4:27 UTC 

WARNING: modpost: vmlinux: section mismatch in reference: grpci2_of_driver (section: .data) -> grpci2_of_match (section: .init.rodata)
 2024-05-23  1:53 UTC  (2+ messages)

[PATCH] drm/bridge: adv7511: Fix Intermittent EDID failures
 2024-05-22 14:55 UTC 

[crng-random:vdso-droppable 9/10] vdso_test_getrandom.c:146:40: warning: omitting the parameter name in a function definition is a C23 extension
 2024-05-22 14:13 UTC 

[alobakin:idpf-libie-new 55/63] include/net/libeth/xdp.h:786 libeth_xdp_prepare_buff() warn: potential memory corrupting cast 8 vs 4 bytes
 2024-05-22 10:30 UTC 

[alobakin:idpf-libie-new 12/63] drivers/net/ethernet/intel/idpf/idpf_txrx.c:1385 idpf_txq_group_alloc() error: uninitialized symbol 'stashes'
 2024-05-22  9:25 UTC 

[openeuler:openEuler-1.0-LTS 20772/22454] drivers/block/loop.c:1338 loop_set_status() warn: inconsistent returns '&loop_ctl_mutex'
 2024-05-22  4:32 UTC 

drivers/iommu/amd/iommu.c:2011 init_gcr3_table() warn: missing error code? 'ret'
 2024-05-22  3:40 UTC 

[cip:linux-4.4.y-st-rt 2126/22961] kernel/sched/swork.c:63 swork_kthread() warn: test_and_clear_bit() takes a bit number
 2024-05-21 18:03 UTC 

[PATCH RFC] fhandle: expose u64 mount id to name_to_handle_at(2)
 2024-05-21 12:16 UTC 

[crng-random:vdso-droppable 5/10] mm/mempolicy.c:2302 vma_alloc_folio() warn: bitwise AND condition is false here
 2024-05-21  5:10 UTC 

[linux-next:master 13286/13491] drivers/gpu/drm/amd/amdgpu/amdgpu_vm.c:1249 amdgpu_vm_bo_update() error: we previously assumed 'bo' could be null (see line 1189)
 2024-05-20 20:01 UTC 

[PATCH 09/10] ext4: temporarily elevate commit thread priority
 2024-05-20 16:31 UTC 

[PATCH 03/10] ext4: mark inode dirty before grabbing i_data_sem in ext4_setattr
 2024-05-20 14:01 UTC 

[broonie-ci:kselftest-mitigate-gnu-source 2/2] ../kselftest_harness.h:54:2: error: #warning kselftest harness requires _GNU_SOURCE to be defined
 2024-05-20  1:59 UTC  (2+ messages)

[PATCH v2 3/3] perf annotate: LLVM-based disassembler
 2024-05-20  1:36 UTC 

cgroup_util.c:410:65: error: 'O_PATH' undeclared
 2024-05-20  1:25 UTC  (2+ messages)

[PATCH mptcp-next v3 1/2] Squash to "selftests/bpf: Add mptcp subflow subtest"
 2024-05-20  1:03 UTC  (2+ messages)

[PATCH v2 3/3] leds: leds-lp5569: Add support for Texas Instruments LP5569
 2024-05-19 20:04 UTC 

[jarkko-tpmdd:tpm2_key-2 6/7] drivers/char/tpm/tpm2_key.c:50 tpm2_key_type() warn: statement has no effect 3
 2024-05-19 17:36 UTC 

internal error: arch/alpha/kernel/core_marvel.c:815 SQL error #2: near "and": syntax error
 2024-05-19 17:36 UTC 

[cip:linux-4.4.y-st-rt 2126/22961] kernel/sched/swork.c:63 swork_kthread() warn: test_and_clear_bit() takes a bit number
 2024-05-19  6:13 UTC 

[PATCH v2 RFC] wifi: cfg80211: Refactor interface combination input parameter
 2024-05-18 20:47 UTC 

[linyunsheng:page_frag_cache_v5 14/14] mm/page_frag_cache.c:291 __page_frag_alloc_va_align() error: uninitialized symbol 'remaining'
 2024-05-18 18:41 UTC 

[PATCH v2 6/6] selftests: livepatch: Test livepatching function using an external symbol
 2024-05-18 18:29 UTC 

[PATCH net-next] icmp: Add icmp_timestamp_ignore_all to control ICMP_TIMESTAMP
 2024-05-18 13:17 UTC 

drivers/clk/mediatek/clk-mtk.c:622 __mtk_clk_simple_probe() warn: 'base' from of_iomap() not released on lines: 506
 2024-05-18 11:10 UTC 

[linux-next:master 10171/13355] drivers/dma/mcf-edma-main.c:116 mcf_edma_irq_init() warn: 'res->start' from request_irq() not released on lines: 88,93,98,105,113
 2024-05-18  9:48 UTC 

[PATCH 05/17] drm/i915/psr: modify psr status debugfs to support eDP Panel Replay
 2024-05-18  9:37 UTC 

cgroup_util.c:410:58: error: use of undeclared identifier 'O_PATH'
 2024-05-18  8:42 UTC 

[PATCH v6 10/10] media: i2c: Add driver for mlx7502x ToF sensor
 2024-05-18  7:49 UTC 

[intel-tdx:tdx_kvm_dev-2024-05-14-mmu-prep-1 22/115] x86_64/apic_bus_clock_test.c:23:9: warning: '_GNU_SOURCE' macro redefined
 2024-05-18  7:29 UTC 

/opt/cross/clang-fa9b1be450/lib/clang/19/include/arm_neon.h:28:2: sparse: sparse: "NEON intrinsics not available with the soft-float ABI. Please use -mfloat-abi=softfp or -mfloat-abi=hard"
 2024-05-18  4:23 UTC 

[linux-next:master 12443/13355] drivers/gpu/drm/i915/display/intel_dpt.c:173 intel_dpt_pin_to_ggtt() error: uninitialized symbol 'vma'
 2024-05-18  2:39 UTC 

[crng-random:vdso-droppable 5/10] mm/memory.c:5606 handle_mm_fault() warn: bitwise AND condition is false here
 2024-05-18  0:43 UTC 

drivers/usb/musb/musb_dsps.c:850:9-34: WARNING: Threaded IRQ with no primary handler requested without IRQF_ONESHOT (unless it is nested IRQ)
 2024-05-17 21:01 UTC 

drivers/gpu/drm/tegra/dp.c:738:22-33: opportunity for str_plural(link -> lanes)
 2024-05-17 18:26 UTC 

[rafael-pm:bleeding-edge 11/15] drivers/opp/core.c:2447 _opp_attach_genpd() warn: missing unwind goto?
 2024-05-17 16:52 UTC 

[openeuler:openEuler-1.0-LTS 20772/22444] drivers/block/loop.c:1338 loop_set_status() warn: inconsistent returns '&loop_ctl_mutex'
 2024-05-17 15:49 UTC 

[PATCH] hostfs: convert hostfs to use the new mount api
 2024-05-17  3:54 UTC 

[PATCH] iio:proximity:hx9031as: Add TYHX HX9031AS/HX9023S sensor driver
 2024-05-17  0:13 UTC 

drivers/thermal/mediatek/auxadc_thermal.c:1297 mtk_thermal_probe() warn: 'apmixed_base' from of_iomap() not released on lines: 1248,1253,1291
 2024-05-16 22:53 UTC 

drivers/bluetooth/btintel_pcie.c:386 btintel_pcie_recv_frame() warn: variable dereferenced before check 'data' (see line 380)
 2024-05-16 20:57 UTC 

[cip:linux-4.4.y-st-rt 2126/22961] kernel/sched/swork.c:63 swork_kthread() warn: test_and_clear_bit() takes a bit number
 2024-05-16 11:19 UTC 

[cip:linux-4.4.y-st-rt 2126/22961] kernel/sched/swork.c:63 swork_kthread() warn: test_and_clear_bit() takes a bit number
 2024-05-16  1:49 UTC 

reuseport_bpf_cpu.c:15: warning: "_GNU_SOURCE" redefined
 2024-05-16  1:27 UTC  (2+ messages)

[openeuler:openEuler-1.0-LTS 21328/22436] drivers/scsi/sssraid/sssraid_os.c:1716:33: sparse: sparse: break/continue not in iterator scope
 2024-05-15 20:01 UTC 

[PATCH 2/2] ASoC: codec: lpass-rx-macro: add suppor for 2.6 codec version
 2024-05-15 14:30 UTC 

[PATCH 1/2] ASoC: codecs: lpass-macro: add helpers to get codec version
 2024-05-15 14:28 UTC 

[openeuler:openEuler-1.0-LTS 20772/22436] drivers/block/loop.c:1338 loop_set_status() warn: inconsistent returns '&loop_ctl_mutex'
 2024-05-15 13:37 UTC 

[goldwynr:iomap.2 3/32] fs/iomap/buffered-io.c:426 iomap_read_encoded() error: we previously assumed 'ctx->ops' could be null (see line 395)
 2024-05-15  9:12 UTC 

[arnd-asm-generic:syscall-tbl-6.9 43/46] kernel/fork.c:3087:2: sparse: sparse: clone3() entry point is missing, please fix
 2024-05-15  5:34 UTC 

[ti:ti-linux-6.1.y-wip 2/5] drivers/phy/cadence/phy-cadence-torrent.c:2534 cdns_torrent_phy_configure_multilink() error: uninitialized symbol 'phy_t1'
 2024-05-15  4:11 UTC 

[goldwynr:iomap.2 3/32] fs/iomap/buffered-io.c:426 iomap_read_encoded() error: we previously assumed 'ctx->ops' could be null (see line 395)
 2024-05-14 21:17 UTC 

[sean-jc:x86/gnu_source 41/42] tools/testing/selftests/kvm/rseq_test.c:223:undefined reference to `rseq_register_current_thread'
 2024-05-14  8:25 UTC 

[PATCH bpf-next 4/4] selftests/bpf: Add post_connect_cb callback
 2024-05-14  5:04 UTC 

[linux-next:master 11868/12793] ./../kselftest_harness.h:54:15: error: static assertion failed: kselftest harness requires _GNU_SOURCE to be defined
 2024-05-14  1:42 UTC  (2+ messages)

[linux-next:master 12296/12321] scm_rights.c:3:9: warning: '_GNU_SOURCE' macro redefined
 2024-05-14  1:42 UTC  (2+ messages)

[chrome-os:chromeos-5.15 20/21] dtbs_check: make[3]: *** [scripts/Makefile.lib:374: arch/arm64/boot/dts/mediatek/mt8186-corsola-squirtle-sku0.dt.yaml] Error 1
 2024-05-14  1:35 UTC 

[arnd-asm-generic:syscall-tbl-6.9 45/46] arch/arm64/kernel/sys.c: asm/syscall_table_64.h is included more than once
 2024-05-14  1:18 UTC  (2+ messages)

[arnd-asm-generic:syscall-tbl-6.9 41/46] arch/x86/entry/syscall_64.c: asm/syscall_table_64.h is included more than once
 2024-05-14  1:16 UTC  (2+ messages)

[arnd-asm-generic:syscall-tbl-6.9 30/46] arch/riscv/kernel/syscall_table.c: asm/syscall_table.h is included more than once
 2024-05-14  1:10 UTC  (2+ messages)

[linux-next:master 5083/12793] drivers/hwtracing/coresight/coresight-stm.c:921 __stm_probe() warn: 'drvdata->atclk' from clk_prepare_enable() not released on lines: 843,848,854,859,872,883,921
 2024-05-13 21:55 UTC 

[cip:b-4.4-st52-rt49 231/395] kernel/rcu/tree.c: linux/delay.h is included more than once
 2024-05-13 11:48 UTC 

[chrome-os:chromeos-5.15 14/14] dtbs_check: make[3]: *** [scripts/Makefile.lib:374: arch/arm64/boot/dts/mediatek/mt8186-corsola-skitty-sku1.dt.yaml] Error 1
 2024-05-13  8:29 UTC 

[chrome-os:chromeos-5.15 10/13] dtbs_check: make[3]: *** [scripts/Makefile.lib:374: arch/arm64/boot/dts/mediatek/mt8186-corsola-wugtrio-sku1.dt.yaml] Error 1
 2024-05-13  6:51 UTC 

[PATCH v4 10/14] MIPS: CPS: Introduce struct cluster_boot_config
 2024-05-13  5:15 UTC 

[PATCH v2 6/8] irqchip/stm32mp-exti: allow build as module
 2024-05-13  3:42 UTC 

[linux-next:master 12023/12533] test_cachestat.c:2:9: warning: '_GNU_SOURCE' macro redefined
 2024-05-13  1:41 UTC  (2+ messages)

WARNING: modpost: vmlinux: section mismatch in reference: trace_define_generic_fields (section: .text.unlikely) -> initcall_level_names (section: .init.data)
 2024-05-13  1:24 UTC  (2+ messages)

[linux-next:master 12023/12533] ./../kselftest_harness.h:54:15: error: expected parameter declarator
 2024-05-12 19:28 UTC 

[djwong-xfs:timestats-hoist 451/463] fs/xfs/scrub/common.c:1904 xchk_inode_setup_verity() error: uninitialized symbol 'bs'
 2024-05-12 13:36 UTC 

[PATCH v8 3/3] pinctrl: nuvoton: Add ma35d1 pinctrl and GPIO driver
 2024-05-12  3:26 UTC 

[PATCH 2/2] ASoC: codec: lpass-rx-macro: add suppor for 2.6 codec version
 2024-05-12  1:49 UTC 

[PATCH 1/2] ASoC: codecs: lpass-macro: add helpers to get codec version
 2024-05-11 23:57 UTC 

drivers/of/unittest.c:1195 of_unittest_reg() error: uninitialized symbol 'addr'
 2024-05-11 22:04 UTC 

[PATCH v3] Bluetooth: MGMT: Make MGMT_OP_LOAD_CONN_PARAM update existing connection
 2024-05-11 17:11 UTC 

[chrome-os:chromeos-5.15 6/9] dtbs_check: make[3]: *** [scripts/Makefile.lib:374: arch/arm64/boot/dts/mediatek/mt8186-corsola-veluza-sku65536.dt.yaml] Error 1
 2024-05-11  3:02 UTC 

[linux-next:master 11286/12533] mm/gup.c:639 follow_hugepd() warn: passing zero to 'ERR_PTR'
 2024-05-10 13:54 UTC 

[conor:qwip 5/15] drivers/spi/spi-microchip-core-qspi.c:593:2-8: preceding lock on line 586
 2024-05-10 10:44 UTC 

[PATCH v14 02/28] dept: Implement Dept(Dependency Tracker)
 2024-05-10  5:57 UTC  (2+ messages)

[linux-next:master 8029/12321] drivers/gpu/drm/amd/amdgpu/amdgpu_mes.c:44:16-17: WARNING opportunity for max()
 2024-05-10  3:17 UTC 

[PATCH V2 9/9] tools/perf: Add support for global_die to capture name of variable in case of register defined variable
 2024-05-10  1:29 UTC  (2+ messages)

sound/pci/emu10k1/io.c:349 snd_emu1010_fpga_link_dst_src_read() error: uninitialized symbol 'hi'
 2024-05-10  0:01 UTC 

[linux-next:master 7740/12321] fs/xfs/libxfs/xfs_dir2.c:415:1-5: alloc with no test, possible model on line 431
 2024-05-09 22:38 UTC 

[chrome-os:chromeos-6.6 265/293] drivers/hid/i2c-hid/i2c-hid-core.c:178:12-13: WARNING opportunity for min()
 2024-05-09 20:22 UTC 

[linux-next:master 10918/12321] ../kselftest_harness.h:851:26: error: '_ip_local_port_range_late_bind_object' undeclared here (not in a function); did you mean 'ip_local_port_range_late_bind'?
 2024-05-09 19:18 UTC 

[openeuler:openEuler-1.0-LTS 20772/22351] drivers/block/loop.c:1338 loop_set_status() warn: inconsistent returns '&loop_ctl_mutex'
 2024-05-09 16:31 UTC 

[linux-next:master 11142/12321] drivers/net/virtio_net.c:4325:1-7: preceding lock on line 4279
 2024-05-09 12:54 UTC 

[PATCH v3 1/2] media: v4l2-subdev: Provide const-aware subdev state accessors
 2024-05-08 21:07 UTC 

[PATCH v2 2/3] Bluetooth: btintel_pcie: Add support for PCIe transport
 2024-05-08 18:41 UTC 

[openeuler:openEuler-1.0-LTS 10307/22320] drivers/pinctrl/.tmp_pinctrl-ingenic.o: warning: objtool: ingenic_pinconf_set()+0x9c: sibling call from callable instruction with modified stack frame
 2024-05-08 17:28 UTC 

[linux-next:master 10354/12060] drivers/dma/fsl-edma-main.c:567 fsl_edma_probe() warn: statement has no effect 31
 2024-05-08 16:11 UTC 

[openeuler:openEuler-1.0-LTS 20772/22286] drivers/block/loop.c:1338 loop_set_status() warn: inconsistent returns '&loop_ctl_mutex'
 2024-05-08  9:24 UTC 

[openeuler:openEuler-1.0-LTS 20772/22286] drivers/block/loop.c:1338 loop_set_status() warn: inconsistent returns '&loop_ctl_mutex'
 2024-05-07 17:07 UTC 

[linux-next:master 8490/11707] drivers/net/dsa/realtek/rtl8366rb.c:1032:4-15: ERROR: probable double put
 2024-05-07 16:44 UTC 

[hch-xfs:xfs-zoned 44/55] fs/xfs/xfs_zone_gc.c:200:33-34: WARNING opportunity for min()
 2024-05-07 11:19 UTC 

[axboe-block:rw_iter 370/436] drivers/ntb/test/ntb_tool.c:931 tool_peer_mw_trans_write() warn: potential spectre issue 'buf' [w]
 2024-05-06 19:41 UTC 

[axboe-block:rw_iter 316/436] drivers/net/netdevsim/health.c:157 nsim_dev_health_break_write() warn: potential spectre issue 'break_msg' [w]
 2024-05-06 16:29 UTC 

[axboe-block:rw_iter 105/436] drivers/accel/habanalabs/common/debugfs.c:495 mmu_asid_va_write() warn: potential spectre issue 'kbuf' [w]
 2024-05-06 13:45 UTC 

[PATCH v3 1/2] perf pmus: Sort/merge/aggregate PMUs like mrvl_ddr_pmu
 2024-05-06  9:07 UTC  (2+ messages)

[nbdd0121:thin-lto 4/4] rust/helpers/helpers_combined.c: helpers.h is included more than once
 2024-05-06  7:42 UTC  (2+ messages)

[agraf-2.6:kvm-kho-gmem-test 19/27] lib/kvm_util.c:202:46: warning: unused variable 'region'
 2024-05-06  7:22 UTC  (2+ messages)

[linux-next:pending-fixes 54/103] net/bluetooth/l2cap_core.c:4017:2-8: preceding lock on line 3926
 2024-05-06  6:30 UTC 

[PATCH 09/10] writeback: factor out wb_dirty_exceeded to remove repeated code
 2024-05-06  2:15 UTC  (2+ messages)

lib/fortify_kunit.c:161:8-9: ERROR: reference preceded by free on line 158
 2024-05-05 23:47 UTC 

[PATCH 1/2] selftests/openat2: fix clang build failures: -static-libasan, LOCAL_HDRS
 2024-05-05 14:44 UTC 

drivers/gpu/drm/xe/xe_guc_ads.c:103:21-27: WARNING use flexible-array member instead (https://www.kernel.org/doc/html/latest/process/deprecated.html#zero-length-and-one-element-arrays)
 2024-05-05 11:06 UTC 

[PATCH 1/8] selftests: x86: Remove dependence of headers file
 2024-05-04 13:50 UTC 

[PATCH bpf-next 1/2] Patch to Fix deadlocks in queue and stack maps
 2024-05-04 12:22 UTC 

[PATCH v2 3/3] net: phy: bcm-phy-lib: Implement BroadR-Reach link modes
 2024-05-04 12:18 UTC 

[PATCH bpf-next 1/2] Patch to Fix deadlocks in queue and stack maps
 2024-05-04  3:46 UTC 

[PATCH v2 3/3] net: phy: bcm-phy-lib: Implement BroadR-Reach link modes
 2024-05-04  2:33 UTC 

[shenki:aspeed-6.9-rebase 333/1143] drivers/soc/aspeed/aspeed-host-bmc-dev.c: linux/module.h is included more than once
 2024-05-03 20:49 UTC 

[shenki:aspeed-6.9-rebase 932/1143] dtbs_check: Documentation/devicetree/bindings/i3c/i3c.yaml: ignoring, error parsing file
 2024-05-03 11:01 UTC 

[linux-next:master 9793/10134] drivers/of/of_reserved_mem.c:463 fdt_init_reserved_mem() error: uninitialized symbol 'nomap'
 2024-05-02 20:45 UTC  (2+ messages)

drivers/s390/cio/qdio_main.c:735 qdio_establish_handle_irq() warn: missing unwind goto?
 2024-05-02 19:03 UTC 

[openeuler:openEuler-1.0-LTS 20772/22262] drivers/block/loop.c:1338 loop_set_status() warn: inconsistent returns '&loop_ctl_mutex'
 2024-05-02  9:43 UTC 

[coresight:next 26/26] drivers/hwtracing/coresight/coresight-tmc-core.c: linux/acpi.h is included more than once
 2024-05-02  7:30 UTC 

[chrome-os:chromeos-5.15 9/14] dtbs_check: make[3]: *** [scripts/Makefile.lib:374: arch/arm64/boot/dts/mediatek/mt8186-corsola-veluza-sku131072.dt.yaml] Error 1
 2024-05-02  5:25 UTC 

[nbdd0121:thin-lto 3/4] rust/helpers/helpers_combined.c: linux/export.h is included more than once
 2024-05-02  4:23 UTC 

[linux-next:master 9409/10134] lib/fortify_kunit.c:443 fortify_test_strcpy() error: strcpy() 'src' too large for 'pad.buf' (33 vs 32)
 2024-05-01 20:38 UTC 

[linux-next:master 9793/10134] drivers/of/of_reserved_mem.c:463 fdt_init_reserved_mem() error: uninitialized symbol 'nomap'
 2024-05-01 17:29 UTC 

[djwong-xfs:timestats-hoist 169/464] fs/xfs/scrub/orphanage.c:495:9-16: Missing call to dput() at line 501
 2024-05-01 14:37 UTC 

[openeuler:openEuler-1.0-LTS 20772/22262] drivers/block/loop.c:1338 loop_set_status() warn: inconsistent returns '&loop_ctl_mutex'
 2024-04-30 21:23 UTC 

[PATCH v3 4/6] perf test pmu: Add an eagerly loaded event test
 2024-04-30 19:15 UTC 

[linux-next:master 9035/9709] net/ipv6/route.c:5712 rt6_fill_node() error: we previously assumed 'dst' could be null (see line 5697)
 2024-04-30 18:11 UTC 

[linux-next:master 1128/2532] drivers/pwm/core.c:1530 pwm_put() warn: variable dereferenced before check 'pwm' (see line 1528)
 2024-04-30 16:59 UTC  (4+ messages)

[PATCH v3 3/6] perf test pmu: Refactor format test and exposed test APIs
 2024-04-30 15:57 UTC 

[linux-next:master 9166/9709] drivers/virt/acrn/mm.c:217 acrn_vm_ram_map() error: uninitialized symbol 'start_pfn'
 2024-04-30 15:36 UTC 

[openeuler:openEuler-1.0-LTS 20772/22256] drivers/block/loop.c:1338 loop_set_status() warn: inconsistent returns '&loop_ctl_mutex'
 2024-04-30  7:33 UTC 

[PATCH net-next 6/8] net:openvswitch: add psample support
 2024-04-30  7:29 UTC 

[openeuler:openEuler-1.0-LTS 21254/22260] drivers/gpu/drm/phytium/phytium_plane.c:218:7-9: WARNING: possible condition with no effect (if == else)
 2024-04-30  2:55 UTC 

[openeuler:openEuler-1.0-LTS 20772/22256] drivers/block/loop.c:1338 loop_set_status() warn: inconsistent returns '&loop_ctl_mutex'
 2024-04-29 23:50 UTC 

[PATCH net-next 6/8] net:openvswitch: add psample support
 2024-04-29 22:46 UTC 

[PATCH 09/10] writeback: factor out wb_dirty_exceeded to remove repeated code
 2024-04-29 18:25 UTC 

[openeuler:OLK-6.6 7604/7622] drivers/net/ethernet/huawei/hinic3/hw/hinic3_multi_host_mgmt.c: hinic3_hwif.h is included more than once
 2024-04-29  4:37 UTC 

[openeuler:OLK-6.6 7535/7622] mm/readahead.c:706 page_cache_sync_ra() warn: bitwise AND condition is false here
 2024-04-28 19:35 UTC 

[linyunsheng:page_frag_cache_v3 14/14] net/mptcp/protocol.c:1854 mptcp_sendmsg() error: uninitialized symbol 'offset'
 2024-04-27 22:04 UTC 

[drm-misc:for-linux-next 1/1] drivers/gpu/drm/nouveau/nvkm/subdev/gsp/r535.c:1267:17: sparse: sparse: statement expected after case label
 2024-04-27 12:23 UTC 

[PATCH v3 4/4] selftests/mm: Add new testcases for pkeys
 2024-04-27  4:07 UTC 

[freescale-fslc:5.15-2.2.x-imx 212/29910] sound/soc/fsl/fsl_sai.c: linux/pm_qos.h is included more than once
 2024-04-26 17:00 UTC 

clang: warning: -lLLVMFrontendOffloading: 'linker' input unused
 2024-04-26 14:14 UTC 

[PATCH net-next v1 4/4] net: stmmac: use delays reported by the PHY driver to correct MAC propagation delay
 2024-04-25 22:07 UTC 

fs/smb/client/smb2pdu.c:3639 __SMB2_close() error: __builtin_memcpy() '&rsp->network_open_info' too small (52 vs 56)
 2024-04-25 21:14 UTC 

[PATCH v1 net-next 5/6] arp: Get dev after calling arp_req_(delete|set|get)()
 2024-04-25 16:26 UTC  (2+ messages)

[PATCH 3/3] HID: bpf: lazy load the hid_tail_call entrypoint
 2024-04-25 12:52 UTC  (3+ messages)

[linux-next:master 7867/8170] drivers/gpu/drm/amd/amdgpu/../display/dmub/src/dmub_dcn401.c:501:9: sparse: sparse: static assertion failed: "DMUB command size mismatch"
 2024-04-25 11:55 UTC 

[konis-nilfs2:for-akpm 4/4] fs/nilfs2/super.c: linux/fs_context.h is included more than once
 2024-04-25  6:41 UTC 

[PATCH v2 3/6] perf test pmu: Refactor format test and exposed test APIs
 2024-04-25  6:36 UTC  (2+ messages)

[PATCH v2 2/6] iio: light: stk3310: Implement vdd supply and power it off during suspend
 2024-04-25  5:31 UTC 

[PATCH v1 net-next 5/6] arp: Get dev after calling arp_req_(delete|set|get)()
 2024-04-25  4:26 UTC 

[agd5f:amd-staging-drm-next 2021/2033] drivers/gpu/drm/amd/display/dc/inc/hw/transform.h: spl/dc_spl_types.h is included more than once
 2024-04-25  4:03 UTC 

[PATCH v2 2/6] iio: light: stk3310: Implement vdd supply and power it off during suspend
 2024-04-25  2:30 UTC 

fs/smb/server/smb2pdu.c:1992 smb2_tree_connect() error: uninitialized symbol 'share'
 2024-04-24  7:21 UTC  (2+ messages)

fs/smb/server/smb2pdu.c:1992 smb2_tree_connect() error: uninitialized symbol 'share'
 2024-04-24  6:05 UTC 

[agd5f:amd-staging-drm-next 2014/2033] drivers/gpu/drm/amd/display/dc/clk_mgr/dcn401/dcn401_clk_mgr.c: dcn401/dcn401_clk_mgr.h is included more than once
 2024-04-24  6:05 UTC 

[PATCH v2 4/6] perf test pmu: Add an eagerly loaded event test
 2024-04-24  2:44 UTC 

[PATCH v2 3/6] perf test pmu: Refactor format test and exposed test APIs
 2024-04-23 23:42 UTC 

[linux-next:master 6954/7322] drivers/spmi/spmi-pmic-arb.c:1782 spmi_pmic_arb_register_buses() error: uninitialized symbol 'ret'
 2024-04-23 18:56 UTC  (2+ messages)

[linux-next:master 6621/6937] mseal_test.c:84:45: warning: format '%s' expects argument of type 'char *', but argument 5 has type 'char (*)[5]'
 2024-04-23  8:33 UTC  (2+ messages)


This is a public inbox, see mirroring instructions
for how to clone and mirror all data and code used for this inbox;
as well as URLs for NNTP newsgroup(s).