Stable Archive on lore.kernel.org
 help / color / Atom feed
* ❌ FAIL: Stable queue: queue-5.3
@ 2019-10-10 10:26 CKI Project
  2019-10-10 10:51 ` Veronika Kabatova
  0 siblings, 1 reply; 22+ messages in thread
From: CKI Project @ 2019-10-10 10:26 UTC (permalink / raw)
  To: Linux Stable maillist; +Cc: Memory Management, Jan Stancek, Zhaojuan Guo


Hello,

We ran automated tests on a patchset that was proposed for merging into this
kernel tree. The patches were applied to:

       Kernel repo: https://git.kernel.org/pub/scm/linux/kernel/git/stable/linux.git
            Commit: 52020d3f6633 - Linux 5.3.5

The results of these automated tests are provided below.

    Overall result: FAILED (see details below)
             Merge: OK
           Compile: OK
             Tests: FAILED

All kernel binaries, config files, and logs are available for download here:

  https://artifacts.cki-project.org/pipelines/215692

One or more kernel tests failed:

    x86_64:
      ❌ Boot test
      ❌ Boot test
      ❌ Boot test
      ❌ Boot test

We hope that these logs can help you find the problem quickly. For the full
detail on our testing procedures, please scroll to the bottom of this message.

Please reply to this email if you have any questions about the tests that we
ran or if you have any suggestions on how to make future tests more effective.

        ,-.   ,-.
       ( C ) ( K )  Continuous
        `-',-.`-'   Kernel
          ( I )     Integration
           `-'
______________________________________________________________________________

Merge testing
-------------

We cloned this repository and checked out the following commit:

  Repo: https://git.kernel.org/pub/scm/linux/kernel/git/stable/linux.git
  Commit: 52020d3f6633 - Linux 5.3.5


We grabbed the e67a4dc5be0c commit of the stable queue repository.

We then merged the patchset with `git am`:

  s390-process-avoid-potential-reading-of-freed-stack.patch
  s390-sclp-fix-bit-checked-for-has_sipl.patch
  kvm-s390-test-for-bad-access-register-and-size-at-the-start-of-s390_mem_op.patch
  s390-topology-avoid-firing-events-before-kobjs-are-created.patch
  s390-cio-avoid-calling-strlen-on-null-pointer.patch
  s390-cio-exclude-subchannels-with-no-parent-from-pseudo-check.patch
  s390-dasd-fix-error-handling-during-online-processing.patch
  revert-s390-dasd-add-discard-support-for-ese-volumes.patch
  kvm-s390-fix-__insn32_query-inline-assembly.patch
  kvm-ppc-book3s-enable-xive-native-capability-only-if-opal-has-required-functions.patch
  kvm-ppc-book3s-hv-xive-free-escalation-interrupts-before-disabling-the-vp.patch
  kvm-ppc-book3s-hv-don-t-push-xive-context-when-not-using-xive-device.patch
  kvm-ppc-book3s-hv-fix-race-in-re-enabling-xive-escalation-interrupts.patch
  kvm-ppc-book3s-hv-check-for-mmu-ready-on-piggybacked-virtual-cores.patch
  kvm-ppc-book3s-hv-don-t-lose-pending-doorbell-request-on-migration-on-p9.patch
  kvm-x86-fix-userspace-set-invalid-cr4.patch
  nbd-fix-max-number-of-supported-devs.patch
  pm-devfreq-tegra-fix-khz-to-hz-conversion.patch
  asoc-define-a-set-of-dapm-pre-post-up-events.patch
  asoc-sgtl5000-improve-vag-power-and-mute-control.patch
  powerpc-xive-implement-get_irqchip_state-method-for-xive-to-fix-shutdown-race.patch
  powerpc-mce-fix-mce-handling-for-huge-pages.patch
  powerpc-mce-schedule-work-from-irq_work.patch
  powerpc-603-fix-handling-of-the-dirty-flag.patch
  powerpc-32s-fix-boot-failure-with-debug_pagealloc-without-kasan.patch
  powerpc-ptdump-fix-addresses-display-on-ppc32.patch
  powerpc-powernv-restrict-opal-symbol-map-to-only-be-readable-by-root.patch
  powerpc-pseries-fix-cpu_hotplug_lock-acquisition-in-resize_hpt.patch
  powerpc-powernv-ioda-fix-race-in-tce-level-allocation.patch
  powerpc-kasan-fix-parallel-loading-of-modules.patch
  powerpc-kasan-fix-shadow-area-set-up-for-modules.patch
  powerpc-book3s64-mm-don-t-do-tlbie-fixup-for-some-hardware-revisions.patch
  powerpc-book3s64-radix-rename-cpu_ftr_p9_tlbie_bug-feature-flag.patch
  powerpc-mm-add-a-helper-to-select-page_kernel_ro-or-page_readonly.patch
  powerpc-mm-fix-an-oops-in-kasan_mmu_init.patch
  powerpc-mm-fixup-tlbie-vs-mtpidr-mtlpidr-ordering-issue-on-power9.patch
  can-mcp251x-mcp251x_hw_reset-allow-more-time-after-a-reset.patch
  tools-lib-traceevent-fix-robust-test-of-do_generate_dynamic_list_file.patch
  tools-lib-traceevent-do-not-free-tep-cmdlines-in-add_new_comm-on-failure.patch
  crypto-qat-silence-smp_processor_id-warning.patch
  crypto-skcipher-unmap-pages-after-an-external-error.patch
  crypto-cavium-zip-add-missing-single_release.patch
  crypto-caam-qi-fix-error-handling-in-ern-handler.patch
  crypto-caam-fix-concurrency-issue-in-givencrypt-descriptor.patch
  crypto-ccree-account-for-tee-not-ready-to-report.patch
  crypto-ccree-use-the-full-crypt-length-value.patch
  mips-treat-loongson-extensions-as-ases.patch
  power-supply-sbs-battery-use-correct-flags-field.patch
  power-supply-sbs-battery-only-return-health-when-battery-present.patch
  tracing-make-sure-variable-reference-alias-has-correct-var_ref_idx.patch
  usercopy-avoid-highmem-pfn-warning.patch
  timer-read-jiffies-once-when-forwarding-base-clk.patch
  pci-vmd-fix-config-addressing-when-using-bus-offsets.patch
  pci-hv-avoid-use-of-hv_pci_dev-pci_slot-after-freeing-it.patch
  pci-vmd-fix-shadow-offsets-to-reflect-spec-changes.patch
  pci-restore-resizable-bar-size-bits-correctly-for-1mb-bars.patch
  selftests-tpm2-add-the-missing-test_files-assignment.patch
  selftests-pidfd-fix-undefined-reference-to-pthread_create.patch
  watchdog-imx2_wdt-fix-min-calculation-in-imx2_wdt_set_timeout.patch
  perf-tools-fix-segfault-in-cpu_cache_level__read.patch
  perf-stat-fix-a-segmentation-fault-when-using-repeat-forever.patch
  drm-i915-dp-fix-dsc-bpp-calculations-v5.patch
  drm-atomic-reject-flip_async-unconditionally.patch
  drm-atomic-take-the-atomic-toys-away-from-x.patch
  drm-mali-dp-mark-expected-switch-fall-through.patch
  drm-omap-fix-max-fclk-divider-for-omap36xx.patch
  drm-msm-dsi-fix-return-value-check-for-clk_get_parent.patch
  drm-nouveau-kms-nv50-don-t-create-mstms-for-edp-connectors.patch
  drm-amd-powerplay-change-metrics-update-period-from-1ms-to-100ms.patch
  drm-i915-gvt-update-vgpu-workload-head-pointer-correctly.patch
  drm-i915-userptr-acquire-the-page-lock-around-set_page_dirty.patch
  drm-i915-to-make-vgpu-ppgtt-notificaiton-as-atomic-operation.patch
  mac80211-keep-bhs-disabled-while-calling-drv_tx_wake_queue.patch
  mmc-tegra-implement-set_dma_mask.patch
  mmc-sdhci-improve-adma-error-reporting.patch
  mmc-sdhci-of-esdhc-set-dma-snooping-based-on-dma-coherence.patch
  mmc-sdhci-let-drivers-define-their-dma-mask.patch
  revert-locking-pvqspinlock-don-t-wait-if-vcpu-is-preempted.patch
  libnvdimm-altmap-track-namespace-boundaries-in-altmap.patch
  sched-add-__assembly__-guards-around-struct-clone_args.patch
  dts-arm-gta04-introduce-legacy-spi-cs-high-to-make-display-work-again.patch
  xen-balloon-set-pages-pageoffline-in-balloon_add_region.patch
  xen-xenbus-fix-self-deadlock-after-killing-user-process.patch
  ieee802154-atusb-fix-use-after-free-at-disconnect.patch
  nl80211-validate-beacon-head.patch
  cfg80211-validate-ssid-mbssid-element-ordering-assumption.patch
  cfg80211-initialize-on-stack-chandefs.patch
  drivers-thermal-qcom-tsens-fix-memory-leak-from-qfpr.patch
  ima-always-return-negative-code-for-error.patch
  ima-fix-freeing-ongoing-ahash_request.patch
  fs-nfs-fix-possible-null-pointer-dereferences-in-enc.patch
  xprtrdma-toggle-xprt_congested-in-xprtrdma-s-slot-me.patch
  xprtrdma-send-queue-size-grows-after-a-reconnect.patch
  9p-transport-error-uninitialized.patch
  9p-avoid-attaching-writeback_fid-on-mmap-with-type-p.patch
  xen-pci-reserve-mcfg-areas-earlier.patch
  fuse-fix-request-limit.patch
  ceph-fix-directories-inode-i_blkbits-initialization.patch
  ceph-fetch-cap_gen-under-spinlock-in-ceph_add_cap.patch
  ceph-reconnect-connection-if-session-hang-in-opening.patch
  sunrpc-rpc-level-errors-should-always-set-task-tk_rp.patch
  watchdog-aspeed-add-support-for-ast2600.patch
  netfilter-nf_tables-allow-lookups-in-dynamic-sets.patch
  drm-amdgpu-fix-kfd-related-kernel-oops-on-hawaii.patch
  drm-amdgpu-check-for-valid-number-of-registers-to-re.patch
  perf-probe-fix-to-clear-tev-nargs-in-clear_probe_tra.patch
  pnfs-ensure-we-do-clear-the-return-on-close-layout-s.patch
  sunrpc-don-t-try-to-parse-incomplete-rpc-messages.patch
  pwm-stm32-lp-add-check-in-case-requested-period-cann.patch
  selftests-seccomp-fix-build-on-older-kernels.patch
  x86-purgatory-disable-the-stackleak-gcc-plugin-for-t.patch
  ntb-point-to-right-memory-window-index.patch
  thermal-fix-use-after-free-when-unregistering-therma.patch
  thermal_hwmon-sanitize-thermal_zone-type.patch
  iommu-amd-fix-downgrading-default-page-sizes-in-allo.patch
  libnvdimm-region-initialize-bad-block-for-volatile-n.patch
  libnvdimm-fix-endian-conversion-issues.patch
  fuse-fix-memleak-in-cuse_channel_open.patch
  libnvdimm-nfit_test-fix-acpi_handle-redefinition.patch
  sched-membarrier-call-sync_core-only-before-usermode.patch
  sched-membarrier-fix-private-expedited-registration-.patch
  sched-core-fix-migration-to-invalid-cpu-in-__set_cpu.patch
  perf-build-add-detection-of-java-11-openjdk-devel-pa.patch
  include-trace-events-writeback.h-fix-wstringop-trunc.patch
  selftests-bpf-adjust-strobemeta-loop-to-satisfy-late.patch
  kernel-elfcore.c-include-proper-prototypes.patch
  libbpf-fix-false-uninitialized-variable-warning.patch
  blk-mq-move-lockdep_assert_held-into-elevator_exit.patch
  bpf-fix-bpf_event_output-re-entry-issue.patch
  net-dsa-microchip-always-set-regmap-stride-to-1.patch
  i2c-qcom-geni-disable-dma-processing-on-the-lenovo-y.patch
  perf-unwind-fix-libunwind-build-failure-on-i386-syst.patch
  mlxsw-spectrum_flower-fail-in-case-user-specifies-mu.patch
  nfp-abm-fix-memory-leak-in-nfp_abm_u32_knode_replace.patch
  drm-radeon-bail-earlier-when-radeon.cik_-si_support-.patch
  btrfs-fix-selftests-failure-due-to-uninitialized-i_m.patch
  kvm-nvmx-fix-consistency-check-on-injected-exception.patch
  tick-broadcast-hrtimer-fix-a-race-in-bc_set_next.patch
  perf-stat-reset-previous-counts-on-repeat-with-inter.patch
  riscv-avoid-interrupts-being-erroneously-enabled-in-.patch
  vfs-fix-eoverflow-testing-in-put_compat_statfs64.patch
  coresight-etm4x-use-explicit-barriers-on-enable-disable.patch
  staging-erofs-fix-an-error-handling-in-erofs_readdir.patch
  staging-erofs-some-compressed-cluster-should-be-submitted-for-corrupted-images.patch
  staging-erofs-add-two-missing-erofs_workgroup_put-for-corrupted-images.patch
  staging-erofs-avoid-endless-loop-of-invalid-lookback-distance-0.patch
  staging-erofs-detect-potential-multiref-due-to-corrupted-images.patch

Compile testing
---------------

We compiled the kernel for 3 architectures:

    aarch64:
      make options: -j30 INSTALL_MOD_STRIP=1 targz-pkg

    ppc64le:
      make options: -j30 INSTALL_MOD_STRIP=1 targz-pkg

    x86_64:
      make options: -j30 INSTALL_MOD_STRIP=1 targz-pkg


Hardware testing
----------------
We booted each kernel and ran the following tests:

  aarch64:

    ⚡ Internal infrastructure issues prevented one or more tests (marked
    with ⚡⚡⚡) from running on this architecture.
    This is not the fault of the kernel that was tested.

  ppc64le:
      Host 1:
         ✅ Boot test
         ✅ Podman system integration test (as root)
         ✅ Podman system integration test (as user)
         ✅ Loopdev Sanity
         ✅ jvm test suite
         ✅ AMTU (Abstract Machine Test Utility)
         ✅ Ethernet drivers sanity
         ✅ Networking socket: fuzz
         ✅ audit: audit testsuite test
         ✅ httpd: mod_ssl smoke sanity
         ✅ iotop: sanity
         ✅ tuned: tune-processes-through-perf
         ✅ Usex - version 1.9-29
         🚧 ✅ LTP lite
         🚧 ✅ POSIX pjd-fstest suites
         🚧 ✅ ALSA PCM loopback test
         🚧 ✅ ALSA Control (mixer) Userspace Element test
         🚧 ✅ trace: ftrace/tracer

      Host 2:
         ✅ Boot test
         ✅ xfstests: xfs
         ✅ selinux-policy: serge-testsuite
         ✅ lvm thinp sanity
         ✅ storage: software RAID testing
         🚧 ✅ Storage blktests

  x86_64:
      Host 1:
         ✅ Boot test
         ✅ xfstests: xfs
         ✅ selinux-policy: serge-testsuite
         ✅ lvm thinp sanity
         ✅ storage: software RAID testing
         🚧 ✅ IOMMU boot test
         🚧 ✅ Storage blktests

      Host 2:
         ✅ Boot test
         ✅ Podman system integration test (as root)
         ✅ Podman system integration test (as user)
         ✅ Loopdev Sanity
         ✅ jvm test suite
         ✅ AMTU (Abstract Machine Test Utility)
         ✅ Ethernet drivers sanity
         ✅ Networking socket: fuzz
         ✅ audit: audit testsuite test
         ✅ httpd: mod_ssl smoke sanity
         ✅ iotop: sanity
         ✅ tuned: tune-processes-through-perf
         ✅ pciutils: sanity smoke test
         ✅ Usex - version 1.9-29
         ✅ stress: stress-ng
         🚧 ❌ LTP lite
         🚧 ✅ POSIX pjd-fstest suites
         🚧 ✅ ALSA PCM loopback test
         🚧 ✅ ALSA Control (mixer) Userspace Element test
         🚧 ✅ trace: ftrace/tracer

      Host 3:
         ❌ Boot test
         🚧 ❌ /kernel/infiniband/env_setup
         🚧 ❌ /kernel/infiniband/sanity
      Host 4:
         ❌ Boot test
         🚧 ❌ /kernel/infiniband/env_setup
         🚧 ❌ /kernel/infiniband/sanity

      Host 5:
         ❌ Boot test
         🚧 ❌ /kernel/infiniband/env_setup
         🚧 ❌ /kernel/infiniband/sanity
      Host 6:
         ❌ Boot test
         🚧 ❌ /kernel/infiniband/env_setup
         🚧 ❌ /kernel/infiniband/sanity

  Test sources: https://github.com/CKI-project/tests-beaker
    💚 Pull requests are welcome for new tests or improvements to existing tests!

Waived tests
------------
If the test run included waived tests, they are marked with 🚧. Such tests are
executed but their results are not taken into account. Tests are waived when
their results are not reliable enough, e.g. when they're just introduced or are
being fixed.


^ permalink raw reply	[flat|nested] 22+ messages in thread

* Re: ❌ FAIL: Stable queue: queue-5.3
  2019-10-10 10:26 ❌ FAIL: Stable queue: queue-5.3 CKI Project
@ 2019-10-10 10:51 ` Veronika Kabatova
  0 siblings, 0 replies; 22+ messages in thread
From: Veronika Kabatova @ 2019-10-10 10:51 UTC (permalink / raw)
  To: CKI Project, Linux Stable maillist
  Cc: Memory Management, Jan Stancek, Zhaojuan Guo



----- Original Message -----
> From: "CKI Project" <cki-project@redhat.com>
> To: "Linux Stable maillist" <stable@vger.kernel.org>
> Cc: "Memory Management" <mm-qe@redhat.com>, "Jan Stancek" <jstancek@redhat.com>, "Zhaojuan Guo" <zguo@redhat.com>
> Sent: Thursday, October 10, 2019 12:26:15 PM
> Subject: ❌ FAIL: Stable queue: queue-5.3
> 
> 
> Hello,
> 
> We ran automated tests on a patchset that was proposed for merging into this
> kernel tree. The patches were applied to:
> 
>        Kernel repo:
>        https://git.kernel.org/pub/scm/linux/kernel/git/stable/linux.git
>             Commit: 52020d3f6633 - Linux 5.3.5
> 
> The results of these automated tests are provided below.
> 
>     Overall result: FAILED (see details below)
>              Merge: OK
>            Compile: OK
>              Tests: FAILED
> 
> All kernel binaries, config files, and logs are available for download here:
> 
>   https://artifacts.cki-project.org/pipelines/215692
> 
> One or more kernel tests failed:
> 
>     x86_64:
>       ❌ Boot test
>       ❌ Boot test
>       ❌ Boot test
>       ❌ Boot test
> 

This and the previous reports saying the same looks like a super weird bug
on our side. Looking into the cause.


Veronika

> We hope that these logs can help you find the problem quickly. For the full
> detail on our testing procedures, please scroll to the bottom of this
> message.
> 
> Please reply to this email if you have any questions about the tests that we
> ran or if you have any suggestions on how to make future tests more
> effective.
> 
>         ,-.   ,-.
>        ( C ) ( K )  Continuous
>         `-',-.`-'   Kernel
>           ( I )     Integration
>            `-'
> ______________________________________________________________________________
> 
> Merge testing
> -------------
> 
> We cloned this repository and checked out the following commit:
> 
>   Repo: https://git.kernel.org/pub/scm/linux/kernel/git/stable/linux.git
>   Commit: 52020d3f6633 - Linux 5.3.5
> 
> 
> We grabbed the e67a4dc5be0c commit of the stable queue repository.
> 
> We then merged the patchset with `git am`:
> 
>   s390-process-avoid-potential-reading-of-freed-stack.patch
>   s390-sclp-fix-bit-checked-for-has_sipl.patch
>   kvm-s390-test-for-bad-access-register-and-size-at-the-start-of-s390_mem_op.patch
>   s390-topology-avoid-firing-events-before-kobjs-are-created.patch
>   s390-cio-avoid-calling-strlen-on-null-pointer.patch
>   s390-cio-exclude-subchannels-with-no-parent-from-pseudo-check.patch
>   s390-dasd-fix-error-handling-during-online-processing.patch
>   revert-s390-dasd-add-discard-support-for-ese-volumes.patch
>   kvm-s390-fix-__insn32_query-inline-assembly.patch
>   kvm-ppc-book3s-enable-xive-native-capability-only-if-opal-has-required-functions.patch
>   kvm-ppc-book3s-hv-xive-free-escalation-interrupts-before-disabling-the-vp.patch
>   kvm-ppc-book3s-hv-don-t-push-xive-context-when-not-using-xive-device.patch
>   kvm-ppc-book3s-hv-fix-race-in-re-enabling-xive-escalation-interrupts.patch
>   kvm-ppc-book3s-hv-check-for-mmu-ready-on-piggybacked-virtual-cores.patch
>   kvm-ppc-book3s-hv-don-t-lose-pending-doorbell-request-on-migration-on-p9.patch
>   kvm-x86-fix-userspace-set-invalid-cr4.patch
>   nbd-fix-max-number-of-supported-devs.patch
>   pm-devfreq-tegra-fix-khz-to-hz-conversion.patch
>   asoc-define-a-set-of-dapm-pre-post-up-events.patch
>   asoc-sgtl5000-improve-vag-power-and-mute-control.patch
>   powerpc-xive-implement-get_irqchip_state-method-for-xive-to-fix-shutdown-race.patch
>   powerpc-mce-fix-mce-handling-for-huge-pages.patch
>   powerpc-mce-schedule-work-from-irq_work.patch
>   powerpc-603-fix-handling-of-the-dirty-flag.patch
>   powerpc-32s-fix-boot-failure-with-debug_pagealloc-without-kasan.patch
>   powerpc-ptdump-fix-addresses-display-on-ppc32.patch
>   powerpc-powernv-restrict-opal-symbol-map-to-only-be-readable-by-root.patch
>   powerpc-pseries-fix-cpu_hotplug_lock-acquisition-in-resize_hpt.patch
>   powerpc-powernv-ioda-fix-race-in-tce-level-allocation.patch
>   powerpc-kasan-fix-parallel-loading-of-modules.patch
>   powerpc-kasan-fix-shadow-area-set-up-for-modules.patch
>   powerpc-book3s64-mm-don-t-do-tlbie-fixup-for-some-hardware-revisions.patch
>   powerpc-book3s64-radix-rename-cpu_ftr_p9_tlbie_bug-feature-flag.patch
>   powerpc-mm-add-a-helper-to-select-page_kernel_ro-or-page_readonly.patch
>   powerpc-mm-fix-an-oops-in-kasan_mmu_init.patch
>   powerpc-mm-fixup-tlbie-vs-mtpidr-mtlpidr-ordering-issue-on-power9.patch
>   can-mcp251x-mcp251x_hw_reset-allow-more-time-after-a-reset.patch
>   tools-lib-traceevent-fix-robust-test-of-do_generate_dynamic_list_file.patch
>   tools-lib-traceevent-do-not-free-tep-cmdlines-in-add_new_comm-on-failure.patch
>   crypto-qat-silence-smp_processor_id-warning.patch
>   crypto-skcipher-unmap-pages-after-an-external-error.patch
>   crypto-cavium-zip-add-missing-single_release.patch
>   crypto-caam-qi-fix-error-handling-in-ern-handler.patch
>   crypto-caam-fix-concurrency-issue-in-givencrypt-descriptor.patch
>   crypto-ccree-account-for-tee-not-ready-to-report.patch
>   crypto-ccree-use-the-full-crypt-length-value.patch
>   mips-treat-loongson-extensions-as-ases.patch
>   power-supply-sbs-battery-use-correct-flags-field.patch
>   power-supply-sbs-battery-only-return-health-when-battery-present.patch
>   tracing-make-sure-variable-reference-alias-has-correct-var_ref_idx.patch
>   usercopy-avoid-highmem-pfn-warning.patch
>   timer-read-jiffies-once-when-forwarding-base-clk.patch
>   pci-vmd-fix-config-addressing-when-using-bus-offsets.patch
>   pci-hv-avoid-use-of-hv_pci_dev-pci_slot-after-freeing-it.patch
>   pci-vmd-fix-shadow-offsets-to-reflect-spec-changes.patch
>   pci-restore-resizable-bar-size-bits-correctly-for-1mb-bars.patch
>   selftests-tpm2-add-the-missing-test_files-assignment.patch
>   selftests-pidfd-fix-undefined-reference-to-pthread_create.patch
>   watchdog-imx2_wdt-fix-min-calculation-in-imx2_wdt_set_timeout.patch
>   perf-tools-fix-segfault-in-cpu_cache_level__read.patch
>   perf-stat-fix-a-segmentation-fault-when-using-repeat-forever.patch
>   drm-i915-dp-fix-dsc-bpp-calculations-v5.patch
>   drm-atomic-reject-flip_async-unconditionally.patch
>   drm-atomic-take-the-atomic-toys-away-from-x.patch
>   drm-mali-dp-mark-expected-switch-fall-through.patch
>   drm-omap-fix-max-fclk-divider-for-omap36xx.patch
>   drm-msm-dsi-fix-return-value-check-for-clk_get_parent.patch
>   drm-nouveau-kms-nv50-don-t-create-mstms-for-edp-connectors.patch
>   drm-amd-powerplay-change-metrics-update-period-from-1ms-to-100ms.patch
>   drm-i915-gvt-update-vgpu-workload-head-pointer-correctly.patch
>   drm-i915-userptr-acquire-the-page-lock-around-set_page_dirty.patch
>   drm-i915-to-make-vgpu-ppgtt-notificaiton-as-atomic-operation.patch
>   mac80211-keep-bhs-disabled-while-calling-drv_tx_wake_queue.patch
>   mmc-tegra-implement-set_dma_mask.patch
>   mmc-sdhci-improve-adma-error-reporting.patch
>   mmc-sdhci-of-esdhc-set-dma-snooping-based-on-dma-coherence.patch
>   mmc-sdhci-let-drivers-define-their-dma-mask.patch
>   revert-locking-pvqspinlock-don-t-wait-if-vcpu-is-preempted.patch
>   libnvdimm-altmap-track-namespace-boundaries-in-altmap.patch
>   sched-add-__assembly__-guards-around-struct-clone_args.patch
>   dts-arm-gta04-introduce-legacy-spi-cs-high-to-make-display-work-again.patch
>   xen-balloon-set-pages-pageoffline-in-balloon_add_region.patch
>   xen-xenbus-fix-self-deadlock-after-killing-user-process.patch
>   ieee802154-atusb-fix-use-after-free-at-disconnect.patch
>   nl80211-validate-beacon-head.patch
>   cfg80211-validate-ssid-mbssid-element-ordering-assumption.patch
>   cfg80211-initialize-on-stack-chandefs.patch
>   drivers-thermal-qcom-tsens-fix-memory-leak-from-qfpr.patch
>   ima-always-return-negative-code-for-error.patch
>   ima-fix-freeing-ongoing-ahash_request.patch
>   fs-nfs-fix-possible-null-pointer-dereferences-in-enc.patch
>   xprtrdma-toggle-xprt_congested-in-xprtrdma-s-slot-me.patch
>   xprtrdma-send-queue-size-grows-after-a-reconnect.patch
>   9p-transport-error-uninitialized.patch
>   9p-avoid-attaching-writeback_fid-on-mmap-with-type-p.patch
>   xen-pci-reserve-mcfg-areas-earlier.patch
>   fuse-fix-request-limit.patch
>   ceph-fix-directories-inode-i_blkbits-initialization.patch
>   ceph-fetch-cap_gen-under-spinlock-in-ceph_add_cap.patch
>   ceph-reconnect-connection-if-session-hang-in-opening.patch
>   sunrpc-rpc-level-errors-should-always-set-task-tk_rp.patch
>   watchdog-aspeed-add-support-for-ast2600.patch
>   netfilter-nf_tables-allow-lookups-in-dynamic-sets.patch
>   drm-amdgpu-fix-kfd-related-kernel-oops-on-hawaii.patch
>   drm-amdgpu-check-for-valid-number-of-registers-to-re.patch
>   perf-probe-fix-to-clear-tev-nargs-in-clear_probe_tra.patch
>   pnfs-ensure-we-do-clear-the-return-on-close-layout-s.patch
>   sunrpc-don-t-try-to-parse-incomplete-rpc-messages.patch
>   pwm-stm32-lp-add-check-in-case-requested-period-cann.patch
>   selftests-seccomp-fix-build-on-older-kernels.patch
>   x86-purgatory-disable-the-stackleak-gcc-plugin-for-t.patch
>   ntb-point-to-right-memory-window-index.patch
>   thermal-fix-use-after-free-when-unregistering-therma.patch
>   thermal_hwmon-sanitize-thermal_zone-type.patch
>   iommu-amd-fix-downgrading-default-page-sizes-in-allo.patch
>   libnvdimm-region-initialize-bad-block-for-volatile-n.patch
>   libnvdimm-fix-endian-conversion-issues.patch
>   fuse-fix-memleak-in-cuse_channel_open.patch
>   libnvdimm-nfit_test-fix-acpi_handle-redefinition.patch
>   sched-membarrier-call-sync_core-only-before-usermode.patch
>   sched-membarrier-fix-private-expedited-registration-.patch
>   sched-core-fix-migration-to-invalid-cpu-in-__set_cpu.patch
>   perf-build-add-detection-of-java-11-openjdk-devel-pa.patch
>   include-trace-events-writeback.h-fix-wstringop-trunc.patch
>   selftests-bpf-adjust-strobemeta-loop-to-satisfy-late.patch
>   kernel-elfcore.c-include-proper-prototypes.patch
>   libbpf-fix-false-uninitialized-variable-warning.patch
>   blk-mq-move-lockdep_assert_held-into-elevator_exit.patch
>   bpf-fix-bpf_event_output-re-entry-issue.patch
>   net-dsa-microchip-always-set-regmap-stride-to-1.patch
>   i2c-qcom-geni-disable-dma-processing-on-the-lenovo-y.patch
>   perf-unwind-fix-libunwind-build-failure-on-i386-syst.patch
>   mlxsw-spectrum_flower-fail-in-case-user-specifies-mu.patch
>   nfp-abm-fix-memory-leak-in-nfp_abm_u32_knode_replace.patch
>   drm-radeon-bail-earlier-when-radeon.cik_-si_support-.patch
>   btrfs-fix-selftests-failure-due-to-uninitialized-i_m.patch
>   kvm-nvmx-fix-consistency-check-on-injected-exception.patch
>   tick-broadcast-hrtimer-fix-a-race-in-bc_set_next.patch
>   perf-stat-reset-previous-counts-on-repeat-with-inter.patch
>   riscv-avoid-interrupts-being-erroneously-enabled-in-.patch
>   vfs-fix-eoverflow-testing-in-put_compat_statfs64.patch
>   coresight-etm4x-use-explicit-barriers-on-enable-disable.patch
>   staging-erofs-fix-an-error-handling-in-erofs_readdir.patch
>   staging-erofs-some-compressed-cluster-should-be-submitted-for-corrupted-images.patch
>   staging-erofs-add-two-missing-erofs_workgroup_put-for-corrupted-images.patch
>   staging-erofs-avoid-endless-loop-of-invalid-lookback-distance-0.patch
>   staging-erofs-detect-potential-multiref-due-to-corrupted-images.patch
> 
> Compile testing
> ---------------
> 
> We compiled the kernel for 3 architectures:
> 
>     aarch64:
>       make options: -j30 INSTALL_MOD_STRIP=1 targz-pkg
> 
>     ppc64le:
>       make options: -j30 INSTALL_MOD_STRIP=1 targz-pkg
> 
>     x86_64:
>       make options: -j30 INSTALL_MOD_STRIP=1 targz-pkg
> 
> 
> Hardware testing
> ----------------
> We booted each kernel and ran the following tests:
> 
>   aarch64:
> 
>     ⚡ Internal infrastructure issues prevented one or more tests (marked
>     with ⚡⚡⚡) from running on this architecture.
>     This is not the fault of the kernel that was tested.
> 
>   ppc64le:
>       Host 1:
>          ✅ Boot test
>          ✅ Podman system integration test (as root)
>          ✅ Podman system integration test (as user)
>          ✅ Loopdev Sanity
>          ✅ jvm test suite
>          ✅ AMTU (Abstract Machine Test Utility)
>          ✅ Ethernet drivers sanity
>          ✅ Networking socket: fuzz
>          ✅ audit: audit testsuite test
>          ✅ httpd: mod_ssl smoke sanity
>          ✅ iotop: sanity
>          ✅ tuned: tune-processes-through-perf
>          ✅ Usex - version 1.9-29
>          🚧 ✅ LTP lite
>          🚧 ✅ POSIX pjd-fstest suites
>          🚧 ✅ ALSA PCM loopback test
>          🚧 ✅ ALSA Control (mixer) Userspace Element test
>          🚧 ✅ trace: ftrace/tracer
> 
>       Host 2:
>          ✅ Boot test
>          ✅ xfstests: xfs
>          ✅ selinux-policy: serge-testsuite
>          ✅ lvm thinp sanity
>          ✅ storage: software RAID testing
>          🚧 ✅ Storage blktests
> 
>   x86_64:
>       Host 1:
>          ✅ Boot test
>          ✅ xfstests: xfs
>          ✅ selinux-policy: serge-testsuite
>          ✅ lvm thinp sanity
>          ✅ storage: software RAID testing
>          🚧 ✅ IOMMU boot test
>          🚧 ✅ Storage blktests
> 
>       Host 2:
>          ✅ Boot test
>          ✅ Podman system integration test (as root)
>          ✅ Podman system integration test (as user)
>          ✅ Loopdev Sanity
>          ✅ jvm test suite
>          ✅ AMTU (Abstract Machine Test Utility)
>          ✅ Ethernet drivers sanity
>          ✅ Networking socket: fuzz
>          ✅ audit: audit testsuite test
>          ✅ httpd: mod_ssl smoke sanity
>          ✅ iotop: sanity
>          ✅ tuned: tune-processes-through-perf
>          ✅ pciutils: sanity smoke test
>          ✅ Usex - version 1.9-29
>          ✅ stress: stress-ng
>          🚧 ❌ LTP lite
>          🚧 ✅ POSIX pjd-fstest suites
>          🚧 ✅ ALSA PCM loopback test
>          🚧 ✅ ALSA Control (mixer) Userspace Element test
>          🚧 ✅ trace: ftrace/tracer
> 
>       Host 3:
>          ❌ Boot test
>          🚧 ❌ /kernel/infiniband/env_setup
>          🚧 ❌ /kernel/infiniband/sanity
>       Host 4:
>          ❌ Boot test
>          🚧 ❌ /kernel/infiniband/env_setup
>          🚧 ❌ /kernel/infiniband/sanity
> 
>       Host 5:
>          ❌ Boot test
>          🚧 ❌ /kernel/infiniband/env_setup
>          🚧 ❌ /kernel/infiniband/sanity
>       Host 6:
>          ❌ Boot test
>          🚧 ❌ /kernel/infiniband/env_setup
>          🚧 ❌ /kernel/infiniband/sanity
> 
>   Test sources: https://github.com/CKI-project/tests-beaker
>     💚 Pull requests are welcome for new tests or improvements to existing
>     tests!
> 
> Waived tests
> ------------
> If the test run included waived tests, they are marked with 🚧. Such tests
> are
> executed but their results are not taken into account. Tests are waived when
> their results are not reliable enough, e.g. when they're just introduced or
> are
> being fixed.
> 
> 
> 

^ permalink raw reply	[flat|nested] 22+ messages in thread

* Re: ? FAIL: Stable queue: queue-5.3
  2019-10-10  6:30     ` Naresh Kamboju
@ 2019-10-16 17:25       ` " Jakub Racek
  0 siblings, 0 replies; 22+ messages in thread
From: Jakub Racek @ 2019-10-16 17:25 UTC (permalink / raw)
  To: Naresh Kamboju
  Cc: Don Zickus, Sasha Levin, Memory Management,
	Linux Stable maillist, Jan Stancek, CKI Project, Zhaojuan Guo

+++ Naresh Kamboju [10/10/19 12:00 +0530]:
>3831659 Warn Aborted cki@gitlab:214657 5.3.5-dc073f1.cki@upstream-stable aarch64
>3831713 Fail Completed cki@gitlab:214657 5.3.5-dc073f1.cki@upstream-stable aarch64 [RS:6067440]
>3831660 Pass Completed cki@gitlab:214657 5.3.5-dc073f1.cki@upstream-stable ppc64le
>3831662 Fail Completed cki@gitlab:214657 5.3.5-dc073f1.cki@upstream-stable x86_64
>3831661 Pass Completed cki@gitlab:214657 5.3.5-dc073f1.cki@upstream-stable x86_64
>
>On Thu, 10 Oct 2019 at 06:40, Don Zickus <dzickus@redhat.com> wrote:
>>
>> On Wed, Oct 09, 2019 at 06:44:37PM -0400, Sasha Levin wrote:
>> > On Wed, Oct 09, 2019 at 06:11:40PM -0400, CKI Project wrote:
>> > >
>> > > Hello,
>> > >
>> > > We ran automated tests on a patchset that was proposed for merging into this
>> > > kernel tree. The patches were applied to:
>> > >
>> > >       Kernel repo: https://git.kernel.org/pub/scm/linux/kernel/git/stable/linux.git
>> > >            Commit: 52020d3f6633 - Linux 5.3.5
>> > >
>> > > The results of these automated tests are provided below.
>> > >
>> > >    Overall result: FAILED (see details below)
>> > >             Merge: OK
>> > >           Compile: OK
>> > >             Tests: FAILED
>> > >
>> > > All kernel binaries, config files, and logs are available for download here:
>> > >
>> > >  https://artifacts.cki-project.org/pipelines/214657
>> > >
>> > > One or more kernel tests failed:
>> > >
>> > >    x86_64:
>> > >      ✗ Boot test
>> > >      ✗ Boot test
>> > >      ✗ Boot test
>> > >      ✗ Boot test
>> >
>> > Hm, I looked here:
>> >
>> > https://artifacts.cki-project.org/pipelines/214657/logs/x86_64_host_1_Boot_test_dmesg.log
>> >
>> > and here:
>> >
>> > https://artifacts.cki-project.org/pipelines/214657/logs/x86_64_host_2_Boot_test_dmesg.log
>> >
>> > but both look sane. What am I missing?
>>
>> I don't believe you are.  I looked at the raw beaker jobs and the x86_64
>> machines passed and another set is still queued.  There is an aarch64
>> machine that failed to boot.
>>
>> Unfortunately, I am skeptical of this result too but I would wait for the
>> CKI team to triage this.
>
>On the quick look i see
>
>x86_64: Host 3 failed to do any testing.
>Is it an infrastructure problem ?
>

Sorry, this was a super weird bug in our CI. It has since been fixed. 

>- Naresh
>

-- 
Best regards,

Jakub Racek
ARK

^ permalink raw reply	[flat|nested] 22+ messages in thread

* ❌ FAIL: Stable queue: queue-5.3
@ 2019-10-16 14:03 CKI Project
  0 siblings, 0 replies; 22+ messages in thread
From: CKI Project @ 2019-10-16 14:03 UTC (permalink / raw)
  To: Linux Stable maillist

[-- Attachment #1: Type: text/plain, Size: 8653 bytes --]


Hello,

We ran automated tests on a patchset that was proposed for merging into this
kernel tree. The patches were applied to:

       Kernel repo: https://git.kernel.org/pub/scm/linux/kernel/git/stable/linux.git
            Commit: d980f67059db - Linux 5.3.6

The results of these automated tests are provided below.

    Overall result: FAILED (see details below)
             Merge: OK
           Compile: FAILED

All kernel binaries, config files, and logs are available for download here:

  https://artifacts.cki-project.org/pipelines/229091

We attempted to compile the kernel for multiple architectures, but the compile
failed on one or more architectures:

           aarch64: FAILED (see build-aarch64.log.xz attachment)
           ppc64le: FAILED (see build-ppc64le.log.xz attachment)
             s390x: FAILED (see build-s390x.log.xz attachment)
            x86_64: FAILED (see build-x86_64.log.xz attachment)

We hope that these logs can help you find the problem quickly. For the full
detail on our testing procedures, please scroll to the bottom of this message.

Please reply to this email if you have any questions about the tests that we
ran or if you have any suggestions on how to make future tests more effective.

        ,-.   ,-.
       ( C ) ( K )  Continuous
        `-',-.`-'   Kernel
          ( I )     Integration
           `-'
______________________________________________________________________________

Merge testing
-------------

We cloned this repository and checked out the following commit:

  Repo: https://git.kernel.org/pub/scm/linux/kernel/git/stable/linux.git
  Commit: d980f67059db - Linux 5.3.6


We grabbed the 62b9a201a516 commit of the stable queue repository.

We then merged the patchset with `git am`:

  panic-ensure-preemption-is-disabled-during-panic.patch
  usb-rio500-remove-rio-500-kernel-driver.patch
  usb-yurex-don-t-retry-on-unexpected-errors.patch
  usb-yurex-fix-null-derefs-on-disconnect.patch
  usb-usb-skeleton-fix-runtime-pm-after-driver-unbind.patch
  usb-usb-skeleton-fix-null-deref-on-disconnect.patch
  xhci-fix-false-warning-message-about-wrong-bounce-buffer-write-length.patch
  xhci-prevent-device-initiated-u1-u2-link-pm-if-exit-latency-is-too-long.patch
  xhci-check-all-endpoints-for-lpm-timeout.patch
  xhci-fix-usb-3.1-capability-detection-on-early-xhci-1.1-spec-based-hosts.patch
  usb-xhci-wait-for-cnr-controller-not-ready-bit-in-xhci-resume.patch
  xhci-prevent-deadlock-when-xhci-adapter-breaks-during-init.patch
  xhci-increase-sts_save-timeout-in-xhci_suspend.patch
  xhci-fix-null-pointer-dereference-in-xhci_clear_tt_buffer_complete.patch
  usb-adutux-fix-use-after-free-on-disconnect.patch
  usb-adutux-fix-null-derefs-on-disconnect.patch
  usb-adutux-fix-use-after-free-on-release.patch
  usb-iowarrior-fix-use-after-free-on-disconnect.patch
  usb-iowarrior-fix-use-after-free-on-release.patch
  usb-iowarrior-fix-use-after-free-after-driver-unbind.patch
  usb-usblp-fix-runtime-pm-after-driver-unbind.patch
  usb-chaoskey-fix-use-after-free-on-release.patch
  usb-ldusb-fix-null-derefs-on-driver-unbind.patch
  serial-uartlite-fix-exit-path-null-pointer.patch
  serial-uartps-fix-uartps_major-handling.patch
  usb-serial-keyspan-fix-null-derefs-on-open-and-write.patch
  usb-serial-ftdi_sio-add-device-ids-for-sienna-and-echelon-pl-20.patch
  usb-serial-option-add-telit-fn980-compositions.patch
  usb-serial-option-add-support-for-cinterion-cls8-devices.patch
  usb-serial-fix-runtime-pm-after-driver-unbind.patch
  usb-usblcd-fix-i-o-after-disconnect.patch
  usb-microtek-fix-info-leak-at-probe.patch
  usb-dummy-hcd-fix-power-budget-for-superspeed-mode.patch
  usb-renesas_usbhs-gadget-do-not-discard-queues-in-usb_ep_set_-halt-wedge.patch
  usb-renesas_usbhs-gadget-fix-usb_ep_set_-halt-wedge-behavior.patch
  usb-typec-tcpm-usb-typec-tcpm-fix-a-signedness-bug-in-tcpm_fw_get_caps.patch
  usb-typec-ucsi-ccg-remove-run_isr-flag.patch
  usb-typec-ucsi-displayport-fix-for-the-mode-entering-routine.patch
  usb-legousbtower-fix-slab-info-leak-at-probe.patch
  usb-legousbtower-fix-deadlock-on-disconnect.patch
  usb-legousbtower-fix-potential-null-deref-on-disconnect.patch
  usb-legousbtower-fix-open-after-failed-reset-request.patch
  usb-legousbtower-fix-use-after-free-on-release.patch
  mei-me-add-comet-point-lake-lp-device-ids.patch
  mei-avoid-fw-version-request-on-ibex-peak-and-earlier.patch
  gpio-eic-sprd-fix-the-incorrect-eic-offset-when-toggling.patch
  staging-fbtft-depend-on-of.patch
  staging-bcm2835-audio-fix-draining-behavior-regression.patch
  staging-fbtft-fix-memory-leak-in-fbtft_framebuffer_alloc.patch
  staging-rtl8188eu-fix-highestrate-check-in-odm_arfbrefresh_8188e.patch
  staging-vt6655-fix-memory-leak-in-vt6655_probe.patch
  iio-adc-hx711-fix-bug-in-sampling-of-data.patch
  iio-adc-ad799x-fix-probe-error-handling.patch
  iio-adc-axp288-override-ts-pin-bias-current-for-some-models.patch
  iio-adc-stm32-adc-move-registers-definitions.patch
  iio-adc-stm32-adc-fix-a-race-when-using-several-adcs-with-dma-and-irq.patch
  iio-light-opt3001-fix-mutex-unlock-race.patch
  iio-light-add-missing-vcnl4040-of_compatible.patch
  iio-accel-adxl372-fix-remove-limitation-for-fifo-samples.patch
  iio-accel-adxl372-fix-push-to-buffers-lost-samples.patch
  iio-accel-adxl372-perform-a-reset-at-start-up.patch
  efivar-ssdt-don-t-iterate-over-efi-vars-if-no-ssdt-override-was-specified.patch
  efi-tpm-don-t-access-event-count-when-it-isn-t-mapped.patch
  efi-tpm-don-t-traverse-an-event-log-with-no-events.patch
  efi-tpm-only-set-efi_tpm_final_log_size-after-successful-event-log-parsing.patch
  perf-llvm-don-t-access-out-of-scope-array.patch
  perf-inject-jit-fix-jit_code_move-filename.patch
  drm-i915-perform-ggtt-restore-much-earlier-during-resume.patch
  blk-wbt-fix-performance-regression-in-wbt-scale_up-scale_down.patch
  selinux-fix-context-string-corruption-in-convert_context.patch
  io_uring-only-flush-workqueues-on-fileset-removal.patch
  cifs-gracefully-handle-queryinfo-errors-during-open.patch
  cifs-force-revalidate-inode-when-dentry-is-stale.patch
  cifs-force-reval-dentry-if-lookup_reval-flag-is-set.patch
  cifs-use-cifsinodeinfo-open_file_lock-while-iterating-to-avoid-a-panic.patch
  kernel-sysctl.c-do-not-override-max_threads-provided-by-userspace.patch
  mm-z3fold.c-claim-page-in-the-beginning-of-free.patch
  mm-page_alloc.c-fix-a-crash-in-free_pages_prepare.patch
  mm-vmpressure.c-fix-a-signedness-bug-in-vmpressure_register_event.patch
  ib-core-fix-wrong-iterating-on-ports.patch
  firmware-google-increment-vpd-key_len-properly.patch
  gpio-fix-getting-nonexclusive-gpiods-from-dt.patch
  gpiolib-don-t-clear-flag_is_out-when-emulating-open-.patch
  btrfs-relocation-fix-use-after-free-on-dead-relocation-roots.patch
  btrfs-allocate-new-inode-in-nofs-context.patch
  btrfs-fix-balance-convert-to-single-on-32-bit-host-cpus.patch
  btrfs-fix-memory-leak-due-to-concurrent-append-writes-with-fiemap.patch
  btrfs-fix-incorrect-updating-of-log-root-tree.patch
  btrfs-fix-uninitialized-ret-in-ref-verify.patch
  nfs-fix-o_direct-accounting-of-number-of-bytes-read-written.patch
  mips-disable-loongson-mmi-instructions-for-kernel-build.patch
  mips-elf_hwcap-export-userspace-ases.patch
  rdma-vmw_pvrdma-free-srq-only-once.patch
  acpi-pptt-add-support-for-acpi-6.3-thread-flag.patch
  arm64-topology-use-pptt-to-determine-if-pe-is-a-thre.patch
  iio-light-fix-vcnl4000-devicetree-hooks.patch
  fix-the-locking-in-dcache_readdir-and-friends.patch
  drm-i915-bump-skl-max-plane-width-to-5k-for-linear-x-tiled.patch
  drm-i915-whitelist-common_slice_chicken2.patch
  drm-i915-mark-contents-as-dirty-on-a-write-fault.patch
  drm-msm-use-the-correct-dma_sync-calls-harder.patch
  media-stkwebcam-fix-runtime-pm-after-driver-unbind.patch
  arm64-sve-fix-wrong-free-for-task-thread.sve_state.patch
  tracing-hwlat-report-total-time-spent-in-all-nmis-during-the-sample.patch
  tracing-hwlat-don-t-ignore-outer-loop-duration-when-calculating-max_latency.patch
  ftrace-get-a-reference-counter-for-the-trace_array-on-filter-files.patch
  tracing-get-trace_array-reference-for-available_tracers-files.patch
  hwmon-fix-hwmon_p_min_alarm-mask.patch
  mtd-rawnand-au1550nd-fix-au_read_buf16-prototype.patch
  x86-asm-fix-mwaitx-c-state-hint-value.patch

Compile testing
---------------

We compiled the kernel for 4 architectures:

    aarch64:
      make options: -j30 INSTALL_MOD_STRIP=1 targz-pkg

    ppc64le:
      make options: -j30 INSTALL_MOD_STRIP=1 targz-pkg

    s390x:
      make options: -j30 INSTALL_MOD_STRIP=1 targz-pkg

    x86_64:
      make options: -j30 INSTALL_MOD_STRIP=1 targz-pkg


[-- Attachment #2: build-s390x.log.xz --]
[-- Type: application/x-xz, Size: 32640 bytes --]

[-- Attachment #3: build-ppc64le.log.xz --]
[-- Type: application/x-xz, Size: 70552 bytes --]

[-- Attachment #4: build-aarch64.log.xz --]
[-- Type: application/x-xz, Size: 85148 bytes --]

[-- Attachment #5: build-x86_64.log.xz --]
[-- Type: application/x-xz, Size: 84924 bytes --]

^ permalink raw reply	[flat|nested] 22+ messages in thread

* ❌ FAIL: Stable queue: queue-5.3
@ 2019-10-16 13:56 CKI Project
  0 siblings, 0 replies; 22+ messages in thread
From: CKI Project @ 2019-10-16 13:56 UTC (permalink / raw)
  To: Linux Stable maillist

[-- Attachment #1: Type: text/plain, Size: 7805 bytes --]


Hello,

We ran automated tests on a patchset that was proposed for merging into this
kernel tree. The patches were applied to:

       Kernel repo: https://git.kernel.org/pub/scm/linux/kernel/git/stable/linux.git
            Commit: d980f67059db - Linux 5.3.6

The results of these automated tests are provided below.

    Overall result: FAILED (see details below)
             Merge: OK
           Compile: FAILED

All kernel binaries, config files, and logs are available for download here:

  https://artifacts.cki-project.org/pipelines/229078

We attempted to compile the kernel for multiple architectures, but the compile
failed on one or more architectures:

           aarch64: FAILED (see build-aarch64.log.xz attachment)
           ppc64le: FAILED (see build-ppc64le.log.xz attachment)
             s390x: FAILED (see build-s390x.log.xz attachment)
            x86_64: FAILED (see build-x86_64.log.xz attachment)

We hope that these logs can help you find the problem quickly. For the full
detail on our testing procedures, please scroll to the bottom of this message.

Please reply to this email if you have any questions about the tests that we
ran or if you have any suggestions on how to make future tests more effective.

        ,-.   ,-.
       ( C ) ( K )  Continuous
        `-',-.`-'   Kernel
          ( I )     Integration
           `-'
______________________________________________________________________________

Merge testing
-------------

We cloned this repository and checked out the following commit:

  Repo: https://git.kernel.org/pub/scm/linux/kernel/git/stable/linux.git
  Commit: d980f67059db - Linux 5.3.6


We grabbed the 7528b45349fa commit of the stable queue repository.

We then merged the patchset with `git am`:

  panic-ensure-preemption-is-disabled-during-panic.patch
  usb-rio500-remove-rio-500-kernel-driver.patch
  usb-yurex-don-t-retry-on-unexpected-errors.patch
  usb-yurex-fix-null-derefs-on-disconnect.patch
  usb-usb-skeleton-fix-runtime-pm-after-driver-unbind.patch
  usb-usb-skeleton-fix-null-deref-on-disconnect.patch
  xhci-fix-false-warning-message-about-wrong-bounce-buffer-write-length.patch
  xhci-prevent-device-initiated-u1-u2-link-pm-if-exit-latency-is-too-long.patch
  xhci-check-all-endpoints-for-lpm-timeout.patch
  xhci-fix-usb-3.1-capability-detection-on-early-xhci-1.1-spec-based-hosts.patch
  usb-xhci-wait-for-cnr-controller-not-ready-bit-in-xhci-resume.patch
  xhci-prevent-deadlock-when-xhci-adapter-breaks-during-init.patch
  xhci-increase-sts_save-timeout-in-xhci_suspend.patch
  xhci-fix-null-pointer-dereference-in-xhci_clear_tt_buffer_complete.patch
  usb-adutux-fix-use-after-free-on-disconnect.patch
  usb-adutux-fix-null-derefs-on-disconnect.patch
  usb-adutux-fix-use-after-free-on-release.patch
  usb-iowarrior-fix-use-after-free-on-disconnect.patch
  usb-iowarrior-fix-use-after-free-on-release.patch
  usb-iowarrior-fix-use-after-free-after-driver-unbind.patch
  usb-usblp-fix-runtime-pm-after-driver-unbind.patch
  usb-chaoskey-fix-use-after-free-on-release.patch
  usb-ldusb-fix-null-derefs-on-driver-unbind.patch
  serial-uartlite-fix-exit-path-null-pointer.patch
  serial-uartps-fix-uartps_major-handling.patch
  usb-serial-keyspan-fix-null-derefs-on-open-and-write.patch
  usb-serial-ftdi_sio-add-device-ids-for-sienna-and-echelon-pl-20.patch
  usb-serial-option-add-telit-fn980-compositions.patch
  usb-serial-option-add-support-for-cinterion-cls8-devices.patch
  usb-serial-fix-runtime-pm-after-driver-unbind.patch
  usb-usblcd-fix-i-o-after-disconnect.patch
  usb-microtek-fix-info-leak-at-probe.patch
  usb-dummy-hcd-fix-power-budget-for-superspeed-mode.patch
  usb-renesas_usbhs-gadget-do-not-discard-queues-in-usb_ep_set_-halt-wedge.patch
  usb-renesas_usbhs-gadget-fix-usb_ep_set_-halt-wedge-behavior.patch
  usb-typec-tcpm-usb-typec-tcpm-fix-a-signedness-bug-in-tcpm_fw_get_caps.patch
  usb-typec-ucsi-ccg-remove-run_isr-flag.patch
  usb-typec-ucsi-displayport-fix-for-the-mode-entering-routine.patch
  usb-legousbtower-fix-slab-info-leak-at-probe.patch
  usb-legousbtower-fix-deadlock-on-disconnect.patch
  usb-legousbtower-fix-potential-null-deref-on-disconnect.patch
  usb-legousbtower-fix-open-after-failed-reset-request.patch
  usb-legousbtower-fix-use-after-free-on-release.patch
  mei-me-add-comet-point-lake-lp-device-ids.patch
  mei-avoid-fw-version-request-on-ibex-peak-and-earlier.patch
  gpio-eic-sprd-fix-the-incorrect-eic-offset-when-toggling.patch
  staging-fbtft-depend-on-of.patch
  staging-bcm2835-audio-fix-draining-behavior-regression.patch
  staging-fbtft-fix-memory-leak-in-fbtft_framebuffer_alloc.patch
  staging-rtl8188eu-fix-highestrate-check-in-odm_arfbrefresh_8188e.patch
  staging-vt6655-fix-memory-leak-in-vt6655_probe.patch
  iio-adc-hx711-fix-bug-in-sampling-of-data.patch
  iio-adc-ad799x-fix-probe-error-handling.patch
  iio-adc-axp288-override-ts-pin-bias-current-for-some-models.patch
  iio-adc-stm32-adc-move-registers-definitions.patch
  iio-adc-stm32-adc-fix-a-race-when-using-several-adcs-with-dma-and-irq.patch
  iio-light-opt3001-fix-mutex-unlock-race.patch
  iio-light-add-missing-vcnl4040-of_compatible.patch
  iio-accel-adxl372-fix-remove-limitation-for-fifo-samples.patch
  iio-accel-adxl372-fix-push-to-buffers-lost-samples.patch
  iio-accel-adxl372-perform-a-reset-at-start-up.patch
  efivar-ssdt-don-t-iterate-over-efi-vars-if-no-ssdt-override-was-specified.patch
  efi-tpm-don-t-access-event-count-when-it-isn-t-mapped.patch
  efi-tpm-don-t-traverse-an-event-log-with-no-events.patch
  efi-tpm-only-set-efi_tpm_final_log_size-after-successful-event-log-parsing.patch
  perf-llvm-don-t-access-out-of-scope-array.patch
  perf-inject-jit-fix-jit_code_move-filename.patch
  drm-i915-perform-ggtt-restore-much-earlier-during-resume.patch
  blk-wbt-fix-performance-regression-in-wbt-scale_up-scale_down.patch
  selinux-fix-context-string-corruption-in-convert_context.patch
  io_uring-only-flush-workqueues-on-fileset-removal.patch
  cifs-gracefully-handle-queryinfo-errors-during-open.patch
  cifs-force-revalidate-inode-when-dentry-is-stale.patch
  cifs-force-reval-dentry-if-lookup_reval-flag-is-set.patch
  cifs-use-cifsinodeinfo-open_file_lock-while-iterating-to-avoid-a-panic.patch
  kernel-sysctl.c-do-not-override-max_threads-provided-by-userspace.patch
  mm-z3fold.c-claim-page-in-the-beginning-of-free.patch
  mm-page_alloc.c-fix-a-crash-in-free_pages_prepare.patch
  mm-vmpressure.c-fix-a-signedness-bug-in-vmpressure_register_event.patch
  ib-core-fix-wrong-iterating-on-ports.patch
  firmware-google-increment-vpd-key_len-properly.patch
  gpio-fix-getting-nonexclusive-gpiods-from-dt.patch
  gpiolib-don-t-clear-flag_is_out-when-emulating-open-.patch
  btrfs-relocation-fix-use-after-free-on-dead-relocation-roots.patch
  btrfs-allocate-new-inode-in-nofs-context.patch
  btrfs-fix-balance-convert-to-single-on-32-bit-host-cpus.patch
  btrfs-fix-memory-leak-due-to-concurrent-append-writes-with-fiemap.patch
  btrfs-fix-incorrect-updating-of-log-root-tree.patch
  btrfs-fix-uninitialized-ret-in-ref-verify.patch
  nfs-fix-o_direct-accounting-of-number-of-bytes-read-written.patch
  mips-disable-loongson-mmi-instructions-for-kernel-build.patch
  mips-elf_hwcap-export-userspace-ases.patch
  rdma-vmw_pvrdma-free-srq-only-once.patch
  acpi-pptt-add-support-for-acpi-6.3-thread-flag.patch
  arm64-topology-use-pptt-to-determine-if-pe-is-a-thre.patch
  iio-light-fix-vcnl4000-devicetree-hooks.patch

Compile testing
---------------

We compiled the kernel for 4 architectures:

    aarch64:
      make options: -j30 INSTALL_MOD_STRIP=1 targz-pkg

    ppc64le:
      make options: -j30 INSTALL_MOD_STRIP=1 targz-pkg

    s390x:
      make options: -j30 INSTALL_MOD_STRIP=1 targz-pkg

    x86_64:
      make options: -j30 INSTALL_MOD_STRIP=1 targz-pkg


[-- Attachment #2: build-s390x.log.xz --]
[-- Type: application/x-xz, Size: 32808 bytes --]

[-- Attachment #3: build-ppc64le.log.xz --]
[-- Type: application/x-xz, Size: 70556 bytes --]

[-- Attachment #4: build-aarch64.log.xz --]
[-- Type: application/x-xz, Size: 85260 bytes --]

[-- Attachment #5: build-x86_64.log.xz --]
[-- Type: application/x-xz, Size: 85192 bytes --]

^ permalink raw reply	[flat|nested] 22+ messages in thread

* ❌ FAIL: Stable queue: queue-5.3
@ 2019-10-15 22:30 CKI Project
  0 siblings, 0 replies; 22+ messages in thread
From: CKI Project @ 2019-10-15 22:30 UTC (permalink / raw)
  To: Linux Stable maillist

[-- Attachment #1: Type: text/plain, Size: 7225 bytes --]


Hello,

We ran automated tests on a patchset that was proposed for merging into this
kernel tree. The patches were applied to:

       Kernel repo: https://git.kernel.org/pub/scm/linux/kernel/git/stable/linux.git
            Commit: d980f67059db - Linux 5.3.6

The results of these automated tests are provided below.

    Overall result: FAILED (see details below)
             Merge: OK
           Compile: FAILED

All kernel binaries, config files, and logs are available for download here:

  https://artifacts.cki-project.org/pipelines/227878

We attempted to compile the kernel for multiple architectures, but the compile
failed on one or more architectures:

           aarch64: FAILED (see build-aarch64.log.xz attachment)
           ppc64le: FAILED (see build-ppc64le.log.xz attachment)
             s390x: FAILED (see build-s390x.log.xz attachment)
            x86_64: FAILED (see build-x86_64.log.xz attachment)

We hope that these logs can help you find the problem quickly. For the full
detail on our testing procedures, please scroll to the bottom of this message.

Please reply to this email if you have any questions about the tests that we
ran or if you have any suggestions on how to make future tests more effective.

        ,-.   ,-.
       ( C ) ( K )  Continuous
        `-',-.`-'   Kernel
          ( I )     Integration
           `-'
______________________________________________________________________________

Merge testing
-------------

We cloned this repository and checked out the following commit:

  Repo: https://git.kernel.org/pub/scm/linux/kernel/git/stable/linux.git
  Commit: d980f67059db - Linux 5.3.6


We grabbed the c0708e42c6a2 commit of the stable queue repository.

We then merged the patchset with `git am`:

  panic-ensure-preemption-is-disabled-during-panic.patch
  usb-rio500-remove-rio-500-kernel-driver.patch
  usb-yurex-don-t-retry-on-unexpected-errors.patch
  usb-yurex-fix-null-derefs-on-disconnect.patch
  usb-usb-skeleton-fix-runtime-pm-after-driver-unbind.patch
  usb-usb-skeleton-fix-null-deref-on-disconnect.patch
  xhci-fix-false-warning-message-about-wrong-bounce-buffer-write-length.patch
  xhci-prevent-device-initiated-u1-u2-link-pm-if-exit-latency-is-too-long.patch
  xhci-check-all-endpoints-for-lpm-timeout.patch
  xhci-fix-usb-3.1-capability-detection-on-early-xhci-1.1-spec-based-hosts.patch
  usb-xhci-wait-for-cnr-controller-not-ready-bit-in-xhci-resume.patch
  xhci-prevent-deadlock-when-xhci-adapter-breaks-during-init.patch
  xhci-increase-sts_save-timeout-in-xhci_suspend.patch
  xhci-fix-null-pointer-dereference-in-xhci_clear_tt_buffer_complete.patch
  usb-adutux-fix-use-after-free-on-disconnect.patch
  usb-adutux-fix-null-derefs-on-disconnect.patch
  usb-adutux-fix-use-after-free-on-release.patch
  usb-iowarrior-fix-use-after-free-on-disconnect.patch
  usb-iowarrior-fix-use-after-free-on-release.patch
  usb-iowarrior-fix-use-after-free-after-driver-unbind.patch
  usb-usblp-fix-runtime-pm-after-driver-unbind.patch
  usb-chaoskey-fix-use-after-free-on-release.patch
  usb-ldusb-fix-null-derefs-on-driver-unbind.patch
  serial-uartlite-fix-exit-path-null-pointer.patch
  serial-uartps-fix-uartps_major-handling.patch
  usb-serial-keyspan-fix-null-derefs-on-open-and-write.patch
  usb-serial-ftdi_sio-add-device-ids-for-sienna-and-echelon-pl-20.patch
  usb-serial-option-add-telit-fn980-compositions.patch
  usb-serial-option-add-support-for-cinterion-cls8-devices.patch
  usb-serial-fix-runtime-pm-after-driver-unbind.patch
  usb-usblcd-fix-i-o-after-disconnect.patch
  usb-microtek-fix-info-leak-at-probe.patch
  usb-dummy-hcd-fix-power-budget-for-superspeed-mode.patch
  usb-renesas_usbhs-gadget-do-not-discard-queues-in-usb_ep_set_-halt-wedge.patch
  usb-renesas_usbhs-gadget-fix-usb_ep_set_-halt-wedge-behavior.patch
  usb-typec-tcpm-usb-typec-tcpm-fix-a-signedness-bug-in-tcpm_fw_get_caps.patch
  usb-typec-ucsi-ccg-remove-run_isr-flag.patch
  usb-typec-ucsi-displayport-fix-for-the-mode-entering-routine.patch
  usb-legousbtower-fix-slab-info-leak-at-probe.patch
  usb-legousbtower-fix-deadlock-on-disconnect.patch
  usb-legousbtower-fix-potential-null-deref-on-disconnect.patch
  usb-legousbtower-fix-open-after-failed-reset-request.patch
  usb-legousbtower-fix-use-after-free-on-release.patch
  mei-me-add-comet-point-lake-lp-device-ids.patch
  mei-avoid-fw-version-request-on-ibex-peak-and-earlier.patch
  gpio-eic-sprd-fix-the-incorrect-eic-offset-when-toggling.patch
  staging-fbtft-depend-on-of.patch
  staging-bcm2835-audio-fix-draining-behavior-regression.patch
  staging-fbtft-fix-memory-leak-in-fbtft_framebuffer_alloc.patch
  staging-rtl8188eu-fix-highestrate-check-in-odm_arfbrefresh_8188e.patch
  staging-vt6655-fix-memory-leak-in-vt6655_probe.patch
  iio-adc-hx711-fix-bug-in-sampling-of-data.patch
  iio-adc-ad799x-fix-probe-error-handling.patch
  iio-adc-axp288-override-ts-pin-bias-current-for-some-models.patch
  iio-adc-stm32-adc-move-registers-definitions.patch
  iio-adc-stm32-adc-fix-a-race-when-using-several-adcs-with-dma-and-irq.patch
  iio-light-opt3001-fix-mutex-unlock-race.patch
  iio-light-add-missing-vcnl4040-of_compatible.patch
  iio-accel-adxl372-fix-remove-limitation-for-fifo-samples.patch
  iio-accel-adxl372-fix-push-to-buffers-lost-samples.patch
  iio-accel-adxl372-perform-a-reset-at-start-up.patch
  efivar-ssdt-don-t-iterate-over-efi-vars-if-no-ssdt-override-was-specified.patch
  efi-tpm-don-t-access-event-count-when-it-isn-t-mapped.patch
  efi-tpm-don-t-traverse-an-event-log-with-no-events.patch
  efi-tpm-only-set-efi_tpm_final_log_size-after-successful-event-log-parsing.patch
  perf-llvm-don-t-access-out-of-scope-array.patch
  perf-inject-jit-fix-jit_code_move-filename.patch
  drm-i915-perform-ggtt-restore-much-earlier-during-resume.patch
  blk-wbt-fix-performance-regression-in-wbt-scale_up-scale_down.patch
  selinux-fix-context-string-corruption-in-convert_context.patch
  io_uring-only-flush-workqueues-on-fileset-removal.patch
  cifs-gracefully-handle-queryinfo-errors-during-open.patch
  cifs-force-revalidate-inode-when-dentry-is-stale.patch
  cifs-force-reval-dentry-if-lookup_reval-flag-is-set.patch
  cifs-use-cifsinodeinfo-open_file_lock-while-iterating-to-avoid-a-panic.patch
  kernel-sysctl.c-do-not-override-max_threads-provided-by-userspace.patch
  mm-z3fold.c-claim-page-in-the-beginning-of-free.patch
  mm-page_alloc.c-fix-a-crash-in-free_pages_prepare.patch
  mm-vmpressure.c-fix-a-signedness-bug-in-vmpressure_register_event.patch
  ib-core-fix-wrong-iterating-on-ports.patch
  firmware-google-increment-vpd-key_len-properly.patch
  gpio-fix-getting-nonexclusive-gpiods-from-dt.patch
  gpiolib-don-t-clear-flag_is_out-when-emulating-open-.patch
  acpi-pptt-add-support-for-acpi-6.3-thread-flag.patch
  arm64-topology-use-pptt-to-determine-if-pe-is-a-thre.patch
  iio-light-fix-vcnl4000-devicetree-hooks.patch

Compile testing
---------------

We compiled the kernel for 4 architectures:

    aarch64:
      make options: -j30 INSTALL_MOD_STRIP=1 targz-pkg

    ppc64le:
      make options: -j30 INSTALL_MOD_STRIP=1 targz-pkg

    s390x:
      make options: -j30 INSTALL_MOD_STRIP=1 targz-pkg

    x86_64:
      make options: -j30 INSTALL_MOD_STRIP=1 targz-pkg


[-- Attachment #2: build-s390x.log.xz --]
[-- Type: application/x-xz, Size: 32908 bytes --]

[-- Attachment #3: build-ppc64le.log.xz --]
[-- Type: application/x-xz, Size: 70156 bytes --]

[-- Attachment #4: build-aarch64.log.xz --]
[-- Type: application/x-xz, Size: 85092 bytes --]

[-- Attachment #5: build-x86_64.log.xz --]
[-- Type: application/x-xz, Size: 84740 bytes --]

^ permalink raw reply	[flat|nested] 22+ messages in thread

* ❌ FAIL: Stable queue: queue-5.3
@ 2019-10-15  6:39 CKI Project
  0 siblings, 0 replies; 22+ messages in thread
From: CKI Project @ 2019-10-15  6:39 UTC (permalink / raw)
  To: Linux Stable maillist

[-- Attachment #1: Type: text/plain, Size: 7061 bytes --]


Hello,

We ran automated tests on a patchset that was proposed for merging into this
kernel tree. The patches were applied to:

       Kernel repo: https://git.kernel.org/pub/scm/linux/kernel/git/stable/linux.git
            Commit: d980f67059db - Linux 5.3.6

The results of these automated tests are provided below.

    Overall result: FAILED (see details below)
             Merge: OK
           Compile: FAILED

All kernel binaries, config files, and logs are available for download here:

  https://artifacts.cki-project.org/pipelines/226573

We attempted to compile the kernel for multiple architectures, but the compile
failed on one or more architectures:

           aarch64: FAILED (see build-aarch64.log.xz attachment)
           ppc64le: FAILED (see build-ppc64le.log.xz attachment)
             s390x: FAILED (see build-s390x.log.xz attachment)
            x86_64: FAILED (see build-x86_64.log.xz attachment)

We hope that these logs can help you find the problem quickly. For the full
detail on our testing procedures, please scroll to the bottom of this message.

Please reply to this email if you have any questions about the tests that we
ran or if you have any suggestions on how to make future tests more effective.

        ,-.   ,-.
       ( C ) ( K )  Continuous
        `-',-.`-'   Kernel
          ( I )     Integration
           `-'
______________________________________________________________________________

Merge testing
-------------

We cloned this repository and checked out the following commit:

  Repo: https://git.kernel.org/pub/scm/linux/kernel/git/stable/linux.git
  Commit: d980f67059db - Linux 5.3.6


We grabbed the 63992e7542bd commit of the stable queue repository.

We then merged the patchset with `git am`:

  panic-ensure-preemption-is-disabled-during-panic.patch
  usb-rio500-remove-rio-500-kernel-driver.patch
  usb-yurex-don-t-retry-on-unexpected-errors.patch
  usb-yurex-fix-null-derefs-on-disconnect.patch
  usb-usb-skeleton-fix-runtime-pm-after-driver-unbind.patch
  usb-usb-skeleton-fix-null-deref-on-disconnect.patch
  xhci-fix-false-warning-message-about-wrong-bounce-buffer-write-length.patch
  xhci-prevent-device-initiated-u1-u2-link-pm-if-exit-latency-is-too-long.patch
  xhci-check-all-endpoints-for-lpm-timeout.patch
  xhci-fix-usb-3.1-capability-detection-on-early-xhci-1.1-spec-based-hosts.patch
  usb-xhci-wait-for-cnr-controller-not-ready-bit-in-xhci-resume.patch
  xhci-prevent-deadlock-when-xhci-adapter-breaks-during-init.patch
  xhci-increase-sts_save-timeout-in-xhci_suspend.patch
  xhci-fix-null-pointer-dereference-in-xhci_clear_tt_buffer_complete.patch
  usb-adutux-fix-use-after-free-on-disconnect.patch
  usb-adutux-fix-null-derefs-on-disconnect.patch
  usb-adutux-fix-use-after-free-on-release.patch
  usb-iowarrior-fix-use-after-free-on-disconnect.patch
  usb-iowarrior-fix-use-after-free-on-release.patch
  usb-iowarrior-fix-use-after-free-after-driver-unbind.patch
  usb-usblp-fix-runtime-pm-after-driver-unbind.patch
  usb-chaoskey-fix-use-after-free-on-release.patch
  usb-ldusb-fix-null-derefs-on-driver-unbind.patch
  serial-uartlite-fix-exit-path-null-pointer.patch
  serial-uartps-fix-uartps_major-handling.patch
  usb-serial-keyspan-fix-null-derefs-on-open-and-write.patch
  usb-serial-ftdi_sio-add-device-ids-for-sienna-and-echelon-pl-20.patch
  usb-serial-option-add-telit-fn980-compositions.patch
  usb-serial-option-add-support-for-cinterion-cls8-devices.patch
  usb-serial-fix-runtime-pm-after-driver-unbind.patch
  usb-usblcd-fix-i-o-after-disconnect.patch
  usb-microtek-fix-info-leak-at-probe.patch
  usb-dummy-hcd-fix-power-budget-for-superspeed-mode.patch
  usb-renesas_usbhs-gadget-do-not-discard-queues-in-usb_ep_set_-halt-wedge.patch
  usb-renesas_usbhs-gadget-fix-usb_ep_set_-halt-wedge-behavior.patch
  usb-typec-tcpm-usb-typec-tcpm-fix-a-signedness-bug-in-tcpm_fw_get_caps.patch
  usb-typec-ucsi-ccg-remove-run_isr-flag.patch
  usb-typec-ucsi-displayport-fix-for-the-mode-entering-routine.patch
  usb-legousbtower-fix-slab-info-leak-at-probe.patch
  usb-legousbtower-fix-deadlock-on-disconnect.patch
  usb-legousbtower-fix-potential-null-deref-on-disconnect.patch
  usb-legousbtower-fix-open-after-failed-reset-request.patch
  usb-legousbtower-fix-use-after-free-on-release.patch
  mei-me-add-comet-point-lake-lp-device-ids.patch
  mei-avoid-fw-version-request-on-ibex-peak-and-earlier.patch
  gpio-eic-sprd-fix-the-incorrect-eic-offset-when-toggling.patch
  staging-fbtft-depend-on-of.patch
  staging-bcm2835-audio-fix-draining-behavior-regression.patch
  staging-fbtft-fix-memory-leak-in-fbtft_framebuffer_alloc.patch
  staging-rtl8188eu-fix-highestrate-check-in-odm_arfbrefresh_8188e.patch
  staging-vt6655-fix-memory-leak-in-vt6655_probe.patch
  iio-adc-hx711-fix-bug-in-sampling-of-data.patch
  iio-adc-ad799x-fix-probe-error-handling.patch
  iio-adc-axp288-override-ts-pin-bias-current-for-some-models.patch
  iio-adc-stm32-adc-move-registers-definitions.patch
  iio-adc-stm32-adc-fix-a-race-when-using-several-adcs-with-dma-and-irq.patch
  iio-light-opt3001-fix-mutex-unlock-race.patch
  iio-light-add-missing-vcnl4040-of_compatible.patch
  iio-accel-adxl372-fix-remove-limitation-for-fifo-samples.patch
  iio-accel-adxl372-fix-push-to-buffers-lost-samples.patch
  iio-accel-adxl372-perform-a-reset-at-start-up.patch
  efivar-ssdt-don-t-iterate-over-efi-vars-if-no-ssdt-override-was-specified.patch
  efi-tpm-don-t-access-event-count-when-it-isn-t-mapped.patch
  efi-tpm-don-t-traverse-an-event-log-with-no-events.patch
  efi-tpm-only-set-efi_tpm_final_log_size-after-successful-event-log-parsing.patch
  perf-llvm-don-t-access-out-of-scope-array.patch
  perf-inject-jit-fix-jit_code_move-filename.patch
  drm-i915-perform-ggtt-restore-much-earlier-during-resume.patch
  blk-wbt-fix-performance-regression-in-wbt-scale_up-scale_down.patch
  selinux-fix-context-string-corruption-in-convert_context.patch
  io_uring-only-flush-workqueues-on-fileset-removal.patch
  cifs-gracefully-handle-queryinfo-errors-during-open.patch
  cifs-force-revalidate-inode-when-dentry-is-stale.patch
  cifs-force-reval-dentry-if-lookup_reval-flag-is-set.patch
  cifs-use-cifsinodeinfo-open_file_lock-while-iterating-to-avoid-a-panic.patch
  kernel-sysctl.c-do-not-override-max_threads-provided-by-userspace.patch
  mm-z3fold.c-claim-page-in-the-beginning-of-free.patch
  mm-page_alloc.c-fix-a-crash-in-free_pages_prepare.patch
  mm-vmpressure.c-fix-a-signedness-bug-in-vmpressure_register_event.patch
  ib-core-fix-wrong-iterating-on-ports.patch
  firmware-google-increment-vpd-key_len-properly.patch
  gpio-fix-getting-nonexclusive-gpiods-from-dt.patch
  gpiolib-don-t-clear-flag_is_out-when-emulating-open-.patch

Compile testing
---------------

We compiled the kernel for 4 architectures:

    aarch64:
      make options: -j30 INSTALL_MOD_STRIP=1 targz-pkg

    ppc64le:
      make options: -j30 INSTALL_MOD_STRIP=1 targz-pkg

    s390x:
      make options: -j30 INSTALL_MOD_STRIP=1 targz-pkg

    x86_64:
      make options: -j30 INSTALL_MOD_STRIP=1 targz-pkg


[-- Attachment #2: build-s390x.log.xz --]
[-- Type: application/x-xz, Size: 33196 bytes --]

[-- Attachment #3: build-ppc64le.log.xz --]
[-- Type: application/x-xz, Size: 69644 bytes --]

[-- Attachment #4: build-aarch64.log.xz --]
[-- Type: application/x-xz, Size: 84552 bytes --]

[-- Attachment #5: build-x86_64.log.xz --]
[-- Type: application/x-xz, Size: 83628 bytes --]

^ permalink raw reply	[flat|nested] 22+ messages in thread

* ❌ FAIL: Stable queue: queue-5.3
@ 2019-10-15  4:49 CKI Project
  0 siblings, 0 replies; 22+ messages in thread
From: CKI Project @ 2019-10-15  4:49 UTC (permalink / raw)
  To: Linux Stable maillist

[-- Attachment #1: Type: text/plain, Size: 6892 bytes --]


Hello,

We ran automated tests on a patchset that was proposed for merging into this
kernel tree. The patches were applied to:

       Kernel repo: https://git.kernel.org/pub/scm/linux/kernel/git/stable/linux.git
            Commit: d980f67059db - Linux 5.3.6

The results of these automated tests are provided below.

    Overall result: FAILED (see details below)
             Merge: OK
           Compile: FAILED

All kernel binaries, config files, and logs are available for download here:

  https://artifacts.cki-project.org/pipelines/226430

We attempted to compile the kernel for multiple architectures, but the compile
failed on one or more architectures:

           aarch64: FAILED (see build-aarch64.log.xz attachment)
           ppc64le: FAILED (see build-ppc64le.log.xz attachment)
             s390x: FAILED (see build-s390x.log.xz attachment)
            x86_64: FAILED (see build-x86_64.log.xz attachment)

We hope that these logs can help you find the problem quickly. For the full
detail on our testing procedures, please scroll to the bottom of this message.

Please reply to this email if you have any questions about the tests that we
ran or if you have any suggestions on how to make future tests more effective.

        ,-.   ,-.
       ( C ) ( K )  Continuous
        `-',-.`-'   Kernel
          ( I )     Integration
           `-'
______________________________________________________________________________

Merge testing
-------------

We cloned this repository and checked out the following commit:

  Repo: https://git.kernel.org/pub/scm/linux/kernel/git/stable/linux.git
  Commit: d980f67059db - Linux 5.3.6


We grabbed the 8e64a8ac69c5 commit of the stable queue repository.

We then merged the patchset with `git am`:

  panic-ensure-preemption-is-disabled-during-panic.patch
  usb-rio500-remove-rio-500-kernel-driver.patch
  usb-yurex-don-t-retry-on-unexpected-errors.patch
  usb-yurex-fix-null-derefs-on-disconnect.patch
  usb-usb-skeleton-fix-runtime-pm-after-driver-unbind.patch
  usb-usb-skeleton-fix-null-deref-on-disconnect.patch
  xhci-fix-false-warning-message-about-wrong-bounce-buffer-write-length.patch
  xhci-prevent-device-initiated-u1-u2-link-pm-if-exit-latency-is-too-long.patch
  xhci-check-all-endpoints-for-lpm-timeout.patch
  xhci-fix-usb-3.1-capability-detection-on-early-xhci-1.1-spec-based-hosts.patch
  usb-xhci-wait-for-cnr-controller-not-ready-bit-in-xhci-resume.patch
  xhci-prevent-deadlock-when-xhci-adapter-breaks-during-init.patch
  xhci-increase-sts_save-timeout-in-xhci_suspend.patch
  xhci-fix-null-pointer-dereference-in-xhci_clear_tt_buffer_complete.patch
  usb-adutux-fix-use-after-free-on-disconnect.patch
  usb-adutux-fix-null-derefs-on-disconnect.patch
  usb-adutux-fix-use-after-free-on-release.patch
  usb-iowarrior-fix-use-after-free-on-disconnect.patch
  usb-iowarrior-fix-use-after-free-on-release.patch
  usb-iowarrior-fix-use-after-free-after-driver-unbind.patch
  usb-usblp-fix-runtime-pm-after-driver-unbind.patch
  usb-chaoskey-fix-use-after-free-on-release.patch
  usb-ldusb-fix-null-derefs-on-driver-unbind.patch
  serial-uartlite-fix-exit-path-null-pointer.patch
  serial-uartps-fix-uartps_major-handling.patch
  usb-serial-keyspan-fix-null-derefs-on-open-and-write.patch
  usb-serial-ftdi_sio-add-device-ids-for-sienna-and-echelon-pl-20.patch
  usb-serial-option-add-telit-fn980-compositions.patch
  usb-serial-option-add-support-for-cinterion-cls8-devices.patch
  usb-serial-fix-runtime-pm-after-driver-unbind.patch
  usb-usblcd-fix-i-o-after-disconnect.patch
  usb-microtek-fix-info-leak-at-probe.patch
  usb-dummy-hcd-fix-power-budget-for-superspeed-mode.patch
  usb-renesas_usbhs-gadget-do-not-discard-queues-in-usb_ep_set_-halt-wedge.patch
  usb-renesas_usbhs-gadget-fix-usb_ep_set_-halt-wedge-behavior.patch
  usb-typec-tcpm-usb-typec-tcpm-fix-a-signedness-bug-in-tcpm_fw_get_caps.patch
  usb-typec-ucsi-ccg-remove-run_isr-flag.patch
  usb-typec-ucsi-displayport-fix-for-the-mode-entering-routine.patch
  usb-legousbtower-fix-slab-info-leak-at-probe.patch
  usb-legousbtower-fix-deadlock-on-disconnect.patch
  usb-legousbtower-fix-potential-null-deref-on-disconnect.patch
  usb-legousbtower-fix-open-after-failed-reset-request.patch
  usb-legousbtower-fix-use-after-free-on-release.patch
  mei-me-add-comet-point-lake-lp-device-ids.patch
  mei-avoid-fw-version-request-on-ibex-peak-and-earlier.patch
  gpio-eic-sprd-fix-the-incorrect-eic-offset-when-toggling.patch
  staging-fbtft-depend-on-of.patch
  staging-bcm2835-audio-fix-draining-behavior-regression.patch
  staging-fbtft-fix-memory-leak-in-fbtft_framebuffer_alloc.patch
  staging-rtl8188eu-fix-highestrate-check-in-odm_arfbrefresh_8188e.patch
  staging-vt6655-fix-memory-leak-in-vt6655_probe.patch
  iio-adc-hx711-fix-bug-in-sampling-of-data.patch
  iio-adc-ad799x-fix-probe-error-handling.patch
  iio-adc-axp288-override-ts-pin-bias-current-for-some-models.patch
  iio-adc-stm32-adc-move-registers-definitions.patch
  iio-adc-stm32-adc-fix-a-race-when-using-several-adcs-with-dma-and-irq.patch
  iio-light-opt3001-fix-mutex-unlock-race.patch
  iio-light-add-missing-vcnl4040-of_compatible.patch
  iio-accel-adxl372-fix-remove-limitation-for-fifo-samples.patch
  iio-accel-adxl372-fix-push-to-buffers-lost-samples.patch
  iio-accel-adxl372-perform-a-reset-at-start-up.patch
  efivar-ssdt-don-t-iterate-over-efi-vars-if-no-ssdt-override-was-specified.patch
  efi-tpm-don-t-access-event-count-when-it-isn-t-mapped.patch
  efi-tpm-don-t-traverse-an-event-log-with-no-events.patch
  efi-tpm-only-set-efi_tpm_final_log_size-after-successful-event-log-parsing.patch
  perf-llvm-don-t-access-out-of-scope-array.patch
  perf-inject-jit-fix-jit_code_move-filename.patch
  drm-i915-perform-ggtt-restore-much-earlier-during-resume.patch
  blk-wbt-fix-performance-regression-in-wbt-scale_up-scale_down.patch
  selinux-fix-context-string-corruption-in-convert_context.patch
  io_uring-only-flush-workqueues-on-fileset-removal.patch
  cifs-gracefully-handle-queryinfo-errors-during-open.patch
  cifs-force-revalidate-inode-when-dentry-is-stale.patch
  cifs-force-reval-dentry-if-lookup_reval-flag-is-set.patch
  cifs-use-cifsinodeinfo-open_file_lock-while-iterating-to-avoid-a-panic.patch
  kernel-sysctl.c-do-not-override-max_threads-provided-by-userspace.patch
  mm-z3fold.c-claim-page-in-the-beginning-of-free.patch
  mm-page_alloc.c-fix-a-crash-in-free_pages_prepare.patch
  mm-vmpressure.c-fix-a-signedness-bug-in-vmpressure_register_event.patch
  ib-core-fix-wrong-iterating-on-ports.patch

Compile testing
---------------

We compiled the kernel for 4 architectures:

    aarch64:
      make options: -j30 INSTALL_MOD_STRIP=1 targz-pkg

    ppc64le:
      make options: -j30 INSTALL_MOD_STRIP=1 targz-pkg

    s390x:
      make options: -j30 INSTALL_MOD_STRIP=1 targz-pkg

    x86_64:
      make options: -j30 INSTALL_MOD_STRIP=1 targz-pkg


[-- Attachment #2: build-s390x.log.xz --]
[-- Type: application/x-xz, Size: 32928 bytes --]

[-- Attachment #3: build-ppc64le.log.xz --]
[-- Type: application/x-xz, Size: 70772 bytes --]

[-- Attachment #4: build-aarch64.log.xz --]
[-- Type: application/x-xz, Size: 85760 bytes --]

[-- Attachment #5: build-x86_64.log.xz --]
[-- Type: application/x-xz, Size: 83576 bytes --]

^ permalink raw reply	[flat|nested] 22+ messages in thread

* ❌ FAIL: Stable queue: queue-5.3
@ 2019-10-10 13:17 CKI Project
  0 siblings, 0 replies; 22+ messages in thread
From: CKI Project @ 2019-10-10 13:17 UTC (permalink / raw)
  To: Linux Stable maillist; +Cc: Memory Management, Jan Stancek, Zhaojuan Guo


Hello,

We ran automated tests on a patchset that was proposed for merging into this
kernel tree. The patches were applied to:

       Kernel repo: https://git.kernel.org/pub/scm/linux/kernel/git/stable/linux.git
            Commit: 52020d3f6633 - Linux 5.3.5

The results of these automated tests are provided below.

    Overall result: FAILED (see details below)
             Merge: OK
           Compile: OK
             Tests: FAILED

All kernel binaries, config files, and logs are available for download here:

  https://artifacts.cki-project.org/pipelines/215962

One or more kernel tests failed:

    x86_64:
      ❌ Boot test
      ❌ Boot test
      ❌ Boot test
      ❌ Boot test

We hope that these logs can help you find the problem quickly. For the full
detail on our testing procedures, please scroll to the bottom of this message.

Please reply to this email if you have any questions about the tests that we
ran or if you have any suggestions on how to make future tests more effective.

        ,-.   ,-.
       ( C ) ( K )  Continuous
        `-',-.`-'   Kernel
          ( I )     Integration
           `-'
______________________________________________________________________________

Merge testing
-------------

We cloned this repository and checked out the following commit:

  Repo: https://git.kernel.org/pub/scm/linux/kernel/git/stable/linux.git
  Commit: 52020d3f6633 - Linux 5.3.5


We grabbed the 0a9f51931637 commit of the stable queue repository.

We then merged the patchset with `git am`:

  s390-process-avoid-potential-reading-of-freed-stack.patch
  s390-sclp-fix-bit-checked-for-has_sipl.patch
  kvm-s390-test-for-bad-access-register-and-size-at-the-start-of-s390_mem_op.patch
  s390-topology-avoid-firing-events-before-kobjs-are-created.patch
  s390-cio-avoid-calling-strlen-on-null-pointer.patch
  s390-cio-exclude-subchannels-with-no-parent-from-pseudo-check.patch
  s390-dasd-fix-error-handling-during-online-processing.patch
  revert-s390-dasd-add-discard-support-for-ese-volumes.patch
  kvm-s390-fix-__insn32_query-inline-assembly.patch
  kvm-ppc-book3s-enable-xive-native-capability-only-if-opal-has-required-functions.patch
  kvm-ppc-book3s-hv-xive-free-escalation-interrupts-before-disabling-the-vp.patch
  kvm-ppc-book3s-hv-don-t-push-xive-context-when-not-using-xive-device.patch
  kvm-ppc-book3s-hv-fix-race-in-re-enabling-xive-escalation-interrupts.patch
  kvm-ppc-book3s-hv-check-for-mmu-ready-on-piggybacked-virtual-cores.patch
  kvm-ppc-book3s-hv-don-t-lose-pending-doorbell-request-on-migration-on-p9.patch
  kvm-x86-fix-userspace-set-invalid-cr4.patch
  nbd-fix-max-number-of-supported-devs.patch
  pm-devfreq-tegra-fix-khz-to-hz-conversion.patch
  asoc-define-a-set-of-dapm-pre-post-up-events.patch
  asoc-sgtl5000-improve-vag-power-and-mute-control.patch
  powerpc-xive-implement-get_irqchip_state-method-for-xive-to-fix-shutdown-race.patch
  powerpc-mce-fix-mce-handling-for-huge-pages.patch
  powerpc-mce-schedule-work-from-irq_work.patch
  powerpc-603-fix-handling-of-the-dirty-flag.patch
  powerpc-32s-fix-boot-failure-with-debug_pagealloc-without-kasan.patch
  powerpc-ptdump-fix-addresses-display-on-ppc32.patch
  powerpc-powernv-restrict-opal-symbol-map-to-only-be-readable-by-root.patch
  powerpc-pseries-fix-cpu_hotplug_lock-acquisition-in-resize_hpt.patch
  powerpc-powernv-ioda-fix-race-in-tce-level-allocation.patch
  powerpc-kasan-fix-parallel-loading-of-modules.patch
  powerpc-kasan-fix-shadow-area-set-up-for-modules.patch
  powerpc-book3s64-mm-don-t-do-tlbie-fixup-for-some-hardware-revisions.patch
  powerpc-book3s64-radix-rename-cpu_ftr_p9_tlbie_bug-feature-flag.patch
  powerpc-mm-add-a-helper-to-select-page_kernel_ro-or-page_readonly.patch
  powerpc-mm-fix-an-oops-in-kasan_mmu_init.patch
  powerpc-mm-fixup-tlbie-vs-mtpidr-mtlpidr-ordering-issue-on-power9.patch
  can-mcp251x-mcp251x_hw_reset-allow-more-time-after-a-reset.patch
  tools-lib-traceevent-fix-robust-test-of-do_generate_dynamic_list_file.patch
  tools-lib-traceevent-do-not-free-tep-cmdlines-in-add_new_comm-on-failure.patch
  crypto-qat-silence-smp_processor_id-warning.patch
  crypto-skcipher-unmap-pages-after-an-external-error.patch
  crypto-cavium-zip-add-missing-single_release.patch
  crypto-caam-qi-fix-error-handling-in-ern-handler.patch
  crypto-caam-fix-concurrency-issue-in-givencrypt-descriptor.patch
  crypto-ccree-account-for-tee-not-ready-to-report.patch
  crypto-ccree-use-the-full-crypt-length-value.patch
  mips-treat-loongson-extensions-as-ases.patch
  power-supply-sbs-battery-use-correct-flags-field.patch
  power-supply-sbs-battery-only-return-health-when-battery-present.patch
  tracing-make-sure-variable-reference-alias-has-correct-var_ref_idx.patch
  usercopy-avoid-highmem-pfn-warning.patch
  timer-read-jiffies-once-when-forwarding-base-clk.patch
  pci-vmd-fix-config-addressing-when-using-bus-offsets.patch
  pci-hv-avoid-use-of-hv_pci_dev-pci_slot-after-freeing-it.patch
  pci-vmd-fix-shadow-offsets-to-reflect-spec-changes.patch
  pci-restore-resizable-bar-size-bits-correctly-for-1mb-bars.patch
  selftests-tpm2-add-the-missing-test_files-assignment.patch
  selftests-pidfd-fix-undefined-reference-to-pthread_create.patch
  watchdog-imx2_wdt-fix-min-calculation-in-imx2_wdt_set_timeout.patch
  perf-tools-fix-segfault-in-cpu_cache_level__read.patch
  perf-stat-fix-a-segmentation-fault-when-using-repeat-forever.patch
  drm-i915-dp-fix-dsc-bpp-calculations-v5.patch
  drm-atomic-reject-flip_async-unconditionally.patch
  drm-atomic-take-the-atomic-toys-away-from-x.patch
  drm-mali-dp-mark-expected-switch-fall-through.patch
  drm-omap-fix-max-fclk-divider-for-omap36xx.patch
  drm-msm-dsi-fix-return-value-check-for-clk_get_parent.patch
  drm-nouveau-kms-nv50-don-t-create-mstms-for-edp-connectors.patch
  drm-amd-powerplay-change-metrics-update-period-from-1ms-to-100ms.patch
  drm-i915-gvt-update-vgpu-workload-head-pointer-correctly.patch
  drm-i915-userptr-acquire-the-page-lock-around-set_page_dirty.patch
  drm-i915-to-make-vgpu-ppgtt-notificaiton-as-atomic-operation.patch
  mac80211-keep-bhs-disabled-while-calling-drv_tx_wake_queue.patch
  mmc-tegra-implement-set_dma_mask.patch
  mmc-sdhci-improve-adma-error-reporting.patch
  mmc-sdhci-of-esdhc-set-dma-snooping-based-on-dma-coherence.patch
  mmc-sdhci-let-drivers-define-their-dma-mask.patch
  revert-locking-pvqspinlock-don-t-wait-if-vcpu-is-preempted.patch
  libnvdimm-altmap-track-namespace-boundaries-in-altmap.patch
  sched-add-__assembly__-guards-around-struct-clone_args.patch
  dts-arm-gta04-introduce-legacy-spi-cs-high-to-make-display-work-again.patch
  xen-balloon-set-pages-pageoffline-in-balloon_add_region.patch
  xen-xenbus-fix-self-deadlock-after-killing-user-process.patch
  ieee802154-atusb-fix-use-after-free-at-disconnect.patch
  nl80211-validate-beacon-head.patch
  cfg80211-validate-ssid-mbssid-element-ordering-assumption.patch
  cfg80211-initialize-on-stack-chandefs.patch
  drivers-thermal-qcom-tsens-fix-memory-leak-from-qfpr.patch
  ima-always-return-negative-code-for-error.patch
  ima-fix-freeing-ongoing-ahash_request.patch
  fs-nfs-fix-possible-null-pointer-dereferences-in-enc.patch
  xprtrdma-toggle-xprt_congested-in-xprtrdma-s-slot-me.patch
  xprtrdma-send-queue-size-grows-after-a-reconnect.patch
  9p-transport-error-uninitialized.patch
  9p-avoid-attaching-writeback_fid-on-mmap-with-type-p.patch
  xen-pci-reserve-mcfg-areas-earlier.patch
  fuse-fix-request-limit.patch
  ceph-fix-directories-inode-i_blkbits-initialization.patch
  ceph-fetch-cap_gen-under-spinlock-in-ceph_add_cap.patch
  ceph-reconnect-connection-if-session-hang-in-opening.patch
  sunrpc-rpc-level-errors-should-always-set-task-tk_rp.patch
  watchdog-aspeed-add-support-for-ast2600.patch
  netfilter-nf_tables-allow-lookups-in-dynamic-sets.patch
  drm-amdgpu-fix-kfd-related-kernel-oops-on-hawaii.patch
  drm-amdgpu-check-for-valid-number-of-registers-to-re.patch
  perf-probe-fix-to-clear-tev-nargs-in-clear_probe_tra.patch
  pnfs-ensure-we-do-clear-the-return-on-close-layout-s.patch
  sunrpc-don-t-try-to-parse-incomplete-rpc-messages.patch
  pwm-stm32-lp-add-check-in-case-requested-period-cann.patch
  selftests-seccomp-fix-build-on-older-kernels.patch
  x86-purgatory-disable-the-stackleak-gcc-plugin-for-t.patch
  ntb-point-to-right-memory-window-index.patch
  thermal-fix-use-after-free-when-unregistering-therma.patch
  thermal_hwmon-sanitize-thermal_zone-type.patch
  iommu-amd-fix-downgrading-default-page-sizes-in-allo.patch
  libnvdimm-region-initialize-bad-block-for-volatile-n.patch
  libnvdimm-fix-endian-conversion-issues.patch
  fuse-fix-memleak-in-cuse_channel_open.patch
  libnvdimm-nfit_test-fix-acpi_handle-redefinition.patch
  sched-membarrier-call-sync_core-only-before-usermode.patch
  sched-membarrier-fix-private-expedited-registration-.patch
  sched-core-fix-migration-to-invalid-cpu-in-__set_cpu.patch
  perf-build-add-detection-of-java-11-openjdk-devel-pa.patch
  include-trace-events-writeback.h-fix-wstringop-trunc.patch
  selftests-bpf-adjust-strobemeta-loop-to-satisfy-late.patch
  kernel-elfcore.c-include-proper-prototypes.patch
  libbpf-fix-false-uninitialized-variable-warning.patch
  blk-mq-move-lockdep_assert_held-into-elevator_exit.patch
  bpf-fix-bpf_event_output-re-entry-issue.patch
  net-dsa-microchip-always-set-regmap-stride-to-1.patch
  i2c-qcom-geni-disable-dma-processing-on-the-lenovo-y.patch
  perf-unwind-fix-libunwind-build-failure-on-i386-syst.patch
  mlxsw-spectrum_flower-fail-in-case-user-specifies-mu.patch
  nfp-abm-fix-memory-leak-in-nfp_abm_u32_knode_replace.patch
  drm-radeon-bail-earlier-when-radeon.cik_-si_support-.patch
  btrfs-fix-selftests-failure-due-to-uninitialized-i_m.patch
  kvm-nvmx-fix-consistency-check-on-injected-exception.patch
  tick-broadcast-hrtimer-fix-a-race-in-bc_set_next.patch
  perf-stat-reset-previous-counts-on-repeat-with-inter.patch
  riscv-avoid-interrupts-being-erroneously-enabled-in-.patch
  vfs-fix-eoverflow-testing-in-put_compat_statfs64.patch
  coresight-etm4x-use-explicit-barriers-on-enable-disable.patch
  staging-erofs-fix-an-error-handling-in-erofs_readdir.patch
  staging-erofs-some-compressed-cluster-should-be-submitted-for-corrupted-images.patch
  staging-erofs-add-two-missing-erofs_workgroup_put-for-corrupted-images.patch
  staging-erofs-avoid-endless-loop-of-invalid-lookback-distance-0.patch
  staging-erofs-detect-potential-multiref-due-to-corrupted-images.patch
  libnvdimm-prevent-nvdimm-from-requesting-key-when-se.patch

Compile testing
---------------

We compiled the kernel for 3 architectures:

    aarch64:
      make options: -j30 INSTALL_MOD_STRIP=1 targz-pkg

    ppc64le:
      make options: -j30 INSTALL_MOD_STRIP=1 targz-pkg

    x86_64:
      make options: -j30 INSTALL_MOD_STRIP=1 targz-pkg


Hardware testing
----------------
We booted each kernel and ran the following tests:

  aarch64:
      Host 1:
         ✅ Boot test
         ✅ xfstests: xfs
         ✅ selinux-policy: serge-testsuite
         ✅ lvm thinp sanity
         ✅ storage: software RAID testing
         🚧 ✅ Storage blktests

      Host 2:
         ✅ Boot test
         ✅ Podman system integration test (as root)
         ✅ Podman system integration test (as user)
         ✅ Loopdev Sanity
         ✅ jvm test suite
         ✅ AMTU (Abstract Machine Test Utility)
         ✅ Ethernet drivers sanity
         ✅ Networking socket: fuzz
         ✅ audit: audit testsuite test
         ✅ httpd: mod_ssl smoke sanity
         ✅ iotop: sanity
         ✅ tuned: tune-processes-through-perf
         ✅ Usex - version 1.9-29
         ✅ stress: stress-ng
         🚧 ✅ LTP lite
         🚧 ✅ POSIX pjd-fstest suites
         🚧 ✅ ALSA PCM loopback test
         🚧 ✅ ALSA Control (mixer) Userspace Element test
         🚧 ✅ trace: ftrace/tracer

  ppc64le:
      Host 1:
         ✅ Boot test
         ✅ xfstests: xfs
         ✅ selinux-policy: serge-testsuite
         ✅ lvm thinp sanity
         ✅ storage: software RAID testing
         🚧 ✅ Storage blktests

      Host 2:
         ✅ Boot test
         ✅ Podman system integration test (as root)
         ✅ Podman system integration test (as user)
         ✅ Loopdev Sanity
         ✅ jvm test suite
         ✅ AMTU (Abstract Machine Test Utility)
         ✅ Ethernet drivers sanity
         ✅ Networking socket: fuzz
         ✅ audit: audit testsuite test
         ✅ httpd: mod_ssl smoke sanity
         ✅ iotop: sanity
         ✅ tuned: tune-processes-through-perf
         ✅ Usex - version 1.9-29
         🚧 ✅ LTP lite
         🚧 ✅ POSIX pjd-fstest suites
         🚧 ✅ ALSA PCM loopback test
         🚧 ✅ ALSA Control (mixer) Userspace Element test
         🚧 ✅ trace: ftrace/tracer

  x86_64:
      Host 1:
         ✅ Boot test
         ✅ Podman system integration test (as root)
         ✅ Podman system integration test (as user)
         ✅ Loopdev Sanity
         ✅ jvm test suite
         ✅ AMTU (Abstract Machine Test Utility)
         ✅ Ethernet drivers sanity
         ✅ Networking socket: fuzz
         ✅ audit: audit testsuite test
         ✅ httpd: mod_ssl smoke sanity
         ✅ iotop: sanity
         ✅ tuned: tune-processes-through-perf
         ✅ pciutils: sanity smoke test
         ✅ Usex - version 1.9-29
         ✅ stress: stress-ng
         🚧 ❌ LTP lite
         🚧 ✅ POSIX pjd-fstest suites
         🚧 ✅ ALSA PCM loopback test
         🚧 ✅ ALSA Control (mixer) Userspace Element test
         🚧 ✅ trace: ftrace/tracer

      Host 2:
         ✅ Boot test
         ✅ xfstests: xfs
         ✅ selinux-policy: serge-testsuite
         ✅ lvm thinp sanity
         ✅ storage: software RAID testing
         🚧 ✅ IOMMU boot test
         🚧 ✅ Storage blktests

      Host 3:
         ❌ Boot test
         🚧 ❌ /kernel/infiniband/env_setup
         🚧 ❌ /kernel/infiniband/sanity
      Host 4:
         ❌ Boot test
         🚧 ❌ /kernel/infiniband/env_setup
         🚧 ❌ /kernel/infiniband/sanity

      Host 5:
         ❌ Boot test
         🚧 ❌ /kernel/infiniband/env_setup
         🚧 ❌ /kernel/infiniband/sanity
      Host 6:
         ❌ Boot test
         🚧 ❌ /kernel/infiniband/env_setup
         🚧 ❌ /kernel/infiniband/sanity

  Test sources: https://github.com/CKI-project/tests-beaker
    💚 Pull requests are welcome for new tests or improvements to existing tests!

Waived tests
------------
If the test run included waived tests, they are marked with 🚧. Such tests are
executed but their results are not taken into account. Tests are waived when
their results are not reliable enough, e.g. when they're just introduced or are
being fixed.


^ permalink raw reply	[flat|nested] 22+ messages in thread

* ❌ FAIL: Stable queue: queue-5.3
@ 2019-10-10  6:43 CKI Project
  0 siblings, 0 replies; 22+ messages in thread
From: CKI Project @ 2019-10-10  6:43 UTC (permalink / raw)
  To: Linux Stable maillist
  Cc: Yi Zhang, Memory Management, Jan Stancek, Zhaojuan Guo


Hello,

We ran automated tests on a patchset that was proposed for merging into this
kernel tree. The patches were applied to:

       Kernel repo: https://git.kernel.org/pub/scm/linux/kernel/git/stable/linux.git
            Commit: 52020d3f6633 - Linux 5.3.5

The results of these automated tests are provided below.

    Overall result: FAILED (see details below)
             Merge: OK
           Compile: OK
             Tests: FAILED

All kernel binaries, config files, and logs are available for download here:

  https://artifacts.cki-project.org/pipelines/215365

One or more kernel tests failed:

    x86_64:
      ❌ Boot test
      ❌ Boot test
      ❌ Boot test
      ❌ Boot test

We hope that these logs can help you find the problem quickly. For the full
detail on our testing procedures, please scroll to the bottom of this message.

Please reply to this email if you have any questions about the tests that we
ran or if you have any suggestions on how to make future tests more effective.

        ,-.   ,-.
       ( C ) ( K )  Continuous
        `-',-.`-'   Kernel
          ( I )     Integration
           `-'
______________________________________________________________________________

Merge testing
-------------

We cloned this repository and checked out the following commit:

  Repo: https://git.kernel.org/pub/scm/linux/kernel/git/stable/linux.git
  Commit: 52020d3f6633 - Linux 5.3.5


We grabbed the 2a8e073dff19 commit of the stable queue repository.

We then merged the patchset with `git am`:

  s390-process-avoid-potential-reading-of-freed-stack.patch
  s390-sclp-fix-bit-checked-for-has_sipl.patch
  kvm-s390-test-for-bad-access-register-and-size-at-the-start-of-s390_mem_op.patch
  s390-topology-avoid-firing-events-before-kobjs-are-created.patch
  s390-cio-avoid-calling-strlen-on-null-pointer.patch
  s390-cio-exclude-subchannels-with-no-parent-from-pseudo-check.patch
  s390-dasd-fix-error-handling-during-online-processing.patch
  revert-s390-dasd-add-discard-support-for-ese-volumes.patch
  kvm-s390-fix-__insn32_query-inline-assembly.patch
  kvm-ppc-book3s-enable-xive-native-capability-only-if-opal-has-required-functions.patch
  kvm-ppc-book3s-hv-xive-free-escalation-interrupts-before-disabling-the-vp.patch
  kvm-ppc-book3s-hv-don-t-push-xive-context-when-not-using-xive-device.patch
  kvm-ppc-book3s-hv-fix-race-in-re-enabling-xive-escalation-interrupts.patch
  kvm-ppc-book3s-hv-check-for-mmu-ready-on-piggybacked-virtual-cores.patch
  kvm-ppc-book3s-hv-don-t-lose-pending-doorbell-request-on-migration-on-p9.patch
  kvm-x86-fix-userspace-set-invalid-cr4.patch
  nbd-fix-max-number-of-supported-devs.patch
  pm-devfreq-tegra-fix-khz-to-hz-conversion.patch
  asoc-define-a-set-of-dapm-pre-post-up-events.patch
  asoc-sgtl5000-improve-vag-power-and-mute-control.patch
  powerpc-xive-implement-get_irqchip_state-method-for-xive-to-fix-shutdown-race.patch
  powerpc-mce-fix-mce-handling-for-huge-pages.patch
  powerpc-mce-schedule-work-from-irq_work.patch
  powerpc-603-fix-handling-of-the-dirty-flag.patch
  powerpc-32s-fix-boot-failure-with-debug_pagealloc-without-kasan.patch
  powerpc-ptdump-fix-addresses-display-on-ppc32.patch
  powerpc-powernv-restrict-opal-symbol-map-to-only-be-readable-by-root.patch
  powerpc-pseries-fix-cpu_hotplug_lock-acquisition-in-resize_hpt.patch
  powerpc-powernv-ioda-fix-race-in-tce-level-allocation.patch
  powerpc-kasan-fix-parallel-loading-of-modules.patch
  powerpc-kasan-fix-shadow-area-set-up-for-modules.patch
  powerpc-book3s64-mm-don-t-do-tlbie-fixup-for-some-hardware-revisions.patch
  powerpc-book3s64-radix-rename-cpu_ftr_p9_tlbie_bug-feature-flag.patch
  powerpc-mm-add-a-helper-to-select-page_kernel_ro-or-page_readonly.patch
  powerpc-mm-fix-an-oops-in-kasan_mmu_init.patch
  powerpc-mm-fixup-tlbie-vs-mtpidr-mtlpidr-ordering-issue-on-power9.patch
  can-mcp251x-mcp251x_hw_reset-allow-more-time-after-a-reset.patch
  tools-lib-traceevent-fix-robust-test-of-do_generate_dynamic_list_file.patch
  tools-lib-traceevent-do-not-free-tep-cmdlines-in-add_new_comm-on-failure.patch
  crypto-qat-silence-smp_processor_id-warning.patch
  crypto-skcipher-unmap-pages-after-an-external-error.patch
  crypto-cavium-zip-add-missing-single_release.patch
  crypto-caam-qi-fix-error-handling-in-ern-handler.patch
  crypto-caam-fix-concurrency-issue-in-givencrypt-descriptor.patch
  crypto-ccree-account-for-tee-not-ready-to-report.patch
  crypto-ccree-use-the-full-crypt-length-value.patch
  mips-treat-loongson-extensions-as-ases.patch
  power-supply-sbs-battery-use-correct-flags-field.patch
  power-supply-sbs-battery-only-return-health-when-battery-present.patch
  tracing-make-sure-variable-reference-alias-has-correct-var_ref_idx.patch
  usercopy-avoid-highmem-pfn-warning.patch
  timer-read-jiffies-once-when-forwarding-base-clk.patch
  pci-vmd-fix-config-addressing-when-using-bus-offsets.patch
  pci-hv-avoid-use-of-hv_pci_dev-pci_slot-after-freeing-it.patch
  pci-vmd-fix-shadow-offsets-to-reflect-spec-changes.patch
  pci-restore-resizable-bar-size-bits-correctly-for-1mb-bars.patch
  selftests-tpm2-add-the-missing-test_files-assignment.patch
  selftests-pidfd-fix-undefined-reference-to-pthread_create.patch
  watchdog-imx2_wdt-fix-min-calculation-in-imx2_wdt_set_timeout.patch
  perf-tools-fix-segfault-in-cpu_cache_level__read.patch
  perf-stat-fix-a-segmentation-fault-when-using-repeat-forever.patch
  drm-i915-dp-fix-dsc-bpp-calculations-v5.patch
  drm-atomic-reject-flip_async-unconditionally.patch
  drm-atomic-take-the-atomic-toys-away-from-x.patch
  drm-mali-dp-mark-expected-switch-fall-through.patch
  drm-omap-fix-max-fclk-divider-for-omap36xx.patch
  drm-msm-dsi-fix-return-value-check-for-clk_get_parent.patch
  drm-nouveau-kms-nv50-don-t-create-mstms-for-edp-connectors.patch
  drm-amd-powerplay-change-metrics-update-period-from-1ms-to-100ms.patch
  drm-i915-gvt-update-vgpu-workload-head-pointer-correctly.patch
  drm-i915-userptr-acquire-the-page-lock-around-set_page_dirty.patch
  drm-i915-to-make-vgpu-ppgtt-notificaiton-as-atomic-operation.patch
  mac80211-keep-bhs-disabled-while-calling-drv_tx_wake_queue.patch
  mmc-tegra-implement-set_dma_mask.patch
  mmc-sdhci-improve-adma-error-reporting.patch
  mmc-sdhci-of-esdhc-set-dma-snooping-based-on-dma-coherence.patch
  mmc-sdhci-let-drivers-define-their-dma-mask.patch
  revert-locking-pvqspinlock-don-t-wait-if-vcpu-is-preempted.patch
  libnvdimm-altmap-track-namespace-boundaries-in-altmap.patch
  sched-add-__assembly__-guards-around-struct-clone_args.patch
  dts-arm-gta04-introduce-legacy-spi-cs-high-to-make-display-work-again.patch
  xen-balloon-set-pages-pageoffline-in-balloon_add_region.patch
  xen-xenbus-fix-self-deadlock-after-killing-user-process.patch
  ieee802154-atusb-fix-use-after-free-at-disconnect.patch
  nl80211-validate-beacon-head.patch
  cfg80211-validate-ssid-mbssid-element-ordering-assumption.patch
  cfg80211-initialize-on-stack-chandefs.patch
  drivers-thermal-qcom-tsens-fix-memory-leak-from-qfpr.patch
  ima-always-return-negative-code-for-error.patch
  ima-fix-freeing-ongoing-ahash_request.patch
  fs-nfs-fix-possible-null-pointer-dereferences-in-enc.patch
  xprtrdma-toggle-xprt_congested-in-xprtrdma-s-slot-me.patch
  xprtrdma-send-queue-size-grows-after-a-reconnect.patch
  9p-transport-error-uninitialized.patch
  9p-avoid-attaching-writeback_fid-on-mmap-with-type-p.patch
  xen-pci-reserve-mcfg-areas-earlier.patch
  fuse-fix-request-limit.patch
  ceph-fix-directories-inode-i_blkbits-initialization.patch
  ceph-fetch-cap_gen-under-spinlock-in-ceph_add_cap.patch
  ceph-reconnect-connection-if-session-hang-in-opening.patch
  sunrpc-rpc-level-errors-should-always-set-task-tk_rp.patch
  watchdog-aspeed-add-support-for-ast2600.patch
  netfilter-nf_tables-allow-lookups-in-dynamic-sets.patch
  drm-amdgpu-fix-kfd-related-kernel-oops-on-hawaii.patch
  drm-amdgpu-check-for-valid-number-of-registers-to-re.patch
  perf-probe-fix-to-clear-tev-nargs-in-clear_probe_tra.patch
  pnfs-ensure-we-do-clear-the-return-on-close-layout-s.patch
  sunrpc-don-t-try-to-parse-incomplete-rpc-messages.patch
  pwm-stm32-lp-add-check-in-case-requested-period-cann.patch
  selftests-seccomp-fix-build-on-older-kernels.patch
  x86-purgatory-disable-the-stackleak-gcc-plugin-for-t.patch
  ntb-point-to-right-memory-window-index.patch
  thermal-fix-use-after-free-when-unregistering-therma.patch
  thermal_hwmon-sanitize-thermal_zone-type.patch
  iommu-amd-fix-downgrading-default-page-sizes-in-allo.patch
  libnvdimm-region-initialize-bad-block-for-volatile-n.patch
  libnvdimm-fix-endian-conversion-issues.patch
  fuse-fix-memleak-in-cuse_channel_open.patch
  libnvdimm-nfit_test-fix-acpi_handle-redefinition.patch
  sched-membarrier-call-sync_core-only-before-usermode.patch
  sched-membarrier-fix-private-expedited-registration-.patch
  sched-core-fix-migration-to-invalid-cpu-in-__set_cpu.patch
  perf-build-add-detection-of-java-11-openjdk-devel-pa.patch
  include-trace-events-writeback.h-fix-wstringop-trunc.patch
  selftests-bpf-adjust-strobemeta-loop-to-satisfy-late.patch
  kernel-elfcore.c-include-proper-prototypes.patch
  libbpf-fix-false-uninitialized-variable-warning.patch
  blk-mq-move-lockdep_assert_held-into-elevator_exit.patch
  bpf-fix-bpf_event_output-re-entry-issue.patch
  net-dsa-microchip-always-set-regmap-stride-to-1.patch
  i2c-qcom-geni-disable-dma-processing-on-the-lenovo-y.patch
  perf-unwind-fix-libunwind-build-failure-on-i386-syst.patch
  mlxsw-spectrum_flower-fail-in-case-user-specifies-mu.patch
  nfp-abm-fix-memory-leak-in-nfp_abm_u32_knode_replace.patch
  drm-radeon-bail-earlier-when-radeon.cik_-si_support-.patch
  btrfs-fix-selftests-failure-due-to-uninitialized-i_m.patch
  kvm-nvmx-fix-consistency-check-on-injected-exception.patch
  tick-broadcast-hrtimer-fix-a-race-in-bc_set_next.patch
  perf-stat-reset-previous-counts-on-repeat-with-inter.patch
  riscv-avoid-interrupts-being-erroneously-enabled-in-.patch
  vfs-fix-eoverflow-testing-in-put_compat_statfs64.patch
  coresight-etm4x-use-explicit-barriers-on-enable-disable.patch

Compile testing
---------------

We compiled the kernel for 3 architectures:

    aarch64:
      make options: -j30 INSTALL_MOD_STRIP=1 targz-pkg

    ppc64le:
      make options: -j30 INSTALL_MOD_STRIP=1 targz-pkg

    x86_64:
      make options: -j30 INSTALL_MOD_STRIP=1 targz-pkg


Hardware testing
----------------
We booted each kernel and ran the following tests:

  aarch64:

    ⚡ Internal infrastructure issues prevented one or more tests (marked
    with ⚡⚡⚡) from running on this architecture.
    This is not the fault of the kernel that was tested.

  ppc64le:
      Host 1:
         ✅ Boot test
         ✅ Podman system integration test (as root)
         ✅ Podman system integration test (as user)
         ✅ Loopdev Sanity
         ✅ jvm test suite
         ✅ AMTU (Abstract Machine Test Utility)
         ✅ Ethernet drivers sanity
         ✅ Networking socket: fuzz
         ✅ audit: audit testsuite test
         ✅ httpd: mod_ssl smoke sanity
         ✅ iotop: sanity
         ✅ tuned: tune-processes-through-perf
         ✅ Usex - version 1.9-29
         🚧 ✅ LTP lite
         🚧 ✅ POSIX pjd-fstest suites
         🚧 ✅ ALSA PCM loopback test
         🚧 ✅ ALSA Control (mixer) Userspace Element test
         🚧 ✅ trace: ftrace/tracer

      Host 2:
         ✅ Boot test
         ✅ xfstests: xfs
         ✅ selinux-policy: serge-testsuite
         ✅ lvm thinp sanity
         ✅ storage: software RAID testing
         🚧 ❌ Storage blktests

  x86_64:
      Host 1:
         ✅ Boot test
         ✅ xfstests: xfs
         ✅ selinux-policy: serge-testsuite
         ✅ lvm thinp sanity
         ✅ storage: software RAID testing
         🚧 ✅ IOMMU boot test
         🚧 ✅ Storage blktests

      Host 2:

         ⚡ Internal infrastructure issues prevented one or more tests (marked
         with ⚡⚡⚡) from running on this architecture.
         This is not the fault of the kernel that was tested.

         ✅ Boot test
         ✅ Podman system integration test (as root)
         ✅ Podman system integration test (as user)
         ✅ Loopdev Sanity
         ✅ jvm test suite
         ✅ AMTU (Abstract Machine Test Utility)
         ✅ Ethernet drivers sanity
         ✅ Networking socket: fuzz
         ✅ audit: audit testsuite test
         ✅ httpd: mod_ssl smoke sanity
         ✅ iotop: sanity
         ✅ tuned: tune-processes-through-perf
         ✅ pciutils: sanity smoke test
         ✅ Usex - version 1.9-29
         ✅ stress: stress-ng
         🚧 ❌ LTP lite
         🚧 ✅ POSIX pjd-fstest suites
         🚧 ⚡⚡⚡ ALSA PCM loopback test
         🚧 ✅ ALSA Control (mixer) Userspace Element test
         🚧 ✅ trace: ftrace/tracer

      Host 3:
         ❌ Boot test
         🚧 ❌ /kernel/infiniband/env_setup
         🚧 ❌ /kernel/infiniband/sanity
      Host 4:
         ❌ Boot test
         🚧 ❌ /kernel/infiniband/env_setup
         🚧 ❌ /kernel/infiniband/sanity

      Host 5:
         ❌ Boot test
         🚧 ❌ /kernel/infiniband/env_setup
         🚧 ❌ /kernel/infiniband/sanity
      Host 6:
         ❌ Boot test
         🚧 ❌ /kernel/infiniband/env_setup
         🚧 ❌ /kernel/infiniband/sanity

  Test sources: https://github.com/CKI-project/tests-beaker
    💚 Pull requests are welcome for new tests or improvements to existing tests!

Waived tests
------------
If the test run included waived tests, they are marked with 🚧. Such tests are
executed but their results are not taken into account. Tests are waived when
their results are not reliable enough, e.g. when they're just introduced or are
being fixed.


^ permalink raw reply	[flat|nested] 22+ messages in thread

* Re: ❌ FAIL: Stable queue: queue-5.3
  2019-10-10  1:09   ` Don Zickus
@ 2019-10-10  6:30     ` Naresh Kamboju
  2019-10-16 17:25       ` ? " Jakub Racek
  0 siblings, 1 reply; 22+ messages in thread
From: Naresh Kamboju @ 2019-10-10  6:30 UTC (permalink / raw)
  To: Don Zickus
  Cc: Sasha Levin, CKI Project, Memory Management, Jan Stancek,
	Linux Stable maillist, Zhaojuan Guo

On Thu, 10 Oct 2019 at 06:40, Don Zickus <dzickus@redhat.com> wrote:
>
> On Wed, Oct 09, 2019 at 06:44:37PM -0400, Sasha Levin wrote:
> > On Wed, Oct 09, 2019 at 06:11:40PM -0400, CKI Project wrote:
> > >
> > > Hello,
> > >
> > > We ran automated tests on a patchset that was proposed for merging into this
> > > kernel tree. The patches were applied to:
> > >
> > >       Kernel repo: https://git.kernel.org/pub/scm/linux/kernel/git/stable/linux.git
> > >            Commit: 52020d3f6633 - Linux 5.3.5
> > >
> > > The results of these automated tests are provided below.
> > >
> > >    Overall result: FAILED (see details below)
> > >             Merge: OK
> > >           Compile: OK
> > >             Tests: FAILED
> > >
> > > All kernel binaries, config files, and logs are available for download here:
> > >
> > >  https://artifacts.cki-project.org/pipelines/214657
> > >
> > > One or more kernel tests failed:
> > >
> > >    x86_64:
> > >      ❌ Boot test
> > >      ❌ Boot test
> > >      ❌ Boot test
> > >      ❌ Boot test
> >
> > Hm, I looked here:
> >
> > https://artifacts.cki-project.org/pipelines/214657/logs/x86_64_host_1_Boot_test_dmesg.log
> >
> > and here:
> >
> > https://artifacts.cki-project.org/pipelines/214657/logs/x86_64_host_2_Boot_test_dmesg.log
> >
> > but both look sane. What am I missing?
>
> I don't believe you are.  I looked at the raw beaker jobs and the x86_64
> machines passed and another set is still queued.  There is an aarch64
> machine that failed to boot.
>
> Unfortunately, I am skeptical of this result too but I would wait for the
> CKI team to triage this.

On the quick look i see

x86_64: Host 3 failed to do any testing.
Is it an infrastructure problem ?

- Naresh

^ permalink raw reply	[flat|nested] 22+ messages in thread

* Re: ❌ FAIL: Stable queue: queue-5.3
  2019-10-09 22:44 ` Sasha Levin
@ 2019-10-10  1:09   ` Don Zickus
  2019-10-10  6:30     ` Naresh Kamboju
  0 siblings, 1 reply; 22+ messages in thread
From: Don Zickus @ 2019-10-10  1:09 UTC (permalink / raw)
  To: Sasha Levin
  Cc: CKI Project, Memory Management, Jan Stancek,
	Linux Stable maillist, Zhaojuan Guo

On Wed, Oct 09, 2019 at 06:44:37PM -0400, Sasha Levin wrote:
> On Wed, Oct 09, 2019 at 06:11:40PM -0400, CKI Project wrote:
> > 
> > Hello,
> > 
> > We ran automated tests on a patchset that was proposed for merging into this
> > kernel tree. The patches were applied to:
> > 
> >       Kernel repo: https://git.kernel.org/pub/scm/linux/kernel/git/stable/linux.git
> >            Commit: 52020d3f6633 - Linux 5.3.5
> > 
> > The results of these automated tests are provided below.
> > 
> >    Overall result: FAILED (see details below)
> >             Merge: OK
> >           Compile: OK
> >             Tests: FAILED
> > 
> > All kernel binaries, config files, and logs are available for download here:
> > 
> >  https://artifacts.cki-project.org/pipelines/214657
> > 
> > One or more kernel tests failed:
> > 
> >    x86_64:
> >      ❌ Boot test
> >      ❌ Boot test
> >      ❌ Boot test
> >      ❌ Boot test
> 
> Hm, I looked here:
> 
> https://artifacts.cki-project.org/pipelines/214657/logs/x86_64_host_1_Boot_test_dmesg.log
> 
> and here:
> 
> https://artifacts.cki-project.org/pipelines/214657/logs/x86_64_host_2_Boot_test_dmesg.log
> 
> but both look sane. What am I missing?

I don't believe you are.  I looked at the raw beaker jobs and the x86_64
machines passed and another set is still queued.  There is an aarch64
machine that failed to boot.

Unfortunately, I am skeptical of this result too but I would wait for the
CKI team to triage this.

Sorry about that.

Cheers,
Don

^ permalink raw reply	[flat|nested] 22+ messages in thread

* Re: ❌ FAIL: Stable queue: queue-5.3
  2019-10-09 22:11 CKI Project
@ 2019-10-09 22:44 ` Sasha Levin
  2019-10-10  1:09   ` Don Zickus
  0 siblings, 1 reply; 22+ messages in thread
From: Sasha Levin @ 2019-10-09 22:44 UTC (permalink / raw)
  To: CKI Project
  Cc: Linux Stable maillist, Memory Management, Jan Stancek, Zhaojuan Guo

On Wed, Oct 09, 2019 at 06:11:40PM -0400, CKI Project wrote:
>
>Hello,
>
>We ran automated tests on a patchset that was proposed for merging into this
>kernel tree. The patches were applied to:
>
>       Kernel repo: https://git.kernel.org/pub/scm/linux/kernel/git/stable/linux.git
>            Commit: 52020d3f6633 - Linux 5.3.5
>
>The results of these automated tests are provided below.
>
>    Overall result: FAILED (see details below)
>             Merge: OK
>           Compile: OK
>             Tests: FAILED
>
>All kernel binaries, config files, and logs are available for download here:
>
>  https://artifacts.cki-project.org/pipelines/214657
>
>One or more kernel tests failed:
>
>    x86_64:
>      ❌ Boot test
>      ❌ Boot test
>      ❌ Boot test
>      ❌ Boot test

Hm, I looked here:

https://artifacts.cki-project.org/pipelines/214657/logs/x86_64_host_1_Boot_test_dmesg.log

and here:

https://artifacts.cki-project.org/pipelines/214657/logs/x86_64_host_2_Boot_test_dmesg.log

but both look sane. What am I missing?

-- 
Thanks,
Sasha

^ permalink raw reply	[flat|nested] 22+ messages in thread

* ❌ FAIL: Stable queue: queue-5.3
@ 2019-10-09 22:11 CKI Project
  2019-10-09 22:44 ` Sasha Levin
  0 siblings, 1 reply; 22+ messages in thread
From: CKI Project @ 2019-10-09 22:11 UTC (permalink / raw)
  To: Linux Stable maillist; +Cc: Memory Management, Jan Stancek, Zhaojuan Guo


Hello,

We ran automated tests on a patchset that was proposed for merging into this
kernel tree. The patches were applied to:

       Kernel repo: https://git.kernel.org/pub/scm/linux/kernel/git/stable/linux.git
            Commit: 52020d3f6633 - Linux 5.3.5

The results of these automated tests are provided below.

    Overall result: FAILED (see details below)
             Merge: OK
           Compile: OK
             Tests: FAILED

All kernel binaries, config files, and logs are available for download here:

  https://artifacts.cki-project.org/pipelines/214657

One or more kernel tests failed:

    x86_64:
      ❌ Boot test
      ❌ Boot test
      ❌ Boot test
      ❌ Boot test

We hope that these logs can help you find the problem quickly. For the full
detail on our testing procedures, please scroll to the bottom of this message.

Please reply to this email if you have any questions about the tests that we
ran or if you have any suggestions on how to make future tests more effective.

        ,-.   ,-.
       ( C ) ( K )  Continuous
        `-',-.`-'   Kernel
          ( I )     Integration
           `-'
______________________________________________________________________________

Merge testing
-------------

We cloned this repository and checked out the following commit:

  Repo: https://git.kernel.org/pub/scm/linux/kernel/git/stable/linux.git
  Commit: 52020d3f6633 - Linux 5.3.5


We grabbed the d2473cc15a9d commit of the stable queue repository.

We then merged the patchset with `git am`:

  s390-process-avoid-potential-reading-of-freed-stack.patch
  s390-sclp-fix-bit-checked-for-has_sipl.patch
  kvm-s390-test-for-bad-access-register-and-size-at-the-start-of-s390_mem_op.patch
  s390-topology-avoid-firing-events-before-kobjs-are-created.patch
  s390-cio-avoid-calling-strlen-on-null-pointer.patch
  s390-cio-exclude-subchannels-with-no-parent-from-pseudo-check.patch
  s390-dasd-fix-error-handling-during-online-processing.patch
  revert-s390-dasd-add-discard-support-for-ese-volumes.patch
  kvm-s390-fix-__insn32_query-inline-assembly.patch
  kvm-ppc-book3s-enable-xive-native-capability-only-if-opal-has-required-functions.patch
  kvm-ppc-book3s-hv-xive-free-escalation-interrupts-before-disabling-the-vp.patch
  kvm-ppc-book3s-hv-don-t-push-xive-context-when-not-using-xive-device.patch
  kvm-ppc-book3s-hv-fix-race-in-re-enabling-xive-escalation-interrupts.patch
  kvm-ppc-book3s-hv-check-for-mmu-ready-on-piggybacked-virtual-cores.patch
  kvm-ppc-book3s-hv-don-t-lose-pending-doorbell-request-on-migration-on-p9.patch
  kvm-x86-fix-userspace-set-invalid-cr4.patch
  nbd-fix-max-number-of-supported-devs.patch
  pm-devfreq-tegra-fix-khz-to-hz-conversion.patch
  asoc-define-a-set-of-dapm-pre-post-up-events.patch
  asoc-sgtl5000-improve-vag-power-and-mute-control.patch
  powerpc-xive-implement-get_irqchip_state-method-for-xive-to-fix-shutdown-race.patch
  powerpc-mce-fix-mce-handling-for-huge-pages.patch
  powerpc-mce-schedule-work-from-irq_work.patch
  powerpc-603-fix-handling-of-the-dirty-flag.patch
  powerpc-32s-fix-boot-failure-with-debug_pagealloc-without-kasan.patch
  powerpc-ptdump-fix-addresses-display-on-ppc32.patch
  powerpc-powernv-restrict-opal-symbol-map-to-only-be-readable-by-root.patch
  powerpc-pseries-fix-cpu_hotplug_lock-acquisition-in-resize_hpt.patch
  powerpc-powernv-ioda-fix-race-in-tce-level-allocation.patch
  powerpc-kasan-fix-parallel-loading-of-modules.patch
  powerpc-kasan-fix-shadow-area-set-up-for-modules.patch
  powerpc-book3s64-mm-don-t-do-tlbie-fixup-for-some-hardware-revisions.patch
  powerpc-book3s64-radix-rename-cpu_ftr_p9_tlbie_bug-feature-flag.patch
  powerpc-mm-add-a-helper-to-select-page_kernel_ro-or-page_readonly.patch
  powerpc-mm-fix-an-oops-in-kasan_mmu_init.patch
  powerpc-mm-fixup-tlbie-vs-mtpidr-mtlpidr-ordering-issue-on-power9.patch
  can-mcp251x-mcp251x_hw_reset-allow-more-time-after-a-reset.patch
  tools-lib-traceevent-fix-robust-test-of-do_generate_dynamic_list_file.patch
  tools-lib-traceevent-do-not-free-tep-cmdlines-in-add_new_comm-on-failure.patch
  crypto-qat-silence-smp_processor_id-warning.patch
  crypto-skcipher-unmap-pages-after-an-external-error.patch
  crypto-cavium-zip-add-missing-single_release.patch
  crypto-caam-qi-fix-error-handling-in-ern-handler.patch
  crypto-caam-fix-concurrency-issue-in-givencrypt-descriptor.patch
  crypto-ccree-account-for-tee-not-ready-to-report.patch
  crypto-ccree-use-the-full-crypt-length-value.patch
  mips-treat-loongson-extensions-as-ases.patch
  power-supply-sbs-battery-use-correct-flags-field.patch
  power-supply-sbs-battery-only-return-health-when-battery-present.patch
  tracing-make-sure-variable-reference-alias-has-correct-var_ref_idx.patch
  usercopy-avoid-highmem-pfn-warning.patch
  timer-read-jiffies-once-when-forwarding-base-clk.patch
  pci-vmd-fix-config-addressing-when-using-bus-offsets.patch
  pci-hv-avoid-use-of-hv_pci_dev-pci_slot-after-freeing-it.patch
  pci-vmd-fix-shadow-offsets-to-reflect-spec-changes.patch
  pci-restore-resizable-bar-size-bits-correctly-for-1mb-bars.patch
  selftests-tpm2-add-the-missing-test_files-assignment.patch
  selftests-pidfd-fix-undefined-reference-to-pthread_create.patch
  watchdog-imx2_wdt-fix-min-calculation-in-imx2_wdt_set_timeout.patch
  perf-tools-fix-segfault-in-cpu_cache_level__read.patch
  perf-stat-fix-a-segmentation-fault-when-using-repeat-forever.patch
  drm-i915-dp-fix-dsc-bpp-calculations-v5.patch
  drm-atomic-reject-flip_async-unconditionally.patch
  drm-atomic-take-the-atomic-toys-away-from-x.patch
  drm-mali-dp-mark-expected-switch-fall-through.patch
  drm-omap-fix-max-fclk-divider-for-omap36xx.patch
  drm-msm-dsi-fix-return-value-check-for-clk_get_parent.patch
  drm-nouveau-kms-nv50-don-t-create-mstms-for-edp-connectors.patch
  drm-amd-powerplay-change-metrics-update-period-from-1ms-to-100ms.patch
  drm-i915-gvt-update-vgpu-workload-head-pointer-correctly.patch
  drm-i915-userptr-acquire-the-page-lock-around-set_page_dirty.patch
  drm-i915-to-make-vgpu-ppgtt-notificaiton-as-atomic-operation.patch
  mac80211-keep-bhs-disabled-while-calling-drv_tx_wake_queue.patch
  mmc-tegra-implement-set_dma_mask.patch
  mmc-sdhci-improve-adma-error-reporting.patch
  mmc-sdhci-of-esdhc-set-dma-snooping-based-on-dma-coherence.patch
  mmc-sdhci-let-drivers-define-their-dma-mask.patch
  revert-locking-pvqspinlock-don-t-wait-if-vcpu-is-preempted.patch
  libnvdimm-altmap-track-namespace-boundaries-in-altmap.patch
  sched-add-__assembly__-guards-around-struct-clone_args.patch
  dts-arm-gta04-introduce-legacy-spi-cs-high-to-make-display-work-again.patch
  xen-balloon-set-pages-pageoffline-in-balloon_add_region.patch
  xen-xenbus-fix-self-deadlock-after-killing-user-process.patch
  ieee802154-atusb-fix-use-after-free-at-disconnect.patch
  nl80211-validate-beacon-head.patch
  cfg80211-validate-ssid-mbssid-element-ordering-assumption.patch
  cfg80211-initialize-on-stack-chandefs.patch
  drivers-thermal-qcom-tsens-fix-memory-leak-from-qfpr.patch
  ima-always-return-negative-code-for-error.patch
  ima-fix-freeing-ongoing-ahash_request.patch
  fs-nfs-fix-possible-null-pointer-dereferences-in-enc.patch
  xprtrdma-toggle-xprt_congested-in-xprtrdma-s-slot-me.patch
  xprtrdma-send-queue-size-grows-after-a-reconnect.patch
  9p-transport-error-uninitialized.patch
  9p-avoid-attaching-writeback_fid-on-mmap-with-type-p.patch
  xen-pci-reserve-mcfg-areas-earlier.patch
  fuse-fix-request-limit.patch
  ceph-fix-directories-inode-i_blkbits-initialization.patch
  ceph-fetch-cap_gen-under-spinlock-in-ceph_add_cap.patch
  ceph-reconnect-connection-if-session-hang-in-opening.patch
  sunrpc-rpc-level-errors-should-always-set-task-tk_rp.patch
  watchdog-aspeed-add-support-for-ast2600.patch
  netfilter-nf_tables-allow-lookups-in-dynamic-sets.patch
  drm-amdgpu-fix-kfd-related-kernel-oops-on-hawaii.patch
  drm-amdgpu-check-for-valid-number-of-registers-to-re.patch
  perf-probe-fix-to-clear-tev-nargs-in-clear_probe_tra.patch
  pnfs-ensure-we-do-clear-the-return-on-close-layout-s.patch
  sunrpc-don-t-try-to-parse-incomplete-rpc-messages.patch
  pwm-stm32-lp-add-check-in-case-requested-period-cann.patch
  selftests-seccomp-fix-build-on-older-kernels.patch
  x86-purgatory-disable-the-stackleak-gcc-plugin-for-t.patch
  ntb-point-to-right-memory-window-index.patch
  thermal-fix-use-after-free-when-unregistering-therma.patch
  thermal_hwmon-sanitize-thermal_zone-type.patch
  iommu-amd-fix-downgrading-default-page-sizes-in-allo.patch
  libnvdimm-region-initialize-bad-block-for-volatile-n.patch
  libnvdimm-fix-endian-conversion-issues.patch
  fuse-fix-memleak-in-cuse_channel_open.patch
  libnvdimm-nfit_test-fix-acpi_handle-redefinition.patch
  sched-membarrier-call-sync_core-only-before-usermode.patch
  sched-membarrier-fix-private-expedited-registration-.patch
  sched-core-fix-migration-to-invalid-cpu-in-__set_cpu.patch
  perf-build-add-detection-of-java-11-openjdk-devel-pa.patch
  include-trace-events-writeback.h-fix-wstringop-trunc.patch
  selftests-bpf-adjust-strobemeta-loop-to-satisfy-late.patch
  kernel-elfcore.c-include-proper-prototypes.patch
  libbpf-fix-false-uninitialized-variable-warning.patch
  blk-mq-move-lockdep_assert_held-into-elevator_exit.patch
  bpf-fix-bpf_event_output-re-entry-issue.patch
  net-dsa-microchip-always-set-regmap-stride-to-1.patch
  i2c-qcom-geni-disable-dma-processing-on-the-lenovo-y.patch
  perf-unwind-fix-libunwind-build-failure-on-i386-syst.patch
  mlxsw-spectrum_flower-fail-in-case-user-specifies-mu.patch
  nfp-abm-fix-memory-leak-in-nfp_abm_u32_knode_replace.patch
  drm-radeon-bail-earlier-when-radeon.cik_-si_support-.patch
  btrfs-fix-selftests-failure-due-to-uninitialized-i_m.patch
  kvm-nvmx-fix-consistency-check-on-injected-exception.patch
  tick-broadcast-hrtimer-fix-a-race-in-bc_set_next.patch
  perf-stat-reset-previous-counts-on-repeat-with-inter.patch
  riscv-avoid-interrupts-being-erroneously-enabled-in-.patch

Compile testing
---------------

We compiled the kernel for 3 architectures:

    aarch64:
      make options: -j30 INSTALL_MOD_STRIP=1 targz-pkg

    ppc64le:
      make options: -j30 INSTALL_MOD_STRIP=1 targz-pkg

    x86_64:
      make options: -j30 INSTALL_MOD_STRIP=1 targz-pkg


Hardware testing
----------------
We booted each kernel and ran the following tests:

  aarch64:
      Host 1:
         ✅ Boot test
         ✅ selinux-policy: serge-testsuite
         ✅ lvm thinp sanity
         ✅ storage: software RAID testing
         🚧 ✅ Storage blktests

      Host 2:
         ✅ Boot test
         ✅ Podman system integration test (as root)
         ✅ Podman system integration test (as user)
         ✅ Loopdev Sanity
         ✅ jvm test suite
         ✅ AMTU (Abstract Machine Test Utility)
         ✅ Ethernet drivers sanity
         ✅ Networking socket: fuzz
         ✅ audit: audit testsuite test
         ✅ httpd: mod_ssl smoke sanity
         ✅ iotop: sanity
         ✅ tuned: tune-processes-through-perf
         ✅ Usex - version 1.9-29
         ✅ stress: stress-ng
         🚧 ❌ LTP lite
         🚧 ✅ POSIX pjd-fstest suites
         🚧 ✅ ALSA PCM loopback test
         🚧 ✅ ALSA Control (mixer) Userspace Element test
         🚧 ✅ trace: ftrace/tracer

  ppc64le:
      Host 1:
         ✅ Boot test
         ✅ Podman system integration test (as root)
         ✅ Podman system integration test (as user)
         ✅ Loopdev Sanity
         ✅ jvm test suite
         ✅ AMTU (Abstract Machine Test Utility)
         ✅ Ethernet drivers sanity
         ✅ Networking socket: fuzz
         ✅ audit: audit testsuite test
         ✅ httpd: mod_ssl smoke sanity
         ✅ iotop: sanity
         ✅ tuned: tune-processes-through-perf
         ✅ Usex - version 1.9-29
         🚧 ✅ LTP lite
         🚧 ✅ POSIX pjd-fstest suites
         🚧 ✅ ALSA PCM loopback test
         🚧 ✅ ALSA Control (mixer) Userspace Element test
         🚧 ✅ trace: ftrace/tracer

      Host 2:
         ✅ Boot test
         ✅ selinux-policy: serge-testsuite
         ✅ lvm thinp sanity
         ✅ storage: software RAID testing
         🚧 ✅ Storage blktests

  x86_64:
      Host 1:
         ✅ Boot test
         ✅ Podman system integration test (as root)
         ✅ Podman system integration test (as user)
         ✅ Loopdev Sanity
         ✅ jvm test suite
         ✅ AMTU (Abstract Machine Test Utility)
         ✅ Ethernet drivers sanity
         ✅ Networking socket: fuzz
         ✅ audit: audit testsuite test
         ✅ httpd: mod_ssl smoke sanity
         ✅ iotop: sanity
         ✅ tuned: tune-processes-through-perf
         ✅ pciutils: sanity smoke test
         ✅ Usex - version 1.9-29
         ✅ stress: stress-ng
         🚧 ✅ LTP lite
         🚧 ✅ POSIX pjd-fstest suites
         🚧 ✅ ALSA PCM loopback test
         🚧 ✅ ALSA Control (mixer) Userspace Element test
         🚧 ✅ trace: ftrace/tracer

      Host 2:
         ✅ Boot test
         ✅ selinux-policy: serge-testsuite
         ✅ lvm thinp sanity
         ✅ storage: software RAID testing
         🚧 ✅ IOMMU boot test
         🚧 ✅ Storage blktests

      Host 3:
         ❌ Boot test
         🚧 ❌ /kernel/infiniband/env_setup
         🚧 ❌ /kernel/infiniband/sanity
      Host 4:
         ❌ Boot test
         🚧 ❌ /kernel/infiniband/env_setup
         🚧 ❌ /kernel/infiniband/sanity

      Host 5:
         ❌ Boot test
         🚧 ❌ /kernel/infiniband/env_setup
         🚧 ❌ /kernel/infiniband/sanity
      Host 6:
         ❌ Boot test
         🚧 ❌ /kernel/infiniband/env_setup
         🚧 ❌ /kernel/infiniband/sanity

  Test sources: https://github.com/CKI-project/tests-beaker
    💚 Pull requests are welcome for new tests or improvements to existing tests!

Waived tests
------------
If the test run included waived tests, they are marked with 🚧. Such tests are
executed but their results are not taken into account. Tests are waived when
their results are not reliable enough, e.g. when they're just introduced or are
being fixed.


^ permalink raw reply	[flat|nested] 22+ messages in thread

* ❌ FAIL: Stable queue: queue-5.3
@ 2019-10-08 19:17 " CKI Project
  0 siblings, 0 replies; 22+ messages in thread
From: CKI Project @ 2019-10-08 19:17 UTC (permalink / raw)
  To: Linux Stable maillist

[-- Attachment #1: Type: text/plain, Size: 7539 bytes --]


Hello,

We ran automated tests on a patchset that was proposed for merging into this
kernel tree. The patches were applied to:

       Kernel repo: https://git.kernel.org/pub/scm/linux/kernel/git/stable/linux.git
            Commit: 52020d3f6633 - Linux 5.3.5

The results of these automated tests are provided below.

    Overall result: FAILED (see details below)
             Merge: OK
           Compile: FAILED

All kernel binaries, config files, and logs are available for download here:

  https://artifacts.cki-project.org/pipelines/214101

We attempted to compile the kernel for multiple architectures, but the compile
failed on one or more architectures:

           aarch64: FAILED (see build-aarch64.log.xz attachment)
           ppc64le: FAILED (see build-ppc64le.log.xz attachment)
            x86_64: FAILED (see build-x86_64.log.xz attachment)

We hope that these logs can help you find the problem quickly. For the full
detail on our testing procedures, please scroll to the bottom of this message.

Please reply to this email if you have any questions about the tests that we
ran or if you have any suggestions on how to make future tests more effective.

        ,-.   ,-.
       ( C ) ( K )  Continuous
        `-',-.`-'   Kernel
          ( I )     Integration
           `-'
______________________________________________________________________________

Merge testing
-------------

We cloned this repository and checked out the following commit:

  Repo: https://git.kernel.org/pub/scm/linux/kernel/git/stable/linux.git
  Commit: 52020d3f6633 - Linux 5.3.5


We grabbed the 59cbf36cb5d9 commit of the stable queue repository.

We then merged the patchset with `git am`:

  s390-process-avoid-potential-reading-of-freed-stack.patch
  s390-sclp-fix-bit-checked-for-has_sipl.patch
  kvm-s390-test-for-bad-access-register-and-size-at-the-start-of-s390_mem_op.patch
  s390-topology-avoid-firing-events-before-kobjs-are-created.patch
  s390-cio-avoid-calling-strlen-on-null-pointer.patch
  s390-cio-exclude-subchannels-with-no-parent-from-pseudo-check.patch
  s390-dasd-fix-error-handling-during-online-processing.patch
  revert-s390-dasd-add-discard-support-for-ese-volumes.patch
  kvm-s390-fix-__insn32_query-inline-assembly.patch
  kvm-ppc-book3s-enable-xive-native-capability-only-if-opal-has-required-functions.patch
  kvm-ppc-book3s-hv-xive-free-escalation-interrupts-before-disabling-the-vp.patch
  kvm-ppc-book3s-hv-don-t-push-xive-context-when-not-using-xive-device.patch
  kvm-ppc-book3s-hv-fix-race-in-re-enabling-xive-escalation-interrupts.patch
  kvm-ppc-book3s-hv-check-for-mmu-ready-on-piggybacked-virtual-cores.patch
  kvm-ppc-book3s-hv-don-t-lose-pending-doorbell-request-on-migration-on-p9.patch
  kvm-x86-fix-userspace-set-invalid-cr4.patch
  nbd-fix-max-number-of-supported-devs.patch
  pm-devfreq-tegra-fix-khz-to-hz-conversion.patch
  asoc-define-a-set-of-dapm-pre-post-up-events.patch
  asoc-sgtl5000-improve-vag-power-and-mute-control.patch
  powerpc-xive-implement-get_irqchip_state-method-for-xive-to-fix-shutdown-race.patch
  powerpc-mce-fix-mce-handling-for-huge-pages.patch
  powerpc-mce-schedule-work-from-irq_work.patch
  powerpc-603-fix-handling-of-the-dirty-flag.patch
  powerpc-32s-fix-boot-failure-with-debug_pagealloc-without-kasan.patch
  powerpc-ptdump-fix-addresses-display-on-ppc32.patch
  powerpc-powernv-restrict-opal-symbol-map-to-only-be-readable-by-root.patch
  powerpc-pseries-fix-cpu_hotplug_lock-acquisition-in-resize_hpt.patch
  powerpc-powernv-ioda-fix-race-in-tce-level-allocation.patch
  powerpc-kasan-fix-parallel-loading-of-modules.patch
  powerpc-kasan-fix-shadow-area-set-up-for-modules.patch
  powerpc-book3s64-mm-don-t-do-tlbie-fixup-for-some-hardware-revisions.patch
  powerpc-book3s64-radix-rename-cpu_ftr_p9_tlbie_bug-feature-flag.patch
  powerpc-mm-add-a-helper-to-select-page_kernel_ro-or-page_readonly.patch
  powerpc-mm-fix-an-oops-in-kasan_mmu_init.patch
  powerpc-mm-fixup-tlbie-vs-mtpidr-mtlpidr-ordering-issue-on-power9.patch
  can-mcp251x-mcp251x_hw_reset-allow-more-time-after-a-reset.patch
  tools-lib-traceevent-fix-robust-test-of-do_generate_dynamic_list_file.patch
  tools-lib-traceevent-do-not-free-tep-cmdlines-in-add_new_comm-on-failure.patch
  crypto-qat-silence-smp_processor_id-warning.patch
  crypto-skcipher-unmap-pages-after-an-external-error.patch
  crypto-cavium-zip-add-missing-single_release.patch
  crypto-caam-qi-fix-error-handling-in-ern-handler.patch
  crypto-caam-fix-concurrency-issue-in-givencrypt-descriptor.patch
  crypto-ccree-account-for-tee-not-ready-to-report.patch
  crypto-ccree-use-the-full-crypt-length-value.patch
  mips-treat-loongson-extensions-as-ases.patch
  power-supply-sbs-battery-use-correct-flags-field.patch
  power-supply-sbs-battery-only-return-health-when-battery-present.patch
  tracing-make-sure-variable-reference-alias-has-correct-var_ref_idx.patch
  usercopy-avoid-highmem-pfn-warning.patch
  timer-read-jiffies-once-when-forwarding-base-clk.patch
  pci-vmd-fix-config-addressing-when-using-bus-offsets.patch
  pci-hv-avoid-use-of-hv_pci_dev-pci_slot-after-freeing-it.patch
  pci-vmd-fix-shadow-offsets-to-reflect-spec-changes.patch
  pci-restore-resizable-bar-size-bits-correctly-for-1mb-bars.patch
  selftests-tpm2-add-the-missing-test_files-assignment.patch
  selftests-pidfd-fix-undefined-reference-to-pthread_create.patch
  watchdog-imx2_wdt-fix-min-calculation-in-imx2_wdt_set_timeout.patch
  perf-tools-fix-segfault-in-cpu_cache_level__read.patch
  perf-stat-fix-a-segmentation-fault-when-using-repeat-forever.patch
  drm-i915-dp-fix-dsc-bpp-calculations-v5.patch
  drm-atomic-reject-flip_async-unconditionally.patch
  drm-atomic-take-the-atomic-toys-away-from-x.patch
  drm-mali-dp-mark-expected-switch-fall-through.patch
  drm-omap-fix-max-fclk-divider-for-omap36xx.patch
  drm-msm-dsi-fix-return-value-check-for-clk_get_parent.patch
  drm-nouveau-kms-nv50-don-t-create-mstms-for-edp-connectors.patch
  drm-amd-powerplay-change-metrics-update-period-from-1ms-to-100ms.patch
  drm-i915-gvt-update-vgpu-workload-head-pointer-correctly.patch
  drm-i915-userptr-acquire-the-page-lock-around-set_page_dirty.patch
  drm-i915-to-make-vgpu-ppgtt-notificaiton-as-atomic-operation.patch
  mac80211-keep-bhs-disabled-while-calling-drv_tx_wake_queue.patch
  mmc-tegra-implement-set_dma_mask.patch
  mmc-sdhci-improve-adma-error-reporting.patch
  mmc-sdhci-of-esdhc-set-dma-snooping-based-on-dma-coherence.patch
  mmc-sdhci-let-drivers-define-their-dma-mask.patch
  revert-locking-pvqspinlock-don-t-wait-if-vcpu-is-preempted.patch
  libnvdimm-altmap-track-namespace-boundaries-in-altmap.patch
  libnvdimm-prevent-nvdimm-from-requesting-key-when-security-is-disabled.patch
  sched-add-__assembly__-guards-around-struct-clone_args.patch
  dts-arm-gta04-introduce-legacy-spi-cs-high-to-make-display-work-again.patch
  xen-balloon-set-pages-pageoffline-in-balloon_add_region.patch
  xen-xenbus-fix-self-deadlock-after-killing-user-process.patch
  ieee802154-atusb-fix-use-after-free-at-disconnect.patch
  nl80211-validate-beacon-head.patch
  cfg80211-validate-ssid-mbssid-element-ordering-assumption.patch
  cfg80211-initialize-on-stack-chandefs.patch

Compile testing
---------------

We compiled the kernel for 4 architectures:

    aarch64:
      make options: -j30 INSTALL_MOD_STRIP=1 targz-pkg

    ppc64le:
      make options: -j30 INSTALL_MOD_STRIP=1 targz-pkg

    s390x:
      make options: -j30 INSTALL_MOD_STRIP=1 targz-pkg

    x86_64:
      make options: -j30 INSTALL_MOD_STRIP=1 targz-pkg


[-- Attachment #2: build-ppc64le.log.xz --]
[-- Type: application/x-xz, Size: 65796 bytes --]

[-- Attachment #3: build-aarch64.log.xz --]
[-- Type: application/x-xz, Size: 77528 bytes --]

[-- Attachment #4: build-x86_64.log.xz --]
[-- Type: application/x-xz, Size: 79576 bytes --]

^ permalink raw reply	[flat|nested] 22+ messages in thread

* ❌ FAIL: Stable queue: queue-5.3
@ 2019-10-08 19:10 CKI Project
  0 siblings, 0 replies; 22+ messages in thread
From: CKI Project @ 2019-10-08 19:10 UTC (permalink / raw)
  To: Linux Stable maillist

[-- Attachment #1: Type: text/plain, Size: 7615 bytes --]


Hello,

We ran automated tests on a patchset that was proposed for merging into this
kernel tree. The patches were applied to:

       Kernel repo: https://git.kernel.org/pub/scm/linux/kernel/git/stable/linux.git
            Commit: 52020d3f6633 - Linux 5.3.5

The results of these automated tests are provided below.

    Overall result: FAILED (see details below)
             Merge: OK
           Compile: FAILED

All kernel binaries, config files, and logs are available for download here:

  https://artifacts.cki-project.org/pipelines/214089

We attempted to compile the kernel for multiple architectures, but the compile
failed on one or more architectures:

           aarch64: FAILED (see build-aarch64.log.xz attachment)
           ppc64le: FAILED (see build-ppc64le.log.xz attachment)
            x86_64: FAILED (see build-x86_64.log.xz attachment)

We hope that these logs can help you find the problem quickly. For the full
detail on our testing procedures, please scroll to the bottom of this message.

Please reply to this email if you have any questions about the tests that we
ran or if you have any suggestions on how to make future tests more effective.

        ,-.   ,-.
       ( C ) ( K )  Continuous
        `-',-.`-'   Kernel
          ( I )     Integration
           `-'
______________________________________________________________________________

Merge testing
-------------

We cloned this repository and checked out the following commit:

  Repo: https://git.kernel.org/pub/scm/linux/kernel/git/stable/linux.git
  Commit: 52020d3f6633 - Linux 5.3.5


We grabbed the 135f0b7c29f2 commit of the stable queue repository.

We then merged the patchset with `git am`:

  s390-process-avoid-potential-reading-of-freed-stack.patch
  s390-sclp-fix-bit-checked-for-has_sipl.patch
  kvm-s390-test-for-bad-access-register-and-size-at-the-start-of-s390_mem_op.patch
  s390-topology-avoid-firing-events-before-kobjs-are-created.patch
  s390-cio-avoid-calling-strlen-on-null-pointer.patch
  s390-cio-exclude-subchannels-with-no-parent-from-pseudo-check.patch
  s390-dasd-fix-error-handling-during-online-processing.patch
  revert-s390-dasd-add-discard-support-for-ese-volumes.patch
  kvm-s390-fix-__insn32_query-inline-assembly.patch
  kvm-ppc-book3s-enable-xive-native-capability-only-if-opal-has-required-functions.patch
  kvm-ppc-book3s-hv-xive-free-escalation-interrupts-before-disabling-the-vp.patch
  kvm-ppc-book3s-hv-don-t-push-xive-context-when-not-using-xive-device.patch
  kvm-ppc-book3s-hv-fix-race-in-re-enabling-xive-escalation-interrupts.patch
  kvm-ppc-book3s-hv-check-for-mmu-ready-on-piggybacked-virtual-cores.patch
  kvm-ppc-book3s-hv-don-t-lose-pending-doorbell-request-on-migration-on-p9.patch
  kvm-x86-fix-userspace-set-invalid-cr4.patch
  nbd-fix-max-number-of-supported-devs.patch
  pm-devfreq-tegra-fix-khz-to-hz-conversion.patch
  asoc-define-a-set-of-dapm-pre-post-up-events.patch
  asoc-sgtl5000-improve-vag-power-and-mute-control.patch
  powerpc-xive-implement-get_irqchip_state-method-for-xive-to-fix-shutdown-race.patch
  powerpc-mce-fix-mce-handling-for-huge-pages.patch
  powerpc-mce-schedule-work-from-irq_work.patch
  powerpc-603-fix-handling-of-the-dirty-flag.patch
  powerpc-32s-fix-boot-failure-with-debug_pagealloc-without-kasan.patch
  powerpc-ptdump-fix-addresses-display-on-ppc32.patch
  powerpc-powernv-restrict-opal-symbol-map-to-only-be-readable-by-root.patch
  powerpc-pseries-fix-cpu_hotplug_lock-acquisition-in-resize_hpt.patch
  powerpc-powernv-ioda-fix-race-in-tce-level-allocation.patch
  powerpc-kasan-fix-parallel-loading-of-modules.patch
  powerpc-kasan-fix-shadow-area-set-up-for-modules.patch
  powerpc-book3s64-mm-don-t-do-tlbie-fixup-for-some-hardware-revisions.patch
  powerpc-book3s64-radix-rename-cpu_ftr_p9_tlbie_bug-feature-flag.patch
  powerpc-mm-add-a-helper-to-select-page_kernel_ro-or-page_readonly.patch
  powerpc-mm-fix-an-oops-in-kasan_mmu_init.patch
  powerpc-mm-fixup-tlbie-vs-mtpidr-mtlpidr-ordering-issue-on-power9.patch
  can-mcp251x-mcp251x_hw_reset-allow-more-time-after-a-reset.patch
  tools-lib-traceevent-fix-robust-test-of-do_generate_dynamic_list_file.patch
  tools-lib-traceevent-do-not-free-tep-cmdlines-in-add_new_comm-on-failure.patch
  crypto-qat-silence-smp_processor_id-warning.patch
  crypto-skcipher-unmap-pages-after-an-external-error.patch
  crypto-cavium-zip-add-missing-single_release.patch
  crypto-caam-qi-fix-error-handling-in-ern-handler.patch
  crypto-caam-fix-concurrency-issue-in-givencrypt-descriptor.patch
  crypto-ccree-account-for-tee-not-ready-to-report.patch
  crypto-ccree-use-the-full-crypt-length-value.patch
  mips-treat-loongson-extensions-as-ases.patch
  power-supply-sbs-battery-use-correct-flags-field.patch
  power-supply-sbs-battery-only-return-health-when-battery-present.patch
  tracing-make-sure-variable-reference-alias-has-correct-var_ref_idx.patch
  usercopy-avoid-highmem-pfn-warning.patch
  timer-read-jiffies-once-when-forwarding-base-clk.patch
  pci-vmd-fix-config-addressing-when-using-bus-offsets.patch
  pci-hv-avoid-use-of-hv_pci_dev-pci_slot-after-freeing-it.patch
  pci-vmd-fix-shadow-offsets-to-reflect-spec-changes.patch
  pci-restore-resizable-bar-size-bits-correctly-for-1mb-bars.patch
  selftests-tpm2-add-the-missing-test_files-assignment.patch
  selftests-pidfd-fix-undefined-reference-to-pthread_create.patch
  watchdog-imx2_wdt-fix-min-calculation-in-imx2_wdt_set_timeout.patch
  perf-tools-fix-segfault-in-cpu_cache_level__read.patch
  perf-stat-fix-a-segmentation-fault-when-using-repeat-forever.patch
  drm-i915-dp-fix-dsc-bpp-calculations-v5.patch
  drm-atomic-reject-flip_async-unconditionally.patch
  drm-atomic-take-the-atomic-toys-away-from-x.patch
  drm-mali-dp-mark-expected-switch-fall-through.patch
  drm-omap-fix-max-fclk-divider-for-omap36xx.patch
  drm-msm-dsi-fix-return-value-check-for-clk_get_parent.patch
  drm-nouveau-kms-nv50-don-t-create-mstms-for-edp-connectors.patch
  drm-amd-powerplay-change-metrics-update-period-from-1ms-to-100ms.patch
  drm-i915-gvt-update-vgpu-workload-head-pointer-correctly.patch
  drm-i915-userptr-acquire-the-page-lock-around-set_page_dirty.patch
  drm-i915-flush-extra-hard-after-writing-relocations-through-the-gtt.patch
  drm-i915-to-make-vgpu-ppgtt-notificaiton-as-atomic-operation.patch
  mac80211-keep-bhs-disabled-while-calling-drv_tx_wake_queue.patch
  mmc-tegra-implement-set_dma_mask.patch
  mmc-sdhci-improve-adma-error-reporting.patch
  mmc-sdhci-of-esdhc-set-dma-snooping-based-on-dma-coherence.patch
  mmc-sdhci-let-drivers-define-their-dma-mask.patch
  revert-locking-pvqspinlock-don-t-wait-if-vcpu-is-preempted.patch
  libnvdimm-altmap-track-namespace-boundaries-in-altmap.patch
  libnvdimm-prevent-nvdimm-from-requesting-key-when-security-is-disabled.patch
  sched-add-__assembly__-guards-around-struct-clone_args.patch
  dts-arm-gta04-introduce-legacy-spi-cs-high-to-make-display-work-again.patch
  xen-balloon-set-pages-pageoffline-in-balloon_add_region.patch
  xen-xenbus-fix-self-deadlock-after-killing-user-process.patch
  ieee802154-atusb-fix-use-after-free-at-disconnect.patch
  nl80211-validate-beacon-head.patch
  cfg80211-validate-ssid-mbssid-element-ordering-assumption.patch
  cfg80211-initialize-on-stack-chandefs.patch

Compile testing
---------------

We compiled the kernel for 4 architectures:

    aarch64:
      make options: -j30 INSTALL_MOD_STRIP=1 targz-pkg

    ppc64le:
      make options: -j30 INSTALL_MOD_STRIP=1 targz-pkg

    s390x:
      make options: -j30 INSTALL_MOD_STRIP=1 targz-pkg

    x86_64:
      make options: -j30 INSTALL_MOD_STRIP=1 targz-pkg


[-- Attachment #2: build-ppc64le.log.xz --]
[-- Type: application/x-xz, Size: 65340 bytes --]

[-- Attachment #3: build-aarch64.log.xz --]
[-- Type: application/x-xz, Size: 77968 bytes --]

[-- Attachment #4: build-x86_64.log.xz --]
[-- Type: application/x-xz, Size: 72924 bytes --]

^ permalink raw reply	[flat|nested] 22+ messages in thread

* Re: ❌ FAIL: Stable queue: queue-5.3
  2019-10-08 18:03 CKI Project
@ 2019-10-08 18:57 ` Greg KH
  0 siblings, 0 replies; 22+ messages in thread
From: Greg KH @ 2019-10-08 18:57 UTC (permalink / raw)
  To: CKI Project; +Cc: Linux Stable maillist

On Tue, Oct 08, 2019 at 02:03:35PM -0400, CKI Project wrote:
> 
> Hello,
> 
> We ran automated tests on a patchset that was proposed for merging into this
> kernel tree. The patches were applied to:
> 
>        Kernel repo: https://git.kernel.org/pub/scm/linux/kernel/git/stable/linux.git
>             Commit: 52020d3f6633 - Linux 5.3.5
> 
> The results of these automated tests are provided below.
> 
>     Overall result: FAILED (see details below)
>              Merge: OK
>            Compile: FAILED

My fault, again, your builders are faster than mine :)

Fixing this now...

^ permalink raw reply	[flat|nested] 22+ messages in thread

* ❌ FAIL: Stable queue: queue-5.3
@ 2019-10-08 18:03 CKI Project
  2019-10-08 18:57 ` Greg KH
  0 siblings, 1 reply; 22+ messages in thread
From: CKI Project @ 2019-10-08 18:03 UTC (permalink / raw)
  To: Linux Stable maillist

[-- Attachment #1: Type: text/plain, Size: 7671 bytes --]


Hello,

We ran automated tests on a patchset that was proposed for merging into this
kernel tree. The patches were applied to:

       Kernel repo: https://git.kernel.org/pub/scm/linux/kernel/git/stable/linux.git
            Commit: 52020d3f6633 - Linux 5.3.5

The results of these automated tests are provided below.

    Overall result: FAILED (see details below)
             Merge: OK
           Compile: FAILED

All kernel binaries, config files, and logs are available for download here:

  https://artifacts.cki-project.org/pipelines/214001

We attempted to compile the kernel for multiple architectures, but the compile
failed on one or more architectures:

           aarch64: FAILED (see build-aarch64.log.xz attachment)
           ppc64le: FAILED (see build-ppc64le.log.xz attachment)
            x86_64: FAILED (see build-x86_64.log.xz attachment)

We hope that these logs can help you find the problem quickly. For the full
detail on our testing procedures, please scroll to the bottom of this message.

Please reply to this email if you have any questions about the tests that we
ran or if you have any suggestions on how to make future tests more effective.

        ,-.   ,-.
       ( C ) ( K )  Continuous
        `-',-.`-'   Kernel
          ( I )     Integration
           `-'
______________________________________________________________________________

Merge testing
-------------

We cloned this repository and checked out the following commit:

  Repo: https://git.kernel.org/pub/scm/linux/kernel/git/stable/linux.git
  Commit: 52020d3f6633 - Linux 5.3.5


We grabbed the 65ceb57676c9 commit of the stable queue repository.

We then merged the patchset with `git am`:

  s390-process-avoid-potential-reading-of-freed-stack.patch
  s390-sclp-fix-bit-checked-for-has_sipl.patch
  kvm-s390-test-for-bad-access-register-and-size-at-the-start-of-s390_mem_op.patch
  s390-topology-avoid-firing-events-before-kobjs-are-created.patch
  s390-cio-avoid-calling-strlen-on-null-pointer.patch
  s390-cio-exclude-subchannels-with-no-parent-from-pseudo-check.patch
  s390-dasd-fix-error-handling-during-online-processing.patch
  revert-s390-dasd-add-discard-support-for-ese-volumes.patch
  kvm-s390-fix-__insn32_query-inline-assembly.patch
  kvm-ppc-book3s-enable-xive-native-capability-only-if-opal-has-required-functions.patch
  kvm-ppc-book3s-hv-xive-free-escalation-interrupts-before-disabling-the-vp.patch
  kvm-ppc-book3s-hv-don-t-push-xive-context-when-not-using-xive-device.patch
  kvm-ppc-book3s-hv-fix-race-in-re-enabling-xive-escalation-interrupts.patch
  kvm-ppc-book3s-hv-check-for-mmu-ready-on-piggybacked-virtual-cores.patch
  kvm-ppc-book3s-hv-don-t-lose-pending-doorbell-request-on-migration-on-p9.patch
  kvm-x86-fix-userspace-set-invalid-cr4.patch
  nbd-fix-max-number-of-supported-devs.patch
  pm-devfreq-tegra-fix-khz-to-hz-conversion.patch
  asoc-define-a-set-of-dapm-pre-post-up-events.patch
  asoc-sgtl5000-improve-vag-power-and-mute-control.patch
  powerpc-xive-implement-get_irqchip_state-method-for-xive-to-fix-shutdown-race.patch
  powerpc-mce-fix-mce-handling-for-huge-pages.patch
  powerpc-mce-schedule-work-from-irq_work.patch
  powerpc-603-fix-handling-of-the-dirty-flag.patch
  powerpc-32s-fix-boot-failure-with-debug_pagealloc-without-kasan.patch
  powerpc-ptdump-fix-addresses-display-on-ppc32.patch
  powerpc-powernv-restrict-opal-symbol-map-to-only-be-readable-by-root.patch
  powerpc-pseries-fix-cpu_hotplug_lock-acquisition-in-resize_hpt.patch
  powerpc-powernv-ioda-fix-race-in-tce-level-allocation.patch
  powerpc-kasan-fix-parallel-loading-of-modules.patch
  powerpc-kasan-fix-shadow-area-set-up-for-modules.patch
  powerpc-book3s64-mm-don-t-do-tlbie-fixup-for-some-hardware-revisions.patch
  powerpc-book3s64-radix-rename-cpu_ftr_p9_tlbie_bug-feature-flag.patch
  powerpc-mm-add-a-helper-to-select-page_kernel_ro-or-page_readonly.patch
  powerpc-mm-fix-an-oops-in-kasan_mmu_init.patch
  powerpc-mm-fixup-tlbie-vs-mtpidr-mtlpidr-ordering-issue-on-power9.patch
  can-mcp251x-mcp251x_hw_reset-allow-more-time-after-a-reset.patch
  tools-lib-traceevent-fix-robust-test-of-do_generate_dynamic_list_file.patch
  tools-lib-traceevent-do-not-free-tep-cmdlines-in-add_new_comm-on-failure.patch
  crypto-qat-silence-smp_processor_id-warning.patch
  crypto-skcipher-unmap-pages-after-an-external-error.patch
  crypto-cavium-zip-add-missing-single_release.patch
  crypto-caam-qi-fix-error-handling-in-ern-handler.patch
  crypto-caam-fix-concurrency-issue-in-givencrypt-descriptor.patch
  crypto-ccree-account-for-tee-not-ready-to-report.patch
  crypto-ccree-use-the-full-crypt-length-value.patch
  mips-treat-loongson-extensions-as-ases.patch
  power-supply-sbs-battery-use-correct-flags-field.patch
  power-supply-sbs-battery-only-return-health-when-battery-present.patch
  tracing-make-sure-variable-reference-alias-has-correct-var_ref_idx.patch
  usercopy-avoid-highmem-pfn-warning.patch
  timer-read-jiffies-once-when-forwarding-base-clk.patch
  pci-vmd-fix-config-addressing-when-using-bus-offsets.patch
  pci-hv-avoid-use-of-hv_pci_dev-pci_slot-after-freeing-it.patch
  pci-vmd-fix-shadow-offsets-to-reflect-spec-changes.patch
  pci-restore-resizable-bar-size-bits-correctly-for-1mb-bars.patch
  selftests-tpm2-add-the-missing-test_files-assignment.patch
  selftests-pidfd-fix-undefined-reference-to-pthread_create.patch
  watchdog-imx2_wdt-fix-min-calculation-in-imx2_wdt_set_timeout.patch
  perf-tools-fix-segfault-in-cpu_cache_level__read.patch
  perf-stat-fix-a-segmentation-fault-when-using-repeat-forever.patch
  drm-i915-dp-fix-dsc-bpp-calculations-v5.patch
  drm-atomic-reject-flip_async-unconditionally.patch
  drm-atomic-take-the-atomic-toys-away-from-x.patch
  drm-mali-dp-mark-expected-switch-fall-through.patch
  drm-omap-fix-max-fclk-divider-for-omap36xx.patch
  drm-msm-dsi-fix-return-value-check-for-clk_get_parent.patch
  drm-nouveau-kms-nv50-don-t-create-mstms-for-edp-connectors.patch
  drm-amd-powerplay-change-metrics-update-period-from-1ms-to-100ms.patch
  drm-i915-gvt-update-vgpu-workload-head-pointer-correctly.patch
  drm-i915-userptr-acquire-the-page-lock-around-set_page_dirty.patch
  drm-i915-use-maximum-write-flush-for-pwrite_gtt.patch
  drm-i915-flush-extra-hard-after-writing-relocations-through-the-gtt.patch
  drm-i915-to-make-vgpu-ppgtt-notificaiton-as-atomic-operation.patch
  mac80211-keep-bhs-disabled-while-calling-drv_tx_wake_queue.patch
  mmc-tegra-implement-set_dma_mask.patch
  mmc-sdhci-improve-adma-error-reporting.patch
  mmc-sdhci-of-esdhc-set-dma-snooping-based-on-dma-coherence.patch
  mmc-sdhci-let-drivers-define-their-dma-mask.patch
  revert-locking-pvqspinlock-don-t-wait-if-vcpu-is-preempted.patch
  libnvdimm-altmap-track-namespace-boundaries-in-altmap.patch
  libnvdimm-prevent-nvdimm-from-requesting-key-when-security-is-disabled.patch
  sched-add-__assembly__-guards-around-struct-clone_args.patch
  dts-arm-gta04-introduce-legacy-spi-cs-high-to-make-display-work-again.patch
  xen-balloon-set-pages-pageoffline-in-balloon_add_region.patch
  xen-xenbus-fix-self-deadlock-after-killing-user-process.patch
  ieee802154-atusb-fix-use-after-free-at-disconnect.patch
  nl80211-validate-beacon-head.patch
  cfg80211-validate-ssid-mbssid-element-ordering-assumption.patch
  cfg80211-initialize-on-stack-chandefs.patch

Compile testing
---------------

We compiled the kernel for 4 architectures:

    aarch64:
      make options: -j30 INSTALL_MOD_STRIP=1 targz-pkg

    ppc64le:
      make options: -j30 INSTALL_MOD_STRIP=1 targz-pkg

    s390x:
      make options: -j30 INSTALL_MOD_STRIP=1 targz-pkg

    x86_64:
      make options: -j30 INSTALL_MOD_STRIP=1 targz-pkg


[-- Attachment #2: build-ppc64le.log.xz --]
[-- Type: application/x-xz, Size: 65276 bytes --]

[-- Attachment #3: build-aarch64.log.xz --]
[-- Type: application/x-xz, Size: 78148 bytes --]

[-- Attachment #4: build-x86_64.log.xz --]
[-- Type: application/x-xz, Size: 76024 bytes --]

^ permalink raw reply	[flat|nested] 22+ messages in thread

* ❌ FAIL: Stable queue: queue-5.3
@ 2019-10-06  4:57 CKI Project
  0 siblings, 0 replies; 22+ messages in thread
From: CKI Project @ 2019-10-06  4:57 UTC (permalink / raw)
  To: Linux Stable maillist


Hello,

We ran automated tests on a patchset that was proposed for merging into this
kernel tree. The patches were applied to:

       Kernel repo: https://git.kernel.org/pub/scm/linux/kernel/git/stable/linux.git
            Commit: 40ce0335271a - Linux 5.3.4

The results of these automated tests are provided below.

    Overall result: FAILED (see details below)
             Merge: OK
           Compile: OK
             Tests: FAILED

All kernel binaries, config files, and logs are available for download here:

  https://artifacts.cki-project.org/pipelines/208531

One or more kernel tests failed:

    aarch64:
      ❌ Boot test

We hope that these logs can help you find the problem quickly. For the full
detail on our testing procedures, please scroll to the bottom of this message.

Please reply to this email if you have any questions about the tests that we
ran or if you have any suggestions on how to make future tests more effective.

        ,-.   ,-.
       ( C ) ( K )  Continuous
        `-',-.`-'   Kernel
          ( I )     Integration
           `-'
______________________________________________________________________________

Merge testing
-------------

We cloned this repository and checked out the following commit:

  Repo: https://git.kernel.org/pub/scm/linux/kernel/git/stable/linux.git
  Commit: 40ce0335271a - Linux 5.3.4


We grabbed the 6a00b417bec3 commit of the stable queue repository.

We then merged the patchset with `git am`:

  drm-vkms-fix-crc-worker-races.patch
  drm-mcde-fix-uninitialized-variable.patch
  drm-bridge-tc358767-increase-aux-transfer-length-lim.patch
  drm-vkms-avoid-assigning-0-for-possible_crtc.patch
  drm-panel-simple-fix-auo-g185han01-horizontal-blanki.patch
  drm-amd-display-add-monitor-patch-to-add-t7-delay.patch
  drm-amd-display-power-gate-all-dscs-at-driver-init-t.patch
  drm-amd-display-fix-not-calling-ppsmu-to-trigger-pme.patch
  drm-amd-display-clear-fec_ready-shadow-register-if-d.patch
  drm-amd-display-copy-gsl-groups-when-committing-a-ne.patch
  video-ssd1307fb-start-page-range-at-page_offset.patch
  drm-tinydrm-kconfig-drivers-select-backlight_class_d.patch
  drm-stm-attach-gem-fence-to-atomic-state.patch
  drm-bridge-sii902x-fix-missing-reference-to-mclk-clo.patch
  drm-panel-check-failure-cases-in-the-probe-func.patch
  drm-rockchip-check-for-fast-link-training-before-ena.patch
  drm-amdgpu-fix-hard-hang-for-s-g-display-bos.patch
  drm-amd-display-use-proper-enum-conversion-functions.patch
  drm-radeon-fix-eeh-during-kexec.patch
  gpu-drm-radeon-fix-a-possible-null-pointer-dereferen.patch
  clk-imx8mq-mark-ahb-clock-as-critical.patch
  pci-rpaphp-avoid-a-sometimes-uninitialized-warning.patch
  pinctrl-stmfx-update-pinconf-settings.patch
  ipmi_si-only-schedule-continuously-in-the-thread-in-.patch
  clk-qoriq-fix-wunused-const-variable.patch
  clk-ingenic-jz4740-fix-pll-half-divider-not-read-wri.patch
  clk-sunxi-ng-v3s-add-missing-clock-slices-for-mmc2-m.patch
  drm-amd-display-fix-issue-where-252-255-values-are-c.patch
  drm-amd-display-fix-frames_to_insert-math.patch
  drm-amd-display-reprogram-vm-config-when-system-resu.patch
  drm-amd-display-register-vupdate_no_lock-interrupts-.patch
  powerpc-powernv-ioda2-allocate-tce-table-levels-on-d.patch
  clk-actions-don-t-reference-clk_init_data-after-regi.patch
  clk-sirf-don-t-reference-clk_init_data-after-registr.patch
  clk-meson-axg-audio-don-t-reference-clk_init_data-af.patch
  clk-sprd-don-t-reference-clk_init_data-after-registr.patch
  clk-zx296718-don-t-reference-clk_init_data-after-reg.patch
  clk-sunxi-don-t-call-clk_hw_get_name-on-a-hw-that-is.patch
  powerpc-xmon-check-for-hv-mode-when-dumping-xive-inf.patch
  powerpc-rtas-use-device-model-apis-and-serialization.patch
  powerpc-ptdump-fix-walk_pagetables-address-mismatch.patch
  powerpc-futex-fix-warning-oldval-may-be-used-uniniti.patch
  powerpc-64s-radix-fix-memory-hotplug-section-page-ta.patch
  powerpc-pseries-mobility-use-cond_resched-when-updat.patch
  powerpc-perf-fix-imc-allocation-failure-handling.patch
  pinctrl-tegra-fix-write-barrier-placement-in-pmx_wri.patch
  powerpc-eeh-clear-stale-eeh_dev_no_handler-flag.patch
  vfio_pci-restore-original-state-on-release.patch
  drm-amdgpu-sdma5-fix-number-of-sdma5-trap-irq-types-.patch
  drm-nouveau-kms-tu102-disable-input-lut-when-input-i.patch
  drm-nouveau-volt-fix-for-some-cards-having-0-maximum.patch
  pinctrl-amd-disable-spurious-firing-gpio-irqs.patch
  clk-renesas-mstp-set-genpd_flag_always_on-for-clock-.patch
  clk-renesas-cpg-mssr-set-genpd_flag_always_on-for-cl.patch
  drm-amd-display-support-spdif.patch
  drm-amd-powerpaly-fix-navi-series-custom-peak-level-.patch
  drm-amd-display-fix-mpo-hubp-underflow-with-scatter-.patch
  drm-amd-display-fix-trigger-not-generated-for-freesy.patch
  selftests-powerpc-retry-on-host-facility-unavailable.patch
  kbuild-do-not-enable-wimplicit-fallthrough-for-clang.patch
  drm-amdgpu-si-fix-asic-tests.patch
  powerpc-64s-exception-machine-check-use-correct-cfar.patch
  pstore-fs-superblock-limits.patch
  powerpc-eeh-clean-up-eeh-pes-after-recovery-finishes.patch
  clk-qcom-gcc-sdm845-use-floor-ops-for-sdcc-clks.patch
  powerpc-pseries-correctly-track-irq-state-in-default.patch
  pinctrl-meson-gxbb-fix-wrong-pinning-definition-for-.patch
  mailbox-mediatek-cmdq-clear-the-event-in-cmdq-initia.patch
  arm-dts-dir685-drop-spi-cpol-from-the-display.patch
  arm64-fix-unreachable-code-issue-with-cmpxchg.patch
  clk-at91-select-parent-if-main-oscillator-or-bypass-.patch
  clk-imx-pll14xx-avoid-glitch-when-set-rate.patch
  clk-imx-clk-pll14xx-unbypass-pll-by-default.patch
  clk-make-clk_bulk_get_all-return-a-valid-id.patch
  powerpc-dump-kernel-log-before-carrying-out-fadump-o.patch
  mbox-qcom-add-apcs-child-device-for-qcs404.patch
  clk-sprd-add-missing-kfree.patch
  scsi-core-reduce-memory-required-for-scsi-logging.patch
  dma-buf-sw_sync-synchronize-signal-vs-syncpt-free.patch
  f2fs-fix-to-drop-meta-node-pages-during-umount.patch
  ext4-fix-potential-use-after-free-after-remounting-w.patch
  mips-ingenic-disable-broken-btb-lookup-optimization.patch
  clk-jz4740-add-tcu-clock.patch
  mips-don-t-use-bc_false-uninitialized-in-__mm_isbran.patch
  mips-tlbex-explicitly-cast-_page_no_exec-to-a-boolea.patch
  i2c-cht-wc-fix-lockdep-warning.patch
  mfd-intel-lpss-remove-d3cold-delay.patch
  pci-tegra-fix-of-node-reference-leak.patch
  hid-wacom-fix-several-minor-compiler-warnings.patch
  rtc-bd70528-fix-driver-dependencies.patch
  mips-atomic-fix-loongson_llsc_mb-wreckage.patch
  pci-pci-hyperv-fix-build-errors-on-non-sysfs-config.patch
  pci-layerscape-add-the-bar_fixed_64bit-property-to-t.patch
  livepatch-nullify-obj-mod-in-klp_module_coming-s-err.patch
  mips-atomic-fix-smp_mb__-before-after-_atomic.patch
  arm-8898-1-mm-don-t-treat-faults-reported-from-cache.patch
  soundwire-intel-fix-channel-number-reported-by-hardw.patch
  pci-mobiveil-fix-the-cpu-base-address-setup-in-inbou.patch
  arm-8875-1-kconfig-default-to-aeabi-w-clang.patch
  rtc-snvs-fix-possible-race-condition.patch
  rtc-pcf85363-pcf85263-fix-regmap-error-in-set_time.patch
  power-supply-register-hwmon-devices-with-valid-names.patch
  selinux-fix-residual-uses-of-current_security-for-th.patch
  pci-add-pci_info_ratelimited-to-ratelimit-pci-separa.patch
  hid-apple-fix-stuck-function-keys-when-using-fn.patch
  pci-rockchip-propagate-errors-for-optional-regulator.patch
  pci-histb-propagate-errors-for-optional-regulators.patch
  pci-imx6-propagate-errors-for-optional-regulators.patch
  pci-exynos-propagate-errors-for-optional-phys.patch
  security-smack-fix-possible-null-pointer-dereference.patch
  pci-use-static-const-struct-not-const-static-struct.patch
  arm-8905-1-emit-__gnu_mcount_nc-when-using-clang-10..patch
  arm-8903-1-ensure-that-usable-memory-in-bank-0-start.patch
  i2c-tegra-move-suspend-handling-to-noirq-phase.patch
  block-bfq-push-up-injection-only-after-setting-servi.patch
  fat-work-around-race-with-userspace-s-read-via-block.patch
  pktcdvd-remove-warning-on-attempting-to-register-non.patch
  hypfs-fix-error-number-left-in-struct-pointer-member.patch
  tools-power-x86-intel-speed-select-fix-high-priority.patch
  crypto-hisilicon-fix-double-free-in-sec_free_hw_sgl.patch
  mm-add-dummy-can_do_mlock-helper.patch
  kbuild-clean-compressed-initramfs-image.patch
  ocfs2-wait-for-recovering-done-after-direct-unlock-r.patch
  kmemleak-increase-debug_kmemleak_early_log_size-defa.patch
  arm64-consider-stack-randomization-for-mmap-base-onl.patch
  mips-properly-account-for-stack-randomization-and-st.patch
  arm-properly-account-for-stack-randomization-and-sta.patch
  arm-use-stack_top-when-computing-mmap-base-address.patch

Compile testing
---------------

We compiled the kernel for 3 architectures:

    aarch64:
      make options: -j30 INSTALL_MOD_STRIP=1 targz-pkg

    ppc64le:
      make options: -j30 INSTALL_MOD_STRIP=1 targz-pkg

    x86_64:
      make options: -j30 INSTALL_MOD_STRIP=1 targz-pkg


Hardware testing
----------------
We booted each kernel and ran the following tests:

  aarch64:
      Host 1:
         ✅ Boot test
         ✅ Podman system integration test (as root)
         ✅ Podman system integration test (as user)
         ✅ Loopdev Sanity
         ✅ jvm test suite
         ✅ AMTU (Abstract Machine Test Utility)
         ✅ audit: audit testsuite test
         ✅ httpd: mod_ssl smoke sanity
         ✅ iotop: sanity
         ✅ tuned: tune-processes-through-perf
         ✅ Usex - version 1.9-29
         ✅ storage: SCSI VPD
         ✅ stress: stress-ng
         🚧 ✅ LTP lite
         🚧 ✅ POSIX pjd-fstest suites

      Host 2:
         ❌ Boot test
         ⚡⚡⚡ xfstests: ext4
         ⚡⚡⚡ selinux-policy: serge-testsuite
         ⚡⚡⚡ lvm thinp sanity
         ⚡⚡⚡ storage: software RAID testing
         🚧 ⚡⚡⚡ Storage blktests

  ppc64le:
      Host 1:
         ✅ Boot test
         ✅ Podman system integration test (as root)
         ✅ Podman system integration test (as user)
         ✅ Loopdev Sanity
         ✅ jvm test suite
         ✅ AMTU (Abstract Machine Test Utility)
         ✅ audit: audit testsuite test
         ✅ httpd: mod_ssl smoke sanity
         ✅ iotop: sanity
         ✅ tuned: tune-processes-through-perf
         ✅ Usex - version 1.9-29
         🚧 ✅ LTP lite
         🚧 ✅ POSIX pjd-fstest suites

      Host 2:
         ✅ Boot test
         ✅ xfstests: ext4
         ✅ selinux-policy: serge-testsuite
         ✅ lvm thinp sanity
         ✅ storage: software RAID testing
         🚧 ✅ Storage blktests

  x86_64:
      Host 1:
         ✅ Boot test
         ✅ Podman system integration test (as root)
         ✅ Podman system integration test (as user)
         ✅ Loopdev Sanity
         ✅ jvm test suite
         ✅ AMTU (Abstract Machine Test Utility)
         ✅ audit: audit testsuite test
         ✅ httpd: mod_ssl smoke sanity
         ✅ iotop: sanity
         ✅ tuned: tune-processes-through-perf
         ✅ pciutils: sanity smoke test
         ✅ Usex - version 1.9-29
         ✅ storage: SCSI VPD
         ✅ stress: stress-ng
         🚧 ✅ LTP lite
         🚧 ✅ POSIX pjd-fstest suites

      Host 2:
         ✅ Boot test
         ✅ xfstests: ext4
         ✅ selinux-policy: serge-testsuite
         ✅ lvm thinp sanity
         ✅ storage: software RAID testing
         🚧 ✅ Storage blktests

      Host 3:
         ✅ Boot test
         🚧 ✅ IPMI driver test
         🚧 ✅ IPMItool loop stress test

  Test sources: https://github.com/CKI-project/tests-beaker
    💚 Pull requests are welcome for new tests or improvements to existing tests!

Waived tests
------------
If the test run included waived tests, they are marked with 🚧. Such tests are
executed but their results are not taken into account. Tests are waived when
their results are not reliable enough, e.g. when they're just introduced or are
being fixed.


^ permalink raw reply	[flat|nested] 22+ messages in thread

* ❌ FAIL: Stable queue: queue-5.3
@ 2019-10-01 19:25 CKI Project
  0 siblings, 0 replies; 22+ messages in thread
From: CKI Project @ 2019-10-01 19:25 UTC (permalink / raw)
  To: Linux Stable maillist

[-- Attachment #1: Type: text/plain, Size: 16366 bytes --]


Hello,

We ran automated tests on a patchset that was proposed for merging into this
kernel tree. The patches were applied to:

       Kernel repo: https://git.kernel.org/pub/scm/linux/kernel/git/stable/linux.git
            Commit: 0e7d6367ac13 - Linux 5.3.2

The results of these automated tests are provided below.

    Overall result: FAILED (see details below)
             Merge: OK
           Compile: FAILED

All kernel binaries, config files, and logs are available for download here:

  https://artifacts.cki-project.org/pipelines/199969

We attempted to compile the kernel for multiple architectures, but the compile
failed on one or more architectures:

           aarch64: FAILED (see build-aarch64.log.xz attachment)
           ppc64le: FAILED (see build-ppc64le.log.xz attachment)
             s390x: FAILED (see build-s390x.log.xz attachment)
            x86_64: FAILED (see build-x86_64.log.xz attachment)

We hope that these logs can help you find the problem quickly. For the full
detail on our testing procedures, please scroll to the bottom of this message.

Please reply to this email if you have any questions about the tests that we
ran or if you have any suggestions on how to make future tests more effective.

        ,-.   ,-.
       ( C ) ( K )  Continuous
        `-',-.`-'   Kernel
          ( I )     Integration
           `-'
______________________________________________________________________________

Merge testing
-------------

We cloned this repository and checked out the following commit:

  Repo: https://git.kernel.org/pub/scm/linux/kernel/git/stable/linux.git
  Commit: 0e7d6367ac13 - Linux 5.3.2


We grabbed the 575863b28c5c commit of the stable queue repository.

We then merged the patchset with `git am`:

  arcnet-provide-a-buffer-big-enough-to-actually-receive-packets.patch
  cdc_ncm-fix-divide-by-zero-caused-by-invalid-wmaxpacketsize.patch
  ipv6-do-not-free-rt-if-fib_lookup_noref-is-set-on-suppress-rule.patch
  macsec-drop-skb-sk-before-calling-gro_cells_receive.patch
  net-phy-fix-dp83865-10-mbps-hdx-loopback-disable-function.patch
  net-qrtr-stop-rx_worker-before-freeing-node.patch
  net-sched-act_sample-don-t-push-mac-header-on-ip6gre-ingress.patch
  net_sched-add-max-len-check-for-tca_kind.patch
  net-stmmac-fix-page-pool-size.patch
  nfp-flower-fix-memory-leak-in-nfp_flower_spawn_vnic_reprs.patch
  nfp-flower-prevent-memory-leak-in-nfp_flower_spawn_phy_reprs.patch
  openvswitch-change-type-of-upcall_pid-attribute-to-nla_unspec.patch
  ppp-fix-memory-leak-in-ppp_write.patch
  sch_netem-fix-a-divide-by-zero-in-tabledist.patch
  selftests-update-fib_tests-to-handle-missing-ping6.patch
  skge-fix-checksum-byte-order.patch
  tcp_bbr-fix-quantization-code-to-not-raise-cwnd-if-not-probing-bandwidth.patch
  usbnet-ignore-endpoints-with-invalid-wmaxpacketsize.patch
  usbnet-sanity-checking-of-packet-sizes-and-device-mtu.patch
  net-rds-check-laddr_check-before-calling-it.patch
  net-mlx5e-fix-matching-on-tunnel-addresses-type.patch
  ipv6-fix-a-typo-in-fib6_rule_lookup.patch
  selftests-update-fib_nexthop_multiprefix-to-handle-missing-ping6.patch
  net-phy-micrel-add-asym-pause-workaround-for-ksz9021.patch
  net-sched-cbs-fix-not-adding-cbs-instance-to-list.patch
  ipv4-revert-removal-of-rt_uses_gateway.patch
  net_sched-add-policy-validation-for-action-attributes.patch
  vrf-do-not-attempt-to-create-ipv6-mcast-rule-if-ipv6-is-disabled.patch
  net-mlx5e-fix-traffic-duplication-in-ethtool-steering.patch
  net-sched-fix-possible-crash-in-tcf_action_destroy.patch
  tcp-better-handle-tcp_user_timeout-in-syn_sent-state.patch
  net-mlx5-add-device-id-of-upcoming-bluefield-2.patch
  misdn-enforce-cap_net_raw-for-raw-sockets.patch
  appletalk-enforce-cap_net_raw-for-raw-sockets.patch
  ax25-enforce-cap_net_raw-for-raw-sockets.patch
  ieee802154-enforce-cap_net_raw-for-raw-sockets.patch
  nfc-enforce-cap_net_raw-for-raw-sockets.patch
  alsa-hda-flush-interrupts-on-disabling.patch
  asoc-sof-intel-hda-make-hdac_device-device-managed.patch
  cpufreq-ap806-add-null-check-after-kcalloc.patch
  alsa-hda-hdmi-don-t-report-spurious-jack-state-chang.patch
  regulator-lm363x-fix-off-by-one-n_voltages-for-lm363.patch
  regulator-lm363x-fix-n_voltages-setting-for-lm36274.patch
  spi-dw-mmio-clock-should-be-shut-when-error-occurs.patch
  asoc-tlv320aic31xx-suppress-error-message-for-eprobe.patch
  asoc-sgtl5000-fix-of-unmute-outputs-on-probe.patch
  asoc-sgtl5000-fix-charge-pump-source-assignment.patch
  firmware-qcom_scm-use-proper-types-for-dma-mappings.patch
  dmaengine-bcm2835-print-error-in-case-setting-dma-ma.patch
  leds-leds-lp5562-allow-firmware-files-up-to-the-maxi.patch
  asoc-sof-reset-dma-state-in-prepare.patch
  media-dib0700-fix-link-error-for-dibx000_i2c_set_spe.patch
  media-mtk-cir-lower-de-glitch-counter-for-rc-mm-prot.patch
  asoc-sof-pci-mark-last_busy-value-at-runtime-pm-init.patch
  media-exynos4-is-fix-leaked-of_node-references.patch
  media-vivid-add-sanity-check-to-avoid-divide-error-a.patch
  media-vb2-reorder-checks-in-vb2_poll.patch
  media-vivid-work-around-high-stack-usage-with-clang.patch
  media-hdpvr-add-device-num-check-and-handling.patch
  media-i2c-ov5640-check-for-devm_gpiod_get_optional-e.patch
  time-tick-broadcast-fix-tick_broadcast_offline-lockd.patch
  sched-fair-fix-imbalance-due-to-cpu-affinity.patch
  sched-core-fix-cpu-controller-for-rt_group_sched.patch
  x86-apic-make-apic_pending_intr_clear-more-robust.patch
  sched-deadline-fix-bandwidth-accounting-at-all-level.patch
  x86-reboot-always-use-nmi-fallback-when-shutdown-via.patch
  rcu-tree-call-setschedule-gp-ktread-to-sched_fifo-ou.patch
  x86-apic-soft-disable-apic-before-initializing-it.patch
  alsa-hda-show-the-fatal-corb-rirb-error-more-clearly.patch
  alsa-i2c-ak4xxx-adda-fix-a-possible-null-pointer-der.patch
  rcu-add-destroy_work_on_stack-to-match-init_work_ons.patch
  edac-mc-fix-grain_bits-calculation.patch
  arm64-dts-imx8mq-correct-opp-table-according-to-late.patch
  media-iguanair-add-sanity-checks.patch
  cpuidle-teo-allow-tick-to-be-stopped-if-pm-qos-is-us.patch
  gpio-madera-add-support-for-cirrus-logic-cs47l15.patch
  gpio-madera-add-support-for-cirrus-logic-cs47l92.patch
  arm64-mm-free-the-initrd-reserved-memblock-in-a-alig.patch
  soc-amlogic-meson-clk-measure-protect-measure-with-a.patch
  base-soc-export-soc_device_register-unregister-apis.patch
  alsa-usb-audio-skip-bsynchaddress-endpoint-check-if-.patch
  ia64-unwind-fix-double-free-for-mod-arch.init_unw_ta.patch
  edac-altera-use-the-proper-type-for-the-irq-status-b.patch
  asoc-rsnd-don-t-call-clk_get_rate-under-atomic-conte.patch
  arm64-prefetch-fix-a-wtype-limits-warning.patch
  md-raid1-end-bio-when-the-device-faulty.patch
  md-don-t-call-spare_active-in-md_reap_sync_thread-if.patch
  md-don-t-set-in_sync-if-array-is-frozen.patch
  media-media-platform-fsl-viu.c-fix-build-for-microbl.patch
  media-staging-tegra-vde-fix-build-error.patch
  ras-fix-prototype-warnings.patch
  ras-build-debugfs.o-only-when-enabled-in-kconfig.patch
  asoc-hdac_hda-fix-page-fault-issue-by-removing-race.patch
  acpi-processor-don-t-print-errors-for-processorids-0.patch
  loop-add-loop_set_direct_io-to-compat-ioctl.patch
  perf-tools-fix-paths-in-include-statements.patch
  edac-pnd2-fix-ioremap-size-in-dnv_rd_reg.patch
  efi-cper-print-aer-info-of-pcie-fatal-error.patch
  firmware-arm_scmi-check-if-platform-has-released-shm.patch
  sched-fair-use-rq_lock-unlock-in-online_fair_sched_g.patch
  idle-prevent-late-arriving-interrupts-from-disruptin.patch
  blk-mq-fix-memory-leak-in-blk_mq_init_allocated_queu.patch
  media-gspca-zero-usb_buf-on-error.patch
  perf-config-honour-perf_config-env-var-to-specify-al.patch
  perf-test-vfs_getname-disable-.perfconfig-to-get-def.patch
  media-mtk-mdp-fix-reference-count-on-old-device-tree.patch
  media-i2c-tda1997x-prevent-potential-null-pointer-ac.patch
  media-fdp1-reduce-fcp-not-found-message-level-to-deb.patch
  media-em28xx-modules-workqueue-not-inited-for-2nd-de.patch
  arm64-efi-move-variable-assignments-after-sections.patch
  perf-unwind-fix-libunwind-when-tid-pid.patch
  media-rc-imon-allow-imon-rc-protocol-for-ffdc-7e-dev.patch
  dmaengine-iop-adma-use-correct-printk-format-strings.patch
  arm-xscale-fix-multi-cpu-compilation.patch
  perf-ftrace-use-cap_sys_admin-instead-of-euid-0.patch
  perf-record-support-aarch64-random-socket_id-assignm.patch
  media-vsp1-fix-memory-leak-of-dl-on-error-return-pat.patch
  media-i2c-ov5645-fix-power-sequence.patch
  media-omap3isp-don-t-set-streaming-state-on-random-s.patch
  media-imx-mipi-csi-2-don-t-fail-if-initial-state-tim.patch
  kasan-arm64-fix-config_kasan_sw_tags-kasan_inline.patch
  net-lpc-enet-fix-printk-format-strings.patch
  m68k-prevent-some-compiler-warnings-in-coldfire-buil.patch
  arm-dts-imx7d-cl-som-imx7-make-ethernet-work-again.patch
  arm64-dts-qcom-qcs404-evb-mark-wcss-clocks-protected.patch
  arm-dts-imx7-colibri-disable-hs400.patch
  x86-platform-intel-iosf_mbi-rewrite-locking.patch
  media-radio-si470x-kill-urb-on-error.patch
  media-hdpvr-add-terminating-0-at-end-of-string.patch
  asoc-uniphier-fix-double-reset-assersion-when-transi.patch
  powerpc-makefile-always-pass-synthetic-to-nm-if-supp.patch
  tools-headers-fixup-bitsperlong-per-arch-includes.patch
  asoc-sun4i-i2s-don-t-use-the-oversample-to-calculate.patch
  asoc-mchp-i2s-mcc-wait-for-rx-tx-rdy-only-if-control.patch
  led-triggers-fix-a-memory-leak-bug.patch
  asoc-mchp-i2s-mcc-fix-unprepare-of-gclk.patch
  nbd-add-missing-config-put.patch
  acpi-apei-release-resources-if-gen_pool_add-fails.patch
  arm64-entry-move-ct_user_exit-before-any-other-excep.patch
  s390-kasan-provide-uninstrumented-__strlen.patch
  media-mceusb-fix-eliminate-tx-ir-signal-length-limit.patch
  media-dvb-frontends-use-ida-for-pll-number.patch
  posix-cpu-timers-sanitize-bogus-warnons.patch
  media-dvb-core-fix-a-memory-leak-bug.patch
  edac-amd64-support-more-than-two-controllers-for-chi.patch
  cpufreq-imx-cpufreq-dt-add-i.mx8mn-support.patch
  libperf-fix-alignment-trap-with-xyarray-contents-in-.patch
  edac-amd64-recognize-dram-device-type-ecc-capability.patch
  edac-amd64-decode-syndrome-before-translating-addres.patch
  arm-at91-move-platform-specific-asm-offset.h-to-arch.patch
  soc-renesas-rmobile-sysc-set-genpd_flag_always_on-fo.patch
  soc-renesas-enable-arm_errata_754322-for-affected-co.patch
  pm-devfreq-fix-kernel-oops-on-governor-module-load.patch
  arm-omap2-move-platform-specific-asm-offset.h-to-arc.patch
  pm-devfreq-passive-use-non-devm-notifiers.patch
  pm-devfreq-exynos-bus-correct-clock-enable-sequence.patch
  media-cec-notifier-clear-cec_adap-in-cec_notifier_un.patch
  media-saa7146-add-cleanup-in-hexium_attach.patch
  media-cpia2_usb-fix-memory-leaks.patch
  media-saa7134-fix-terminology-around-saa7134_i2c_eep.patch
  perf-trace-beauty-ioctl-fix-off-by-one-error-in-cmd-.patch
  perf-report-fix-ns-time-sort-key-output.patch
  perf-script-fix-memory-leaks-in-list_scripts.patch
  media-aspeed-video-address-a-protential-usage-of-an-.patch
  media-ov9650-add-a-sanity-check.patch
  leds-lm3532-fixes-for-the-driver-for-stability.patch
  asoc-es8316-fix-headphone-mixer-volume-table.patch
  acpi-cppc-do-not-require-the-_psd-method.patch
  sched-cpufreq-align-trace-event-behavior-of-fast-swi.patch
  arm64-dts-meson-fix-boards-regulators-states-format.patch
  x86-apic-vector-warn-when-vector-space-exhaustion-br.patch
  arm64-kpti-ensure-patched-kernel-text-is-fetched-fro.patch
  perf-evlist-use-unshare-clone_fs-in-sb-threads-to-le.patch
  arm64-use-correct-ll-sc-atomic-constraints.patch
  jump_label-don-t-warn-on-__exit-jump-entries.patch
  x86-mm-pti-do-not-invoke-pti-functions-when-pti-is-d.patch
  asoc-fsl_ssi-fix-clock-control-issue-in-master-mode.patch
  x86-mm-pti-handle-unaligned-address-gracefully-in-pt.patch
  nvmet-fix-data-units-read-and-written-counters-in-sm.patch
  nvme-multipath-fix-ana-log-nsid-lookup-when-nsid-is-.patch
  alsa-firewire-motu-add-support-for-motu-4pre.patch
  iommu-amd-silence-warnings-under-memory-pressure.patch
  asoc-intel-haswell-adjust-machine-device-private-con.patch
  libata-ahci-drop-pcs-quirk-for-denverton-and-beyond.patch
  iommu-iova-avoid-false-sharing-on-fq_timer_on.patch
  libtraceevent-change-users-plugin-directory.patch
  asoc-dt-bindings-sun4i-spdif-fix-dma-names-warning.patch
  arm-dts-exynos-mark-ldo10-as-always-on-on-peach-pit-.patch
  x86-amd_nb-add-pci-device-ids-for-family-17h-model-7.patch
  acpi-custom_method-fix-memory-leaks.patch
  acpi-pci-fix-acpi_pci_irq_enable-memory-leak.patch
  closures-fix-a-race-on-wakeup-from-closure_sync.patch
  hwmon-k10temp-add-support-for-amd-family-17h-model-7.patch
  hwmon-acpi_power_meter-change-log-level-for-unsafe-s.patch
  md-raid1-fail-run-raid1-array-when-active-disk-less-.patch
  dmaengine-ti-edma-do-not-reset-reserved-param-slots.patch
  kprobes-prohibit-probing-on-bug-and-warn-address.patch
  x86-mm-fix-cpumask_of_node-error-condition.patch
  irqchip-sifive-plic-set-max-threshold-for-ignored-ha.patch
  s390-crypto-xts-aes-s390-fix-extra-run-time-crypto-s.patch
  irqchip-gic-v3-its-fix-lpi-release-for-multi-msi-dev.patch
  x86-cpu-add-tiger-lake-to-intel-family.patch
  platform-x86-intel_pmc_core-do-not-ioremap-ram.patch
  platform-x86-intel_pmc_core_pltdrv-module-removal-wa.patch
  soc-simple-card-utils-set-0hz-to-sysclk-when-shutdow.patch
  asoc-dmaengine-make-the-pcm-name-equal-to-pcm-id-if-.patch
  tools-power-x86-intel-speed-select-fix-memory-leak.patch
  spi-bcm2835-work-around-done-bit-erratum.patch
  io_uring-fix-wrong-sequence-setting-logic.patch
  block-make-rq-sector-size-accessible-for-block-stats.patch
  raid5-don-t-set-stripe_handle-to-stripe-which-is-in-.patch
  mmc-core-clarify-sdio_irq_pending-flag-for-mmc_cap2_.patch
  sched-psi-correct-overly-pessimistic-size-calculatio.patch
  mmc-sdhci-fix-incorrect-switch-to-hs-mode.patch
  mmc-core-add-helper-function-to-indicate-if-sdio-irq.patch
  mmc-dw_mmc-re-store-sdio-irqs-mask-at-system-resume.patch
  raid5-don-t-increment-read_errors-on-eilseq-return.patch
  mmc-mtk-sd-re-store-sdio-irqs-mask-at-system-resume.patch
  libertas-add-missing-sentinel-at-end-of-if_usb.c-fw_.patch
  e1000e-add-workaround-for-possible-stalled-packet.patch
  alsa-hda-add-a-quirk-model-for-fixing-huawei-mateboo.patch
  alsa-hda-drop-unsol-event-handler-for-intel-hdmi-cod.patch
  drm-amd-powerplay-smu7-enforce-minimal-vbitimeout-v2.patch
  media-ttusb-dec-fix-info-leak-in-ttusb_dec_send_comm.patch
  drm-fix-module-name-in-edid_firmware-log-message.patch
  alsa-hda-realtek-blacklist-pc-beep-for-lenovo-thinkc.patch
  iommu-amd-override-wrong-ivrs-ioapic-on-raven-ridge-.patch
  zd1211rw-remove-false-assertion-from-zd_mac_clear.patch
  btrfs-delayed-inode-kill-the-bug_on-in-btrfs_delete_.patch
  btrfs-extent-tree-make-sure-we-only-allocate-extents.patch
  btrfs-tree-checker-add-root_item-check.patch
  btrfs-detect-unbalanced-tree-with-empty-leaf-before-.patch
  kvm-nested-kvm-mmus-need-pae-root-too.patch
  media-omap3isp-set-device-on-omap3isp-subdevs.patch
  pm-devfreq-passive-fix-compiler-warning.patch
  arm-dts-logicpd-torpedo-baseboard-fix-missing-video.patch
  arm-omap2plus_defconfig-fix-missing-video.patch
  iwlwifi-fw-don-t-send-geo_tx_power_limit-command-to-fw-version-36.patch
  alsa-firewire-tascam-handle-error-code-when-getting-current-source-of-clock.patch
  alsa-firewire-tascam-check-intermediate-state-of-clock-status-and-retry.patch
  scsi-implement-.cleanup_rq-callback.patch
  scsi-scsi_dh_rdac-zero-cdb-in-send_mode_select.patch
  scsi-qla2xxx-fix-relogin-to-prevent-modifying-scan_state-flag.patch
  printk-do-not-lose-last-line-in-kmsg-buffer-dump.patch
  ib-mlx5-free-mpi-in-mp_slave-mode.patch
  ib-hfi1-define-variables-as-unsigned-long-to-fix-kasan-warning.patch
  ib-hfi1-do-not-update-hcrc-for-a-kdeth-packet-during-fault-injection.patch
  rdma-fix-double-free-in-srq-creation-error-flow.patch
  randstruct-check-member-structs-in-is_pure_ops_struct.patch

Compile testing
---------------

We compiled the kernel for 4 architectures:

    aarch64:
      make options: -j30 INSTALL_MOD_STRIP=1 targz-pkg

    ppc64le:
      make options: -j30 INSTALL_MOD_STRIP=1 targz-pkg

    s390x:
      make options: -j30 INSTALL_MOD_STRIP=1 targz-pkg

    x86_64:
      make options: -j30 INSTALL_MOD_STRIP=1 targz-pkg


[-- Attachment #2: build-s390x.log.xz --]
[-- Type: application/x-xz, Size: 31288 bytes --]

[-- Attachment #3: build-ppc64le.log.xz --]
[-- Type: application/x-xz, Size: 69092 bytes --]

[-- Attachment #4: build-aarch64.log.xz --]
[-- Type: application/x-xz, Size: 83056 bytes --]

[-- Attachment #5: build-x86_64.log.xz --]
[-- Type: application/x-xz, Size: 83228 bytes --]

^ permalink raw reply	[flat|nested] 22+ messages in thread

* Re: ❌ FAIL: Stable queue: queue-5.3
  2019-10-01 18:32 CKI Project
@ 2019-10-01 19:19 ` Greg KH
  0 siblings, 0 replies; 22+ messages in thread
From: Greg KH @ 2019-10-01 19:19 UTC (permalink / raw)
  To: CKI Project; +Cc: Linux Stable maillist

On Tue, Oct 01, 2019 at 02:32:36PM -0400, CKI Project wrote:
> 
> Hello,
> 
> We ran automated tests on a patchset that was proposed for merging into this
> kernel tree. The patches were applied to:
> 
>        Kernel repo: https://git.kernel.org/pub/scm/linux/kernel/git/stable/linux.git
>             Commit: 0e7d6367ac13 - Linux 5.3.2
> 
> The results of these automated tests are provided below.
> 
>     Overall result: FAILED (see details below)
>              Merge: OK
>            Compile: FAILED
> 
> All kernel binaries, config files, and logs are available for download here:
> 
>   https://artifacts.cki-project.org/pipelines/199890
> 
> We attempted to compile the kernel for multiple architectures, but the compile
> failed on one or more architectures:
> 
>            aarch64: FAILED (see build-aarch64.log.xz attachment)
>            ppc64le: FAILED (see build-ppc64le.log.xz attachment)
>              s390x: FAILED (see build-s390x.log.xz attachment)
>             x86_64: FAILED (see build-x86_64.log.xz attachment)

My fault, should now be fixed, sorry.

greg k-h

^ permalink raw reply	[flat|nested] 22+ messages in thread

* ❌ FAIL: Stable queue: queue-5.3
@ 2019-10-01 18:32 CKI Project
  2019-10-01 19:19 ` Greg KH
  0 siblings, 1 reply; 22+ messages in thread
From: CKI Project @ 2019-10-01 18:32 UTC (permalink / raw)
  To: Linux Stable maillist

[-- Attachment #1: Type: text/plain, Size: 16427 bytes --]


Hello,

We ran automated tests on a patchset that was proposed for merging into this
kernel tree. The patches were applied to:

       Kernel repo: https://git.kernel.org/pub/scm/linux/kernel/git/stable/linux.git
            Commit: 0e7d6367ac13 - Linux 5.3.2

The results of these automated tests are provided below.

    Overall result: FAILED (see details below)
             Merge: OK
           Compile: FAILED

All kernel binaries, config files, and logs are available for download here:

  https://artifacts.cki-project.org/pipelines/199890

We attempted to compile the kernel for multiple architectures, but the compile
failed on one or more architectures:

           aarch64: FAILED (see build-aarch64.log.xz attachment)
           ppc64le: FAILED (see build-ppc64le.log.xz attachment)
             s390x: FAILED (see build-s390x.log.xz attachment)
            x86_64: FAILED (see build-x86_64.log.xz attachment)

We hope that these logs can help you find the problem quickly. For the full
detail on our testing procedures, please scroll to the bottom of this message.

Please reply to this email if you have any questions about the tests that we
ran or if you have any suggestions on how to make future tests more effective.

        ,-.   ,-.
       ( C ) ( K )  Continuous
        `-',-.`-'   Kernel
          ( I )     Integration
           `-'
______________________________________________________________________________

Merge testing
-------------

We cloned this repository and checked out the following commit:

  Repo: https://git.kernel.org/pub/scm/linux/kernel/git/stable/linux.git
  Commit: 0e7d6367ac13 - Linux 5.3.2


We grabbed the 9e9ce0618c8c commit of the stable queue repository.

We then merged the patchset with `git am`:

  arcnet-provide-a-buffer-big-enough-to-actually-receive-packets.patch
  cdc_ncm-fix-divide-by-zero-caused-by-invalid-wmaxpacketsize.patch
  ipv6-do-not-free-rt-if-fib_lookup_noref-is-set-on-suppress-rule.patch
  macsec-drop-skb-sk-before-calling-gro_cells_receive.patch
  net-phy-fix-dp83865-10-mbps-hdx-loopback-disable-function.patch
  net-qrtr-stop-rx_worker-before-freeing-node.patch
  net-sched-act_sample-don-t-push-mac-header-on-ip6gre-ingress.patch
  net_sched-add-max-len-check-for-tca_kind.patch
  net-stmmac-fix-page-pool-size.patch
  nfp-flower-fix-memory-leak-in-nfp_flower_spawn_vnic_reprs.patch
  nfp-flower-prevent-memory-leak-in-nfp_flower_spawn_phy_reprs.patch
  openvswitch-change-type-of-upcall_pid-attribute-to-nla_unspec.patch
  ppp-fix-memory-leak-in-ppp_write.patch
  sch_netem-fix-a-divide-by-zero-in-tabledist.patch
  selftests-update-fib_tests-to-handle-missing-ping6.patch
  skge-fix-checksum-byte-order.patch
  tcp_bbr-fix-quantization-code-to-not-raise-cwnd-if-not-probing-bandwidth.patch
  usbnet-ignore-endpoints-with-invalid-wmaxpacketsize.patch
  usbnet-sanity-checking-of-packet-sizes-and-device-mtu.patch
  net-rds-check-laddr_check-before-calling-it.patch
  net-mlx5e-fix-matching-on-tunnel-addresses-type.patch
  ipv6-fix-a-typo-in-fib6_rule_lookup.patch
  selftests-update-fib_nexthop_multiprefix-to-handle-missing-ping6.patch
  net-phy-micrel-add-asym-pause-workaround-for-ksz9021.patch
  net-sched-cbs-fix-not-adding-cbs-instance-to-list.patch
  ipv4-revert-removal-of-rt_uses_gateway.patch
  net_sched-add-policy-validation-for-action-attributes.patch
  vrf-do-not-attempt-to-create-ipv6-mcast-rule-if-ipv6-is-disabled.patch
  net-mlx5e-fix-traffic-duplication-in-ethtool-steering.patch
  net-sched-fix-possible-crash-in-tcf_action_destroy.patch
  tcp-better-handle-tcp_user_timeout-in-syn_sent-state.patch
  net-mlx5-add-device-id-of-upcoming-bluefield-2.patch
  misdn-enforce-cap_net_raw-for-raw-sockets.patch
  appletalk-enforce-cap_net_raw-for-raw-sockets.patch
  ax25-enforce-cap_net_raw-for-raw-sockets.patch
  ieee802154-enforce-cap_net_raw-for-raw-sockets.patch
  nfc-enforce-cap_net_raw-for-raw-sockets.patch
  alsa-hda-flush-interrupts-on-disabling.patch
  asoc-sof-intel-hda-make-hdac_device-device-managed.patch
  cpufreq-ap806-add-null-check-after-kcalloc.patch
  alsa-hda-hdmi-don-t-report-spurious-jack-state-chang.patch
  regulator-lm363x-fix-off-by-one-n_voltages-for-lm363.patch
  regulator-lm363x-fix-n_voltages-setting-for-lm36274.patch
  spi-dw-mmio-clock-should-be-shut-when-error-occurs.patch
  asoc-tlv320aic31xx-suppress-error-message-for-eprobe.patch
  asoc-sgtl5000-fix-of-unmute-outputs-on-probe.patch
  asoc-sgtl5000-fix-charge-pump-source-assignment.patch
  firmware-qcom_scm-use-proper-types-for-dma-mappings.patch
  dmaengine-bcm2835-print-error-in-case-setting-dma-ma.patch
  leds-leds-lp5562-allow-firmware-files-up-to-the-maxi.patch
  asoc-sof-reset-dma-state-in-prepare.patch
  media-dib0700-fix-link-error-for-dibx000_i2c_set_spe.patch
  media-mtk-cir-lower-de-glitch-counter-for-rc-mm-prot.patch
  asoc-sof-pci-mark-last_busy-value-at-runtime-pm-init.patch
  media-exynos4-is-fix-leaked-of_node-references.patch
  media-vivid-add-sanity-check-to-avoid-divide-error-a.patch
  media-vb2-reorder-checks-in-vb2_poll.patch
  media-vivid-work-around-high-stack-usage-with-clang.patch
  media-hdpvr-add-device-num-check-and-handling.patch
  media-i2c-ov5640-check-for-devm_gpiod_get_optional-e.patch
  time-tick-broadcast-fix-tick_broadcast_offline-lockd.patch
  sched-fair-fix-imbalance-due-to-cpu-affinity.patch
  sched-core-fix-cpu-controller-for-rt_group_sched.patch
  x86-apic-make-apic_pending_intr_clear-more-robust.patch
  sched-deadline-fix-bandwidth-accounting-at-all-level.patch
  x86-reboot-always-use-nmi-fallback-when-shutdown-via.patch
  rcu-tree-call-setschedule-gp-ktread-to-sched_fifo-ou.patch
  x86-apic-soft-disable-apic-before-initializing-it.patch
  alsa-hda-show-the-fatal-corb-rirb-error-more-clearly.patch
  alsa-i2c-ak4xxx-adda-fix-a-possible-null-pointer-der.patch
  rcu-add-destroy_work_on_stack-to-match-init_work_ons.patch
  edac-mc-fix-grain_bits-calculation.patch
  arm64-dts-imx8mq-correct-opp-table-according-to-late.patch
  media-iguanair-add-sanity-checks.patch
  cpuidle-teo-allow-tick-to-be-stopped-if-pm-qos-is-us.patch
  gpio-madera-add-support-for-cirrus-logic-cs47l15.patch
  gpio-madera-add-support-for-cirrus-logic-cs47l92.patch
  arm64-mm-free-the-initrd-reserved-memblock-in-a-alig.patch
  soc-amlogic-meson-clk-measure-protect-measure-with-a.patch
  base-soc-export-soc_device_register-unregister-apis.patch
  alsa-usb-audio-skip-bsynchaddress-endpoint-check-if-.patch
  ia64-unwind-fix-double-free-for-mod-arch.init_unw_ta.patch
  edac-altera-use-the-proper-type-for-the-irq-status-b.patch
  asoc-rsnd-don-t-call-clk_get_rate-under-atomic-conte.patch
  arm64-prefetch-fix-a-wtype-limits-warning.patch
  md-raid1-end-bio-when-the-device-faulty.patch
  md-don-t-call-spare_active-in-md_reap_sync_thread-if.patch
  md-don-t-set-in_sync-if-array-is-frozen.patch
  media-media-platform-fsl-viu.c-fix-build-for-microbl.patch
  media-staging-tegra-vde-fix-build-error.patch
  ras-fix-prototype-warnings.patch
  ras-build-debugfs.o-only-when-enabled-in-kconfig.patch
  asoc-hdac_hda-fix-page-fault-issue-by-removing-race.patch
  acpi-processor-don-t-print-errors-for-processorids-0.patch
  loop-add-loop_set_direct_io-to-compat-ioctl.patch
  perf-tools-fix-paths-in-include-statements.patch
  edac-pnd2-fix-ioremap-size-in-dnv_rd_reg.patch
  efi-cper-print-aer-info-of-pcie-fatal-error.patch
  firmware-arm_scmi-check-if-platform-has-released-shm.patch
  sched-fair-use-rq_lock-unlock-in-online_fair_sched_g.patch
  idle-prevent-late-arriving-interrupts-from-disruptin.patch
  blk-mq-fix-memory-leak-in-blk_mq_init_allocated_queu.patch
  media-gspca-zero-usb_buf-on-error.patch
  perf-config-honour-perf_config-env-var-to-specify-al.patch
  perf-test-vfs_getname-disable-.perfconfig-to-get-def.patch
  media-mtk-mdp-fix-reference-count-on-old-device-tree.patch
  media-i2c-tda1997x-prevent-potential-null-pointer-ac.patch
  media-fdp1-reduce-fcp-not-found-message-level-to-deb.patch
  media-em28xx-modules-workqueue-not-inited-for-2nd-de.patch
  arm64-efi-move-variable-assignments-after-sections.patch
  perf-unwind-fix-libunwind-when-tid-pid.patch
  media-rc-imon-allow-imon-rc-protocol-for-ffdc-7e-dev.patch
  dmaengine-iop-adma-use-correct-printk-format-strings.patch
  arm-xscale-fix-multi-cpu-compilation.patch
  perf-ftrace-use-cap_sys_admin-instead-of-euid-0.patch
  perf-record-support-aarch64-random-socket_id-assignm.patch
  media-vsp1-fix-memory-leak-of-dl-on-error-return-pat.patch
  media-i2c-ov5645-fix-power-sequence.patch
  media-omap3isp-don-t-set-streaming-state-on-random-s.patch
  media-imx-mipi-csi-2-don-t-fail-if-initial-state-tim.patch
  kasan-arm64-fix-config_kasan_sw_tags-kasan_inline.patch
  net-lpc-enet-fix-printk-format-strings.patch
  m68k-prevent-some-compiler-warnings-in-coldfire-buil.patch
  arm-dts-imx7d-cl-som-imx7-make-ethernet-work-again.patch
  arm64-dts-qcom-qcs404-evb-mark-wcss-clocks-protected.patch
  arm-dts-imx7-colibri-disable-hs400.patch
  x86-platform-intel-iosf_mbi-rewrite-locking.patch
  media-radio-si470x-kill-urb-on-error.patch
  media-hdpvr-add-terminating-0-at-end-of-string.patch
  asoc-uniphier-fix-double-reset-assersion-when-transi.patch
  powerpc-makefile-always-pass-synthetic-to-nm-if-supp.patch
  tools-headers-fixup-bitsperlong-per-arch-includes.patch
  asoc-sun4i-i2s-don-t-use-the-oversample-to-calculate.patch
  asoc-mchp-i2s-mcc-wait-for-rx-tx-rdy-only-if-control.patch
  led-triggers-fix-a-memory-leak-bug.patch
  asoc-mchp-i2s-mcc-fix-unprepare-of-gclk.patch
  nbd-add-missing-config-put.patch
  acpi-apei-release-resources-if-gen_pool_add-fails.patch
  arm64-entry-move-ct_user_exit-before-any-other-excep.patch
  s390-kasan-provide-uninstrumented-__strlen.patch
  media-mceusb-fix-eliminate-tx-ir-signal-length-limit.patch
  media-dvb-frontends-use-ida-for-pll-number.patch
  posix-cpu-timers-sanitize-bogus-warnons.patch
  media-dvb-core-fix-a-memory-leak-bug.patch
  edac-amd64-support-more-than-two-controllers-for-chi.patch
  cpufreq-imx-cpufreq-dt-add-i.mx8mn-support.patch
  libperf-fix-alignment-trap-with-xyarray-contents-in-.patch
  edac-amd64-recognize-dram-device-type-ecc-capability.patch
  edac-amd64-decode-syndrome-before-translating-addres.patch
  arm-at91-move-platform-specific-asm-offset.h-to-arch.patch
  soc-renesas-rmobile-sysc-set-genpd_flag_always_on-fo.patch
  soc-renesas-enable-arm_errata_754322-for-affected-co.patch
  pm-devfreq-fix-kernel-oops-on-governor-module-load.patch
  arm-omap2-move-platform-specific-asm-offset.h-to-arc.patch
  pm-devfreq-passive-use-non-devm-notifiers.patch
  pm-devfreq-exynos-bus-correct-clock-enable-sequence.patch
  media-cec-notifier-clear-cec_adap-in-cec_notifier_un.patch
  media-saa7146-add-cleanup-in-hexium_attach.patch
  media-cpia2_usb-fix-memory-leaks.patch
  media-saa7134-fix-terminology-around-saa7134_i2c_eep.patch
  perf-trace-beauty-ioctl-fix-off-by-one-error-in-cmd-.patch
  perf-report-fix-ns-time-sort-key-output.patch
  perf-script-fix-memory-leaks-in-list_scripts.patch
  media-aspeed-video-address-a-protential-usage-of-an-.patch
  media-ov9650-add-a-sanity-check.patch
  leds-lm3532-fixes-for-the-driver-for-stability.patch
  asoc-es8316-fix-headphone-mixer-volume-table.patch
  acpi-cppc-do-not-require-the-_psd-method.patch
  sched-cpufreq-align-trace-event-behavior-of-fast-swi.patch
  arm64-dts-meson-fix-boards-regulators-states-format.patch
  x86-apic-vector-warn-when-vector-space-exhaustion-br.patch
  arm64-kpti-ensure-patched-kernel-text-is-fetched-fro.patch
  perf-evlist-use-unshare-clone_fs-in-sb-threads-to-le.patch
  arm64-use-correct-ll-sc-atomic-constraints.patch
  jump_label-don-t-warn-on-__exit-jump-entries.patch
  x86-mm-pti-do-not-invoke-pti-functions-when-pti-is-d.patch
  asoc-fsl_ssi-fix-clock-control-issue-in-master-mode.patch
  x86-mm-pti-handle-unaligned-address-gracefully-in-pt.patch
  nvmet-fix-data-units-read-and-written-counters-in-sm.patch
  nvme-multipath-fix-ana-log-nsid-lookup-when-nsid-is-.patch
  alsa-firewire-motu-add-support-for-motu-4pre.patch
  arm64-lse-make-arm64_lse_atomics-depend-on-jump_labe.patch
  iommu-amd-silence-warnings-under-memory-pressure.patch
  asoc-intel-haswell-adjust-machine-device-private-con.patch
  libata-ahci-drop-pcs-quirk-for-denverton-and-beyond.patch
  iommu-iova-avoid-false-sharing-on-fq_timer_on.patch
  libtraceevent-change-users-plugin-directory.patch
  asoc-dt-bindings-sun4i-spdif-fix-dma-names-warning.patch
  arm-dts-exynos-mark-ldo10-as-always-on-on-peach-pit-.patch
  x86-amd_nb-add-pci-device-ids-for-family-17h-model-7.patch
  acpi-custom_method-fix-memory-leaks.patch
  acpi-pci-fix-acpi_pci_irq_enable-memory-leak.patch
  closures-fix-a-race-on-wakeup-from-closure_sync.patch
  hwmon-k10temp-add-support-for-amd-family-17h-model-7.patch
  hwmon-acpi_power_meter-change-log-level-for-unsafe-s.patch
  md-raid1-fail-run-raid1-array-when-active-disk-less-.patch
  dmaengine-ti-edma-do-not-reset-reserved-param-slots.patch
  kprobes-prohibit-probing-on-bug-and-warn-address.patch
  x86-mm-fix-cpumask_of_node-error-condition.patch
  irqchip-sifive-plic-set-max-threshold-for-ignored-ha.patch
  s390-crypto-xts-aes-s390-fix-extra-run-time-crypto-s.patch
  irqchip-gic-v3-its-fix-lpi-release-for-multi-msi-dev.patch
  x86-cpu-add-tiger-lake-to-intel-family.patch
  platform-x86-intel_pmc_core-do-not-ioremap-ram.patch
  platform-x86-intel_pmc_core_pltdrv-module-removal-wa.patch
  soc-simple-card-utils-set-0hz-to-sysclk-when-shutdow.patch
  asoc-dmaengine-make-the-pcm-name-equal-to-pcm-id-if-.patch
  tools-power-x86-intel-speed-select-fix-memory-leak.patch
  spi-bcm2835-work-around-done-bit-erratum.patch
  io_uring-fix-wrong-sequence-setting-logic.patch
  block-make-rq-sector-size-accessible-for-block-stats.patch
  raid5-don-t-set-stripe_handle-to-stripe-which-is-in-.patch
  mmc-core-clarify-sdio_irq_pending-flag-for-mmc_cap2_.patch
  sched-psi-correct-overly-pessimistic-size-calculatio.patch
  mmc-sdhci-fix-incorrect-switch-to-hs-mode.patch
  mmc-core-add-helper-function-to-indicate-if-sdio-irq.patch
  mmc-dw_mmc-re-store-sdio-irqs-mask-at-system-resume.patch
  raid5-don-t-increment-read_errors-on-eilseq-return.patch
  mmc-mtk-sd-re-store-sdio-irqs-mask-at-system-resume.patch
  libertas-add-missing-sentinel-at-end-of-if_usb.c-fw_.patch
  e1000e-add-workaround-for-possible-stalled-packet.patch
  alsa-hda-add-a-quirk-model-for-fixing-huawei-mateboo.patch
  alsa-hda-drop-unsol-event-handler-for-intel-hdmi-cod.patch
  drm-amd-powerplay-smu7-enforce-minimal-vbitimeout-v2.patch
  media-ttusb-dec-fix-info-leak-in-ttusb_dec_send_comm.patch
  drm-fix-module-name-in-edid_firmware-log-message.patch
  alsa-hda-realtek-blacklist-pc-beep-for-lenovo-thinkc.patch
  iommu-amd-override-wrong-ivrs-ioapic-on-raven-ridge-.patch
  zd1211rw-remove-false-assertion-from-zd_mac_clear.patch
  btrfs-delayed-inode-kill-the-bug_on-in-btrfs_delete_.patch
  btrfs-extent-tree-make-sure-we-only-allocate-extents.patch
  btrfs-tree-checker-add-root_item-check.patch
  btrfs-detect-unbalanced-tree-with-empty-leaf-before-.patch
  kvm-nested-kvm-mmus-need-pae-root-too.patch
  media-omap3isp-set-device-on-omap3isp-subdevs.patch
  pm-devfreq-passive-fix-compiler-warning.patch
  arm-dts-logicpd-torpedo-baseboard-fix-missing-video.patch
  arm-omap2plus_defconfig-fix-missing-video.patch
  iwlwifi-fw-don-t-send-geo_tx_power_limit-command-to-fw-version-36.patch
  alsa-firewire-tascam-handle-error-code-when-getting-current-source-of-clock.patch
  alsa-firewire-tascam-check-intermediate-state-of-clock-status-and-retry.patch
  scsi-implement-.cleanup_rq-callback.patch
  scsi-scsi_dh_rdac-zero-cdb-in-send_mode_select.patch
  scsi-qla2xxx-fix-relogin-to-prevent-modifying-scan_state-flag.patch
  printk-do-not-lose-last-line-in-kmsg-buffer-dump.patch
  ib-mlx5-free-mpi-in-mp_slave-mode.patch
  ib-hfi1-define-variables-as-unsigned-long-to-fix-kasan-warning.patch
  ib-hfi1-do-not-update-hcrc-for-a-kdeth-packet-during-fault-injection.patch
  rdma-fix-double-free-in-srq-creation-error-flow.patch
  randstruct-check-member-structs-in-is_pure_ops_struct.patch

Compile testing
---------------

We compiled the kernel for 4 architectures:

    aarch64:
      make options: -j30 INSTALL_MOD_STRIP=1 targz-pkg

    ppc64le:
      make options: -j30 INSTALL_MOD_STRIP=1 targz-pkg

    s390x:
      make options: -j30 INSTALL_MOD_STRIP=1 targz-pkg

    x86_64:
      make options: -j30 INSTALL_MOD_STRIP=1 targz-pkg


[-- Attachment #2: build-s390x.log.xz --]
[-- Type: application/x-xz, Size: 32052 bytes --]

[-- Attachment #3: build-ppc64le.log.xz --]
[-- Type: application/x-xz, Size: 70104 bytes --]

[-- Attachment #4: build-aarch64.log.xz --]
[-- Type: application/x-xz, Size: 82876 bytes --]

[-- Attachment #5: build-x86_64.log.xz --]
[-- Type: application/x-xz, Size: 83476 bytes --]

^ permalink raw reply	[flat|nested] 22+ messages in thread

end of thread, back to index

Thread overview: 22+ messages (download: mbox.gz / follow: Atom feed)
-- links below jump to the message on this page --
2019-10-10 10:26 ❌ FAIL: Stable queue: queue-5.3 CKI Project
2019-10-10 10:51 ` Veronika Kabatova
  -- strict thread matches above, loose matches on Subject: below --
2019-10-16 14:03 CKI Project
2019-10-16 13:56 CKI Project
2019-10-15 22:30 CKI Project
2019-10-15  6:39 CKI Project
2019-10-15  4:49 CKI Project
2019-10-10 13:17 CKI Project
2019-10-10  6:43 CKI Project
2019-10-09 22:11 CKI Project
2019-10-09 22:44 ` Sasha Levin
2019-10-10  1:09   ` Don Zickus
2019-10-10  6:30     ` Naresh Kamboju
2019-10-16 17:25       ` ? " Jakub Racek
2019-10-08 19:17  " CKI Project
2019-10-08 19:10 CKI Project
2019-10-08 18:03 CKI Project
2019-10-08 18:57 ` Greg KH
2019-10-06  4:57 CKI Project
2019-10-01 19:25 CKI Project
2019-10-01 18:32 CKI Project
2019-10-01 19:19 ` Greg KH

Stable Archive on lore.kernel.org

Archives are clonable:
	git clone --mirror https://lore.kernel.org/stable/0 stable/git/0.git

	# If you have public-inbox 1.1+ installed, you may
	# initialize and index your mirror using the following commands:
	public-inbox-init -V2 stable stable/ https://lore.kernel.org/stable \
		stable@vger.kernel.org stable@archiver.kernel.org
	public-inbox-index stable

Example config snippet for mirrors

Newsgroup available over NNTP:
	nntp://nntp.lore.kernel.org/org.kernel.vger.stable


AGPL code for this site: git clone https://public-inbox.org/ public-inbox