stable.vger.kernel.org archive mirror
 help / color / mirror / Atom feed
 messages from 2021-11-16 18:15:36 to 2021-11-17 21:32:16 UTC [more...]

[PATCH 5.15 000/923] 5.15.3-rc3 review
 2021-11-17 21:32 UTC  (10+ messages)

[PATCH] KVM: x86: check PIR even for vCPUs with disabled APICv
 2021-11-17 21:10 UTC  (2+ messages)

stable-rc/queue/4.9 build: 187 builds: 3 failed, 184 passed, 2 errors, 37 warnings (v4.9.290-159-gc2e93e98e6478)
 2021-11-17 20:49 UTC 

stable-rc/queue/5.14 baseline: 102 runs, 1 regressions (v5.14.18-857-g3166c34d4645)
 2021-11-17 20:45 UTC 

[PATCH v2] hugetlb, userfaultfd: Fix reservation restore on userfaultfd error
 2021-11-17 20:44 UTC  (2+ messages)

stable-rc/queue/4.14 build: 174 builds: 3 failed, 171 passed, 2 errors, 34 warnings (v4.14.255-197-ga09e356b405d)
 2021-11-17 20:37 UTC 

[PATCH 5.10 000/569] 5.10.80-rc4 review
 2021-11-17 20:35 UTC  (6+ messages)

[PATCH 5.10 000/577] 5.10.80-rc3 review
 2021-11-17 20:32 UTC  (3+ messages)

[PATCH] Bluetooth: btusb: Add support for TP-Link UB500 Adapter
 2021-11-17 20:27 UTC  (7+ messages)

stable-rc/queue/5.10 baseline: 151 runs, 2 regressions (v5.10.79-569-g7cba82f768816)
 2021-11-17 20:22 UTC 

[PATCH v2] bus: mhi: Fix race while handling SYS_ERR at power up
 2021-11-17 20:20 UTC  (4+ messages)

stable-rc/queue/5.10 build: 183 builds: 3 failed, 180 passed, 4 errors, 13 warnings (v5.10.79-569-g878c6aeb961b)
 2021-11-17 20:12 UTC 

stable-rc/queue/4.4 build: 182 builds: 5 failed, 177 passed, 6 errors, 35 warnings (v4.4.292-113-g6228095756d3)
 2021-11-17 20:02 UTC 

stable-rc/linux-5.10.y build: 165 builds: 3 failed, 162 passed, 4 errors, 13 warnings (v5.10.79-570-g087abd07310fe)
 2021-11-17 19:44 UTC 

stable-rc/queue/4.19 baseline: 137 runs, 1 regressions (v4.19.217-250-gcb36871725fe)
 2021-11-17 19:44 UTC 

Inclusion request for mainline commit d3c4b6f64ad356c0d9ddbcf73fa471e6a841cc5c
 2021-11-17 19:27 UTC 

stable-rc/queue/4.9 build: 185 builds: 3 failed, 182 passed, 2 errors, 37 warnings (v4.9.290-158-g1c9ba0d60284)
 2021-11-17 19:26 UTC 

[PATCH] remoteproc: qcom: pas: Add missing power-domain "mxc" for CDSP
 2021-11-17 18:57 UTC  (2+ messages)

Boot issue on x86_64: kernel 5.15.2 - RIP: 0010:__unwind_start+0x10b/0x1e0
 2021-11-17 18:27 UTC 

[PATCH stable 4.9] net: mdio-mux: fix unbalanced put_device
 2021-11-17 18:20 UTC  (2+ messages)

[PATCH 5.4] ext4: fix lazy initialization next schedule time computation in more granular unit
 2021-11-17 18:02 UTC  (2+ messages)

[PATCH 5.4] MIPS: Fix assembly error from MIPSr2 code used within MIPS_ISA_ARCH_LEVEL
 2021-11-17 17:59 UTC  (2+ messages)

[PATCH 0/2] scsi/ufs: Cherry-pick 2 fixes for null pointer into 5.4.y only
 2021-11-17 17:58 UTC  (5+ messages)
` [PATCH 1/2] scsi: ufs: Fix interrupt error message for shared interrupts
` [PATCH 2/2] scsi: ufs: Fix tm request when non-fatal error happens

Please apply commit 19221e308302 ("soc/tegra: pmc: Fix imbalanced clock ...") to v5.4.y
 2021-11-17 17:54 UTC  (2+ messages)

s390 build failures in v4.9.y.queue, v4.14.y.queue
 2021-11-17 17:53 UTC  (2+ messages)

FAILED: patch "[PATCH] s390/mm: validate VMA in PGSTE manipulation functions" failed to apply to 4.14-stable tree
 2021-11-17 17:52 UTC 

FAILED: patch "[PATCH] s390/kvm: support collaborative memory management" failed to apply to 4.14-stable tree
 2021-11-17 17:50 UTC 

FAILED: patch "[PATCH] s390/kvm: support collaborative memory management" failed to apply to 4.9-stable tree
 2021-11-17 17:50 UTC 

stable-rc/queue/4.14 build: 177 builds: 2 failed, 175 passed, 2 errors, 32 warnings (v4.14.255-199-g07b05cbc7a1c)
 2021-11-17 17:35 UTC 

stable-rc/queue/5.14 build: 175 builds: 4 failed, 171 passed, 14 errors, 7 warnings (v5.14.18-857-g3166c34d4645)
 2021-11-17 17:17 UTC 

stable-rc/queue/5.10 build: 168 builds: 2 failed, 166 passed, 4 errors, 13 warnings (v5.10.79-569-g7cba82f768816)
 2021-11-17 16:53 UTC 

stable-rc/queue/5.15 build: 176 builds: 5 failed, 171 passed, 14 errors, 5 warnings (v5.15.2-923-g96f2934af86a)
 2021-11-17 16:25 UTC 

stable-rc/queue/4.19 build: 193 builds: 6 failed, 187 passed, 2 errors, 38 warnings (v4.19.217-250-gcb36871725fe)
 2021-11-17 16:15 UTC 

[PATCH v2] xen: don't continue xenstore initialization in case of errors
 2021-11-17 16:05 UTC  (4+ messages)

[PATCH 5.15 000/927] 5.15.3-rc2 review
 2021-11-17 16:05 UTC  (14+ messages)

stable/linux-5.14.y build: 160 builds: 2 failed, 158 passed, 11 errors, 7 warnings (v5.14.19)
 2021-11-17 15:56 UTC 

stable-rc/queue/4.4 baseline: 87 runs, 1 regressions (v4.4.292-113-gecc196609cf4)
 2021-11-17 15:38 UTC 

stable-rc/linux-5.14.y build: 177 builds: 4 failed, 173 passed, 14 errors, 7 warnings (v5.14.19)
 2021-11-17 15:34 UTC 

[PATCH] drm/format-helper: Fix dst computation in drm_fb_xrgb8888_to_rgb888_dstclip()
 2021-11-17 15:31 UTC  (3+ messages)

stable-rc/linux-5.15.y build: 163 builds: 5 failed, 158 passed, 15 errors, 5 warnings (v5.15.2-924-g7c10b031cbb7)
 2021-11-17 15:10 UTC 

stable-rc/linux-5.10.y build: 179 builds: 3 failed, 176 passed, 4 errors, 13 warnings (v5.10.79-578-g9a16d5dfd04f)
 2021-11-17 15:10 UTC 

stable-rc/queue/4.9 baseline: 95 runs, 1 regressions (v4.9.290-159-gb2c6c16b9d4a)
 2021-11-17 15:03 UTC 

stable-rc/queue/4.14 baseline: 79 runs, 1 regressions (v4.14.255-199-g19adfc3d75c6)
 2021-11-17 14:53 UTC 

stable-rc/linux-5.4.y build: 163 builds: 3 failed, 160 passed, 4 errors, 27 warnings (v5.4.160)
 2021-11-17 14:25 UTC 

patch "usb: chipidea: ci_hdrc_imx: fix potential error pointer dereference" added to usb-linus
 2021-11-17 14:05 UTC 

patch "usb: hub: Fix usb enumeration issue due to address0 race" added to usb-linus
 2021-11-17 14:05 UTC 

patch "usb: typec: fusb302: Fix masking of comparator and bc_lvl interrupts" added to usb-linus
 2021-11-17 14:04 UTC 

patch "usb: dwc3: leave default DMA for PCI devices" added to usb-linus
 2021-11-17 14:04 UTC 

patch "usb: dwc2: hcd_queue: Fix use of floating point literal" added to usb-linus
 2021-11-17 14:04 UTC 

patch "usb: dwc3: gadget: Fix null pointer exception" added to usb-linus
 2021-11-17 14:03 UTC 

patch "usb: xhci: tegra: Check padctrl interrupt presence in device tree" added to usb-linus
 2021-11-17 14:03 UTC 

patch "usb: dwc3: gadget: Ignore NoStream after End Transfer" added to usb-linus
 2021-11-17 14:03 UTC 

patch "usb: dwc2: gadget: Fix ISOC flow for elapsed frames" added to usb-linus
 2021-11-17 14:03 UTC 

patch "usb: dwc3: gadget: Check for L1/L2/U3 for Start Transfer" added to usb-linus
 2021-11-17 14:03 UTC 

patch "usb: dwc3: core: Revise GHWPARAMS9 offset" added to usb-linus
 2021-11-17 14:03 UTC 

stable-rc/queue/4.19 baseline: 111 runs, 1 regressions (v4.19.217-250-g8d9f0f1c26ce)
 2021-11-17 13:40 UTC 

stable-rc/queue/5.14 baseline: 147 runs, 1 regressions (v5.14.18-857-g84b711efd17f)
 2021-11-17 13:21 UTC 

patch "staging: rtl8192e: Fix use after free in _rtl92e_pci_disconnect()" added to staging-linus
 2021-11-17 13:09 UTC 

patch "staging: greybus: Add missing rwsem around snd_ctl_remove() calls" added to staging-linus
 2021-11-17 13:09 UTC 

stable-rc/queue/4.4 baseline: 56 runs, 1 regressions (v4.4.292-113-gf2c0456872466)
 2021-11-17 13:02 UTC 

[PATCH v2] tipc: check for null after calling kmemdup
 2021-11-17 12:37 UTC  (2+ messages)

stable-rc/queue/4.4 build: 177 builds: 5 failed, 172 passed, 6 errors, 34 warnings (v4.4.292-113-gecc196609cf4)
 2021-11-17 12:09 UTC 

stable/linux-5.4.y build: 178 builds: 2 failed, 176 passed, 4 errors, 32 warnings (v5.4.160)
 2021-11-17 11:55 UTC 

stable-rc/queue/4.9 build: 185 builds: 2 failed, 183 passed, 37 warnings (v4.9.290-159-gb2c6c16b9d4a)
 2021-11-17 11:34 UTC 

[PATCH] powerpc/signal32: Fix sigset_t copy
 2021-11-17 11:23 UTC  (2+ messages)

[PATCH] powerpc/8xx: Fix pinned TLBs with CONFIG_STRICT_KERNEL_RWX
 2021-11-17 11:23 UTC  (2+ messages)

stable-rc/queue/4.14 build: 186 builds: 3 failed, 183 passed, 2 errors, 31 warnings (v4.14.255-199-g19adfc3d75c6)
 2021-11-17 11:24 UTC 

[PATCH v2] clk: qcom: regmap-mux: fix parent clock lookup
 2021-11-17 11:13 UTC 

stable-rc/queue/5.4 build: 175 builds: 3 failed, 172 passed, 4 errors, 29 warnings (v5.4.159-353-ga262045b5ccb)
 2021-11-17 11:04 UTC 

stable-rc/queue/5.10 build: 179 builds: 3 failed, 176 passed, 4 errors, 13 warnings (v5.10.79-577-g36adb8b9fb074)
 2021-11-17 10:48 UTC 

stable-rc/queue/5.15 build: 171 builds: 3 failed, 168 passed, 13 errors, 5 warnings (v5.15.2-923-g7b1feec550d3)
 2021-11-17 10:29 UTC 

Linux 5.14.19
 2021-11-17 10:26 UTC  (2+ messages)

[5.15 REGRESSION v2] iomap: Fix inline extent handling in iomap_readpage
 2021-11-17 10:24 UTC  (4+ messages)

stable-rc/queue/4.19 build: 189 builds: 6 failed, 183 passed, 2 errors, 38 warnings (v4.19.217-250-g8d9f0f1c26ce)
 2021-11-17 10:11 UTC 

[PATCH v2 1/3] serial: liteuart: fix use-after-free and memleak on unbind
 2021-11-17 10:05 UTC  (2+ messages)
` [PATCH v2 2/3] serial: liteuart: fix minor-number leak on probe errors

Linux 5.4.160
 2021-11-17 10:01 UTC  (2+ messages)

stable-rc/queue/5.14 build: 176 builds: 4 failed, 172 passed, 13 errors, 7 warnings (v5.14.18-857-g84b711efd17f)
 2021-11-17  9:53 UTC 

stable-rc/queue/4.4 build: 171 builds: 5 failed, 166 passed, 8 errors, 27 warnings (v4.4.292-113-gf2c0456872466)
 2021-11-17  9:33 UTC 

[PATCH 1/3] serial: liteuart: fix compile testing
 2021-11-17  9:06 UTC  (3+ messages)

[PATCH 5.14 000/857] 5.14.19-rc2 review
 2021-11-17  8:05 UTC  (8+ messages)

[PATCH 5.10 000/578] 5.10.80-rc2 review
 2021-11-17  8:01 UTC  (9+ messages)

[PATCH] xen: detect uninitialized xenbus in xenbus_init
 2021-11-17  7:41 UTC  (2+ messages)

[PATCH 1/2] fs: handle circular mappings correctly
 2021-11-17  6:04 UTC  (2+ messages)

cifs: fix memory leak of smb3_fs_context_dup::server_hostname
 2021-11-17  5:59 UTC 

[PATCH 5.4 000/353] 5.4.160-rc2 review
 2021-11-17  4:46 UTC  (5+ messages)

[UPDATE][PATCH] cpufreq: intel_pstate: Fix EPP restore after offline/online
 2021-11-17  2:09 UTC  (3+ messages)

+ hugetlb-userfaultfd-fix-reservation-restore-on-userfaultfd-error.patch added to -mm tree
 2021-11-17  0:32 UTC 

[PATCH] Revert "mark pstore-blk as broken"
 2021-11-17  0:23 UTC  (2+ messages)

stable-rc/linux-5.15.y baseline: 91 runs, 40 regressions (v5.15.2-928-gcb98d6b416c1a)
 2021-11-17  0:19 UTC 

stable-rc/linux-4.19.y baseline: 77 runs, 1 regressions (v4.19.217-251-g84beceb5c615)
 2021-11-16 23:33 UTC 

[PATCH v3 0/3] Update VMware maintainer entries
 2021-11-16 23:11 UTC  (11+ messages)
` [PATCH v3 1/3] MAINTAINERS: Update maintainers for paravirt ops and VMware hypervisor interface

[tip: x86/urgent] x86/sgx: Fix free page accounting
 2021-11-16 22:34 UTC 

stable-rc/queue/4.19 baseline: 113 runs, 1 regressions (v4.19.217-250-gc4a264dd81ce)
 2021-11-16 22:18 UTC 

stable-rc/queue/4.4 baseline: 77 runs, 1 regressions (v4.4.292-113-g643cfcb15c40)
 2021-11-16 21:45 UTC 

stable-rc/linux-4.4.y baseline: 84 runs, 2 regressions (v4.4.292-114-g1e22bc7dab47)
 2021-11-16 21:32 UTC 

stable-rc/linux-5.10.y build: 169 builds: 3 failed, 166 passed, 4 errors, 13 warnings (v5.10.79-579-g739c1bb0c245)
 2021-11-16 21:32 UTC 

[tip: x86/urgent] x86/sgx: Fix free page accounting
 2021-11-16 21:25 UTC 

stable-rc/linux-4.14.y baseline: 77 runs, 1 regressions (v4.14.255-200-g9ac4e6b250bf)
 2021-11-16 21:17 UTC 

FAILED: patch "[PATCH] bootconfig: init: Fix memblock leak in xbc_make_cmdline()" failed to apply to 5.14-stable tree
 2021-11-16 21:12 UTC  (2+ messages)

stable-rc/linux-5.4.y build: 183 builds: 3 failed, 180 passed, 4 errors, 32 warnings (v5.4.159-354-ga24b83ec1134)
 2021-11-16 21:09 UTC 

stable-rc/linux-5.15.y build: 175 builds: 5 failed, 170 passed, 15 errors, 5 warnings (v5.15.2-928-gcb98d6b416c1a)
 2021-11-16 20:50 UTC 

stable-rc/linux-4.9.y build: 182 builds: 3 failed, 179 passed, 2 errors, 36 warnings (v4.9.290-160-ga8041b640adb)
 2021-11-16 20:39 UTC 

[PATCH v2] mm: fix panic in __alloc_pages
 2021-11-16 20:22 UTC  (9+ messages)
` [PATCH v3] "

stable-rc/linux-5.14.y build: 174 builds: 4 failed, 170 passed, 14 errors, 7 warnings (v5.14.18-858-gc82fd5d7547b)
 2021-11-16 20:20 UTC 

stable-rc/queue/5.15 baseline: 141 runs, 41 regressions (v5.15.2-927-gd7ce0f93f7eb)
 2021-11-16 20:10 UTC 

stable-rc/linux-4.19.y build: 188 builds: 6 failed, 182 passed, 2 errors, 39 warnings (v4.19.217-251-g84beceb5c615)
 2021-11-16 20:04 UTC 

FAILED: patch "[PATCH] tracing: Resize tgid_map to pid_max, not PID_MAX_DEFAULT" failed to apply to 4.14-stable tree
 2021-11-16 19:52 UTC  (2+ messages)

stable-rc/queue/5.14 baseline: 132 runs, 1 regressions (v5.14.18-857-gc5cf53eecb90b)
 2021-11-16 19:49 UTC 

[SRU Hirsute/Impish] vfs: check fd has read access in kernel_read_file_from_fd()
 2021-11-16 19:42 UTC  (2+ messages)
` [SRU Focal/Bionic] "

[PATCH] tipc: check for null after calling kmemdup
 2021-11-16 19:33 UTC  (6+ messages)

stable-rc/queue/4.14 baseline: 76 runs, 1 regressions (v4.14.255-199-g8804eb789518)
 2021-11-16 19:26 UTC 

[PATCH] v5.10 backport of x86/iopl: Fake iopl(3) CLI/STI usage
 2021-11-16 19:15 UTC 

[PATCH AUTOSEL 5.15 01/65] Input: cpcap-pwrbutton - handle errors from platform_get_irq()
 2021-11-16 19:16 UTC  (9+ messages)
` [PATCH AUTOSEL 5.15 02/65] kcsan: test: Fix flaky test case
` [PATCH AUTOSEL 5.15 03/65] backlight: Propagate errors from get_brightness()
` [PATCH AUTOSEL 5.15 04/65] UNRPC: Return specific error code on kmalloc failure
` [PATCH AUTOSEL 5.15 05/65] NFS: Fix up nfs_ctx_key_to_expire()
` [PATCH AUTOSEL 5.15 06/65] PCI: aardvark: Fix link training
` [PATCH AUTOSEL 5.15 07/65] fbdev: fbmem: Fix double free of 'fb_info->pixmap.addr'
` [PATCH AUTOSEL 5.15 08/65] drm/virtio: fix the missed drm_gem_object_put() in virtio_gpu_user_framebuffer_create()
` [PATCH AUTOSEL 5.15 09/65] orangefs: Fix sb refcount leak when allocate sb info failed

[PATCH AUTOSEL 5.15 01/65] Input: cpcap-pwrbutton - handle errors from platform_get_irq()
 2021-11-16 19:03 UTC  (9+ messages)
` [PATCH AUTOSEL 5.15 02/65] kcsan: test: Fix flaky test case
` [PATCH AUTOSEL 5.15 03/65] backlight: Propagate errors from get_brightness()
` [PATCH AUTOSEL 5.15 04/65] UNRPC: Return specific error code on kmalloc failure
` [PATCH AUTOSEL 5.15 05/65] NFS: Fix up nfs_ctx_key_to_expire()
` [PATCH AUTOSEL 5.15 06/65] PCI: aardvark: Fix link training
` [PATCH AUTOSEL 5.15 07/65] fbdev: fbmem: Fix double free of 'fb_info->pixmap.addr'
` [PATCH AUTOSEL 5.15 08/65] drm/virtio: fix the missed drm_gem_object_put() in virtio_gpu_user_framebuffer_create()
` [PATCH AUTOSEL 5.15 09/65] orangefs: Fix sb refcount leak when allocate sb info failed

stable-rc/queue/4.19 build: 194 builds: 6 failed, 188 passed, 2 errors, 41 warnings (v4.19.217-250-gc4a264dd81ce)
 2021-11-16 18:49 UTC 

stable-rc/queue/4.9 build: 181 builds: 3 failed, 178 passed, 2 errors, 37 warnings (v4.9.290-159-g2cf93eac9faed)
 2021-11-16 18:34 UTC 

stable-rc/queue/4.19 baseline: 112 runs, 1 regressions (v4.19.217-251-g8499e02617e4)
 2021-11-16 18:19 UTC 

stable-rc/queue/4.4 build: 181 builds: 5 failed, 176 passed, 6 errors, 35 warnings (v4.4.292-113-g643cfcb15c40)
 2021-11-16 18:16 UTC 


This is a public inbox, see mirroring instructions
for how to clone and mirror all data and code used for this inbox;
as well as URLs for NNTP newsgroup(s).