stable.vger.kernel.org archive mirror
 help / color / mirror / Atom feed
FAILED: patch "[PATCH] signal: Don't always set SA_IMMUTABLE for forced signals" failed to apply to 5.15-stable tree
 2021-11-22 12:31 UTC 

FAILED: patch "[PATCH] shm: extend forced shm destroy to support objects from" failed to apply to 5.10-stable tree
 2021-11-22 12:28 UTC  (2+ messages)

[PATCH for-5.15.x 0/2] DAMON fixes
 2021-11-22 12:28 UTC  (4+ messages)
` [PATCH for-5.15.x 1/2] mm/damon/dbgfs: use '__GFP_NOWARN' for user-specified size buffer allocation
` [PATCH for-5.15.x 2/2] mm/damon/dbgfs: fix missed use of damon_dbgfs_lock

[PATCH] usb: hub: Fix usb enumeration issue due to address0 race
 2021-11-22 12:27 UTC  (6+ messages)
        ` [RFT PATCH] usb: hub: Fix locking issues with address0_mutex

FAILED: patch "[PATCH] proc/vmcore: fix clearing user buffer by properly using" failed to apply to 5.15-stable tree
 2021-11-22 12:27 UTC 

FAILED: patch "[PATCH] proc/vmcore: fix clearing user buffer by properly using" failed to apply to 5.10-stable tree
 2021-11-22 12:27 UTC 

FAILED: patch "[PATCH] proc/vmcore: fix clearing user buffer by properly using" failed to apply to 5.4-stable tree
 2021-11-22 12:27 UTC 

FAILED: patch "[PATCH] proc/vmcore: fix clearing user buffer by properly using" failed to apply to 4.19-stable tree
 2021-11-22 12:27 UTC 

FAILED: patch "[PATCH] proc/vmcore: fix clearing user buffer by properly using" failed to apply to 4.14-stable tree
 2021-11-22 12:26 UTC 

FAILED: patch "[PATCH] proc/vmcore: fix clearing user buffer by properly using" failed to apply to 4.9-stable tree
 2021-11-22 12:26 UTC 

FAILED: patch "[PATCH] proc/vmcore: fix clearing user buffer by properly using" failed to apply to 4.4-stable tree
 2021-11-22 12:26 UTC 

FAILED: patch "[PATCH] shm: extend forced shm destroy to support objects from" failed to apply to 5.4-stable tree
 2021-11-22 12:23 UTC 

FAILED: patch "[PATCH] shm: extend forced shm destroy to support objects from" failed to apply to 4.19-stable tree
 2021-11-22 12:22 UTC 

FAILED: patch "[PATCH] ipc: WARN if trying to remove ipc object which is absent" failed to apply to 4.4-stable tree
 2021-11-22 12:21 UTC 

FAILED: patch "[PATCH] ipc: WARN if trying to remove ipc object which is absent" failed to apply to 4.9-stable tree
 2021-11-22 12:21 UTC 

FAILED: patch "[PATCH] ipc: WARN if trying to remove ipc object which is absent" failed to apply to 4.14-stable tree
 2021-11-22 12:21 UTC 

FAILED: patch "[PATCH] shm: extend forced shm destroy to support objects from" failed to apply to 4.14-stable tree
 2021-11-22 12:21 UTC 

FAILED: patch "[PATCH] shm: extend forced shm destroy to support objects from" failed to apply to 4.9-stable tree
 2021-11-22 12:21 UTC 

FAILED: patch "[PATCH] shm: extend forced shm destroy to support objects from" failed to apply to 4.4-stable tree
 2021-11-22 12:21 UTC 

stable-rc/linux-4.14.y build: 195 builds: 3 failed, 192 passed, 2 errors, 32 warnings (v4.14.255)
 2021-11-22 11:31 UTC 

stable-rc/linux-5.10.y build: 181 builds: 3 failed, 178 passed, 4 errors, 10 warnings (v5.10.81)
 2021-11-22 11:21 UTC 

[PATCH net] tun: fix bonding active backup with arp monitoring
 2021-11-22 11:18 UTC  (2+ messages)

backport of 14831fad73f5 for 5.10 and 5.4
 2021-11-22 11:15 UTC  (4+ messages)

stable-rc/linux-5.4.y build: 164 builds: 3 failed, 161 passed, 4 errors, 26 warnings (v5.4.161)
 2021-11-22 11:06 UTC 

stable-rc/queue/4.9 build: 186 builds: 3 failed, 183 passed, 2 errors, 32 warnings (v4.9.290-189-gad0477933ff47)
 2021-11-22 10:37 UTC 

FAILED: patch "[PATCH] bpf: Fix toctou on read-only map's constant scalar tracking" failed to apply to 5.4-stable tree
 2021-11-22 10:33 UTC 

FAILED: patch "[PATCH] bpf: Fix toctou on read-only map's constant scalar tracking" failed to apply to 5.10-stable tree
 2021-11-22 10:33 UTC 

[PATCH ipsec] xfrm: fix dflt policy check when there is no policy configured
 2021-11-22 10:33 UTC 

stable-rc/linux-5.15.y build: 154 builds: 3 failed, 151 passed, 10 errors, 5 warnings (v5.15.4)
 2021-11-22 10:21 UTC 

stable-rc/queue/4.14 baseline: 127 runs, 1 regressions (v4.14.255-233-g18e656325ab1)
 2021-11-22  9:46 UTC 

[PATCH 5.15 000/923] 5.15.3-rc3 review
 2021-11-22  9:32 UTC  (11+ messages)
              ` [PATCH] x86: Pin task-stack in __get_wchan()

stable-rc/queue/4.4 baseline: 59 runs, 1 regressions (v4.4.292-140-ga310aae52ea5)
 2021-11-22  9:25 UTC 

stable-rc/queue/4.9 baseline: 130 runs, 2 regressions (v4.9.290-189-gf792aae152288)
 2021-11-22  9:07 UTC 

stable-rc/queue/5.15 baseline: 174 runs, 1 regressions (v5.15.3-209-ga7c460a89289)
 2021-11-22  8:39 UTC 

[PATCH v2] xen: detect uninitialized xenbus in xenbus_init
 2021-11-22  7:57 UTC  (3+ messages)

stable-rc/queue/4.14 build: 189 builds: 3 failed, 186 passed, 2 errors, 35 warnings (v4.14.255-233-g18e656325ab1)
 2021-11-22  6:17 UTC 

stable-rc/queue/4.4 build: 166 builds: 4 failed, 162 passed, 6 errors, 20 warnings (v4.4.292-140-ga310aae52ea5)
 2021-11-22  5:56 UTC 

stable-rc/queue/4.9 build: 186 builds: 3 failed, 183 passed, 2 errors, 37 warnings (v4.9.290-189-gf792aae152288)
 2021-11-22  5:38 UTC 

stable-rc/queue/5.10 build: 178 builds: 6 failed, 172 passed, 7 errors, 10 warnings (v5.10.80-141-gdd54bb5a64531)
 2021-11-22  5:29 UTC 

stable-rc/queue/4.19 baseline: 140 runs, 1 regressions (v4.19.217-301-g59e657d57c9d)
 2021-11-22  5:25 UTC 

stable-rc/queue/5.15 build: 160 builds: 3 failed, 157 passed, 10 errors, 5 warnings (v5.15.3-209-ga7c460a89289)
 2021-11-22  5:10 UTC 

stable-rc/queue/4.14 baseline: 145 runs, 1 regressions (v4.14.255-231-g73f81038f9b80)
 2021-11-22  5:02 UTC 

stable-rc/queue/5.4 build: 184 builds: 4 failed, 180 passed, 4 errors, 29 warnings (v5.4.160-88-ge0025dbe1281)
 2021-11-22  4:43 UTC 

stable-rc/queue/4.19 build: 170 builds: 5 failed, 165 passed, 2 errors, 39 warnings (v4.19.217-303-ge17f97ba1b504)
 2021-11-22  4:30 UTC 

stable-rc/queue/4.9 baseline: 129 runs, 1 regressions (v4.9.290-187-gc47222584eb6)
 2021-11-22  4:21 UTC 

[PATCH v2] sched/rt: Try to restart rt period timer when rt runtime exceeded
 2021-11-22  4:03 UTC 

stable-rc/queue/4.4 baseline: 122 runs, 1 regressions (v4.4.292-140-g1794f2b1b0d51)
 2021-11-22  4:03 UTC 

[PATCH -next V3 1/2] sata_fsl: fix UAF in sata_fsl_port_stop when rmmod sata_fsl
 2021-11-22  3:45 UTC  (2+ messages)
` [PATCH -next V3 2/2] sata_fsl: fix warning in remove_proc_entry "

[PATCH] arm64: dts: ten64: remove redundant interrupt declaration for gpio-keys
 2021-11-22  2:55 UTC 

[PATCH 5.10 00/21] 5.10.81-rc1 review
 2021-11-22  2:48 UTC  (18+ messages)
` [PATCH 5.10 03/21] loop: Use blk_validate_block_size() to validate block size
` [PATCH 5.10 11/21] arm64: vdso32: suppress error message for make mrproper

stable-rc/queue/5.15 build: 169 builds: 4 failed, 165 passed, 14 errors, 5 warnings (v5.15.3-198-g0517437aef05b)
 2021-11-22  2:12 UTC 

stable-rc/queue/4.19 build: 176 builds: 6 failed, 170 passed, 2 errors, 37 warnings (v4.19.217-301-g59e657d57c9d)
 2021-11-22  1:56 UTC 

stable-rc/queue/5.10 build: 173 builds: 6 failed, 167 passed, 7 errors, 10 warnings (v5.10.80-136-ge0e05de12859)
 2021-11-22  1:22 UTC 

stable-rc/queue/5.4 build: 177 builds: 4 failed, 173 passed, 4 errors, 27 warnings (v5.4.160-84-gd91356870e96b)
 2021-11-22  1:10 UTC 

stable-rc/queue/4.9 build: 184 builds: 3 failed, 181 passed, 2 errors, 37 warnings (v4.9.290-187-gc47222584eb6)
 2021-11-22  0:52 UTC 

stable-rc/queue/4.4 build: 159 builds: 4 failed, 155 passed, 6 errors, 34 warnings (v4.4.292-140-g1794f2b1b0d51)
 2021-11-22  0:34 UTC 

Patch "perf bench: Fix two memory leaks detected with ASan" has been added to the 4.9-stable tree
 2021-11-21 23:37 UTC 

stable-rc/queue/5.14 baseline: 117 runs, 1 regressions (v5.14.20-15-g377ca61cde601)
 2021-11-21 21:03 UTC 

stable-rc/queue/5.10 baseline: 186 runs, 2 regressions (v5.10.80-21-g6fc1e3c907b9c)
 2021-11-21 19:55 UTC 

stable-rc/queue/4.9 baseline: 132 runs, 1 regressions (v4.9.290-161-g71211c0fc2c9)
 2021-11-21 19:27 UTC 

stable/linux-5.10.y baseline: 190 runs, 2 regressions (v5.10.81)
 2021-11-21 19:20 UTC 

stable-rc/queue/5.14 build: 154 builds: 4 failed, 150 passed, 14 errors, 3 warnings (v5.14.20-15-g377ca61cde601)
 2021-11-21 17:33 UTC 

stable-rc/queue/4.4 build: 185 builds: 5 failed, 180 passed, 6 errors, 35 warnings (v4.4.292-116-gc13aef2ca259)
 2021-11-21 17:11 UTC 

stable-rc/queue/5.15 build: 173 builds: 4 failed, 169 passed, 14 errors, 5 warnings (v5.15.3-20-g3176a665db83)
 2021-11-21 17:01 UTC 

[PATCH] Bluetooth: btusb: Add one more Bluetooth part for the Realtek RTL8852AE
 2021-11-21 16:51 UTC 

stable-rc/queue/4.14 build: 174 builds: 3 failed, 171 passed, 2 errors, 35 warnings (v4.14.255-201-gcf619f81c8bbe)
 2021-11-21 16:40 UTC 

stable-rc/queue/5.10 build: 180 builds: 3 failed, 177 passed, 4 errors, 9 warnings (v5.10.80-21-g6fc1e3c907b9c)
 2021-11-21 16:25 UTC 

stable-rc/queue/4.9 build: 170 builds: 3 failed, 167 passed, 2 errors, 35 warnings (v4.9.290-161-g71211c0fc2c9)
 2021-11-21 15:58 UTC 

stable/linux-5.10.y build: 180 builds: 3 failed, 177 passed, 4 errors, 10 warnings (v5.10.81)
 2021-11-21 15:51 UTC 

stable/linux-5.15.y build: 173 builds: 4 failed, 169 passed, 13 errors, 4 warnings (v5.15.4)
 2021-11-21 15:30 UTC 

stable/linux-5.14.y build: 159 builds: 4 failed, 155 passed, 13 errors, 7 warnings (v5.14.21)
 2021-11-21 15:09 UTC 

[WARN][AMDGPU] Linux 5.15.4 with AMD Bonaire GPU
 2021-11-21 14:46 UTC 

stable/linux-5.4.y build: 185 builds: 3 failed, 182 passed, 4 errors, 29 warnings (v5.4.161)
 2021-11-21 14:44 UTC 

stable-rc/queue/5.14 baseline: 174 runs, 2 regressions (v5.14.20-15-g9bf8ab4a66d02)
 2021-11-21 14:40 UTC 

stable-rc/queue/4.19 build: 172 builds: 6 failed, 166 passed, 2 errors, 33 warnings (v4.19.217-258-g500386e5fa6f)
 2021-11-21 14:21 UTC 

stable-rc/queue/4.14 baseline: 141 runs, 1 regressions (v4.14.255-201-gd07d109b2abf)
 2021-11-21 13:55 UTC 

stable-rc/queue/4.9 baseline: 133 runs, 1 regressions (v4.9.290-161-g520a4edb46f8)
 2021-11-21 13:49 UTC 

Linux 5.14.21
 2021-11-21 13:13 UTC  (2+ messages)

Linux 5.15.4
 2021-11-21 13:11 UTC  (2+ messages)

Linux 5.10.81
 2021-11-21 13:11 UTC  (2+ messages)

Linux 5.4.161
 2021-11-21 12:54 UTC  (3+ messages)

stable-rc/queue/5.10 build: 178 builds: 3 failed, 175 passed, 4 errors, 10 warnings (v5.10.80-21-g8580de58e453f)
 2021-11-21 12:42 UTC 

stable-rc/queue/5.15 build: 169 builds: 4 failed, 165 passed, 12 errors, 5 warnings (v5.15.3-20-gd4c097aa6cb5f)
 2021-11-21 12:19 UTC 

stable-rc/queue/5.4 build: 172 builds: 2 failed, 170 passed, 4 errors, 29 warnings (v5.4.160-12-gaa2da7d871f7)
 2021-11-21 11:57 UTC 

[PATCH 1/2] ksmbd: downgrade addition info error msg to debug in smb2_get_info_sec()
 2021-11-21 11:43 UTC  (2+ messages)
` [PATCH 2/2] ksmbd: contain default data stream even if xattr is empty

stable-rc/queue/4.19 build: 193 builds: 6 failed, 187 passed, 2 errors, 39 warnings (v4.19.217-258-gb306f6c37490)
 2021-11-21 11:33 UTC 

stable-rc/queue/5.14 build: 162 builds: 3 failed, 159 passed, 10 errors, 7 warnings (v5.14.20-15-g9bf8ab4a66d02)
 2021-11-21 11:11 UTC 

stable-rc/queue/4.4 build: 176 builds: 5 failed, 171 passed, 6 errors, 34 warnings (v4.4.292-116-gf6c664f1e977f)
 2021-11-21 11:11 UTC 

stable-rc/queue/4.14 build: 168 builds: 3 failed, 165 passed, 2 errors, 28 warnings (v4.14.255-201-gd07d109b2abf)
 2021-11-21 10:26 UTC 

stable-rc/queue/4.9 build: 187 builds: 3 failed, 184 passed, 2 errors, 37 warnings (v4.9.290-161-g520a4edb46f8)
 2021-11-21 10:20 UTC 

[PATCH 5.15 00/20] 5.15.4-rc1 review
 2021-11-20 17:40 UTC  (7+ messages)

[PATCH 5.14 00/15] 5.14.21-rc1 review
 2021-11-20 16:52 UTC  (5+ messages)

[PATCH 5.4 0/3] batman-adv: Fixes for stable/linux-4.19.y
 2021-11-20 12:40 UTC  (4+ messages)
` [PATCH 5.4 1/3] batman-adv: Consider fragmentation for needed_headroom
` [PATCH 5.4 2/3] batman-adv: Reserve needed_*room for fragments
` [PATCH 5.4 3/3] batman-adv: Don't always reallocate the fragmentation skb head

[PATCH 4.19 0/4] batman-adv: Fixes for stable/linux-4.19.y
 2021-11-20 12:40 UTC  (5+ messages)
` [PATCH 4.19 1/4] batman-adv: mcast: fix duplicate mcast packets in BLA backbone from LAN
` [PATCH 4.19 2/4] batman-adv: Consider fragmentation for needed_headroom
` [PATCH 4.19 3/4] batman-adv: Reserve needed_*room for fragments
` [PATCH 4.19 4/4] batman-adv: Don't always reallocate the fragmentation skb head

[PATCH 4.14 0/5] batman-adv: Fixes for stable/linux-4.14.y
 2021-11-20 12:40 UTC  (6+ messages)
` [PATCH 4.14 1/5] batman-adv: mcast: fix duplicate mcast packets in BLA backbone from LAN
` [PATCH 4.14 2/5] batman-adv: mcast: fix duplicate mcast packets from BLA backbone to mesh
` [PATCH 4.14 3/5] batman-adv: Consider fragmentation for needed_headroom
` [PATCH 4.14 4/5] batman-adv: Reserve needed_*room for fragments
` [PATCH 4.14 5/5] batman-adv: Don't always reallocate the fragmentation skb head

[PATCH 4.9 0/7] batman-adv: Fixes for stable/linux-4.9.y
 2021-11-20 12:39 UTC  (8+ messages)
` [PATCH 4.9 1/7] batman-adv: Keep fragments equally sized
` [PATCH 4.9 2/7] batman-adv: Fix own OGM check in aggregated OGMs
` [PATCH 4.9 3/7] batman-adv: mcast: fix duplicate mcast packets in BLA backbone from LAN
` [PATCH 4.9 4/7] batman-adv: mcast: fix duplicate mcast packets from BLA backbone to mesh
` [PATCH 4.9 5/7] batman-adv: Consider fragmentation for needed_headroom
` [PATCH 4.9 6/7] batman-adv: Reserve needed_*room for fragments
` [PATCH 4.9 7/7] batman-adv: Don't always reallocate the fragmentation skb head

[PATCH 4.4 00/11] batman-adv: Fixes for stable/linux-4.4.y
 2021-11-20 12:39 UTC  (12+ messages)
` [PATCH 4.4 01/11] batman-adv: Keep fragments equally sized
` [PATCH 4.4 02/11] batman-adv: Fix multicast TT issues with bogus ROAM flags
` [PATCH 4.4 03/11] batman-adv: Prevent duplicated softif_vlan entry
` [PATCH 4.4 04/11] batman-adv: mcast: fix duplicate mcast packets in BLA backbone from LAN
` [PATCH 4.4 05/11] batman-adv: mcast: fix duplicate mcast packets in BLA backbone from mesh
` [PATCH 4.4 06/11] batman-adv: mcast: fix duplicate mcast packets from BLA backbone to mesh
` [PATCH 4.4 07/11] batman-adv: set .owner to THIS_MODULE
` [PATCH 4.4 08/11] batman-adv: Consider fragmentation for needed_headroom
` [PATCH 4.4 09/11] batman-adv: Reserve needed_*room for fragments
` [PATCH 4.4 10/11] batman-adv: Don't always reallocate the fragmentation skb head
` [PATCH 4.4 11/11] batman-adv: Avoid WARN_ON timing related checks

[PATCH v3] bus: mhi: Fix race while handling SYS_ERR at power up
 2021-11-20 11:36 UTC  (4+ messages)

[PATCH 01/12] RISC-V: defconfigs: Set CONFIG_FB=y, for FB console
 2021-11-20  3:57 UTC  (4+ messages)
` [PATCH 02/12] RISC-V: MAXPHYSMEM_2GB doesn't depend on CMODEL_MEDLOW

stable-rc/linux-5.15.y baseline: 136 runs, 1 regressions (v5.15.3-21-g9f5b4a585c82d)
 2021-11-20  3:32 UTC 

stable-rc/linux-5.14.y build: 157 builds: 4 failed, 153 passed, 13 errors, 7 warnings (v5.14.20-16-g050eba56bb1eb)
 2021-11-20  1:15 UTC 

stable-rc/queue/5.15 baseline: 136 runs, 1 regressions (v5.15.3-20-ge311298d5b74b)
 2021-11-20  1:02 UTC 

stable-rc/linux-4.4.y build: 185 builds: 5 failed, 180 passed, 6 errors, 32 warnings (v4.4.292-117-g8ccde1533761)
 2021-11-20  0:48 UTC 

[patch 02/15] ipc: WARN if trying to remove ipc object which is absent
 2021-11-20  0:43 UTC  (10+ messages)
` [patch 03/15] shm: extend forced shm destroy to support objects from several IPC nses
` [patch 05/15] hexagon: export raw I/O routines for modules
` [patch 06/15] hexagon: clean up timer-regs.h
` [patch 08/15] mm: kmemleak: slob: respect SLAB_NOLEAKTRACE flag
` [patch 10/15] hugetlb, userfaultfd: fix reservation restore on userfaultfd error
` [patch 12/15] mm/damon/dbgfs: use '__GFP_NOWARN' for user-specified size buffer allocation
` [patch 13/15] mm/damon/dbgfs: fix missed use of damon_dbgfs_lock
` [patch 14/15] kmap_local: don't assume kmap PTEs are linear arrays in memory
` [patch 15/15] proc/vmcore: fix clearing user buffer by properly using clear_user()

stable-rc/linux-4.19.y build: 192 builds: 6 failed, 186 passed, 2 errors, 41 warnings (v4.19.217-259-gf3d787ccb5492)
 2021-11-20  0:35 UTC 

stable-rc/linux-5.4.y build: 170 builds: 2 failed, 168 passed, 26 warnings (v5.4.160-14-g112a444da05c)
 2021-11-20  0:29 UTC 

stable-rc/queue/5.14 baseline: 136 runs, 2 regressions (v5.14.20-15-g69d5eb2b3977d)
 2021-11-20  0:16 UTC 

stable-rc/linux-5.15.y build: 178 builds: 4 failed, 174 passed, 14 errors, 5 warnings (v5.15.3-21-g9f5b4a585c82d)
 2021-11-20  0:03 UTC 

stable-rc/linux-4.14.y build: 178 builds: 3 failed, 175 passed, 4 errors, 34 warnings (v4.14.255-202-g0d2c672c3819)
 2021-11-19 23:50 UTC 

[PATCH] binder: fix test regression due to sender_euid change
 2021-11-19 23:39 UTC  (3+ messages)

stable-rc/linux-5.10.y build: 173 builds: 1 failed, 172 passed, 4 errors, 10 warnings (v5.10.80-22-ged689bd1df46a)
 2021-11-19 23:34 UTC 

stable-rc/queue/5.10 baseline: 135 runs, 2 regressions (v5.10.80-21-g589fe774e1838)
 2021-11-19 23:31 UTC 

stable-rc/queue/4.14 baseline: 97 runs, 2 regressions (v4.14.255-201-g1fdcfc0283a2)
 2021-11-19 23:20 UTC 

[PATCH 5.15 00/20] 5.15.4-rc1 review
 2021-11-19 23:18 UTC 

stable-rc/linux-4.9.y build: 184 builds: 3 failed, 181 passed, 2 errors, 37 warnings (v4.9.290-162-ge4009500e828)
 2021-11-19 23:11 UTC 

stable-rc/queue/4.19 baseline: 97 runs, 1 regressions (v4.19.217-258-g71fd6c08f1a97)
 2021-11-19 22:34 UTC 

stable-rc/queue/5.15 build: 157 builds: 3 failed, 154 passed, 5 errors, 3 warnings (v5.15.3-20-ge311298d5b74b)
 2021-11-19 21:33 UTC 

stable-rc/queue/5.14 build: 174 builds: 4 failed, 170 passed, 14 errors, 7 warnings (v5.14.20-15-g69d5eb2b3977d)
 2021-11-19 20:48 UTC 

[PATCH RESEND v3 1/7] rtc-cmos: take rtc_lock while reading from CMOS
 2021-11-19 20:42 UTC 

stable-rc/queue/5.4 build: 170 builds: 3 failed, 167 passed, 4 errors, 29 warnings (v5.4.160-13-g92b913554aa0)
 2021-11-19 20:33 UTC 

page:  |  | latest

This is a public inbox, see mirroring instructions
for how to clone and mirror all data and code used for this inbox;
as well as URLs for NNTP newsgroup(s).