All of lore.kernel.org
 help / color / mirror / Atom feed
From: kbuild test robot <lkp@intel.com>
To: David Howells <dhowells@redhat.com>
Cc: kbuild-all@01.org, linux-api@vger.kernel.org,
	linux-kbuild@vger.kernel.org,
	Masahiro Yamada <yamada.masahiro@socionext.com>,
	Michal Marek <michal.lkml@markovi.net>,
	linux-kernel@vger.kernel.org, dhowells@redhat.com
Subject: Re: [PATCH 11/11] UAPI: Check headers build for C++ [ver #2]
Date: Tue, 11 Sep 2018 01:02:59 +0800	[thread overview]
Message-ID: <201809110155.db1DzqZ4%fengguang.wu@intel.com> (raw)
In-Reply-To: <153622557736.14298.10350496216090814292.stgit@warthog.procyon.org.uk>

[-- Attachment #1: Type: text/plain, Size: 5884 bytes --]

Hi David,

I love your patch! Yet something to improve:

[auto build test ERROR on linus/master]
[also build test ERROR on v4.19-rc3 next-20180910]
[if your patch is applied to the wrong git tree, please drop us a note to help improve the system]

url:    https://github.com/0day-ci/linux/commits/David-Howells/UAPI-drm-Fix-use-of-C-keywords-as-structural-members-ver-2/20180907-092121
config: x86_64-kexec (attached as .config)
compiler: gcc-7 (Debian 7.3.0-1) 7.3.0
reproduce:
        # save the attached .config to linux build tree
        make ARCH=x86_64 

All errors (new ones prefixed by >>):

   In file included from test.h:225:0,
                    from test.cpp:1:
>> ../usr/include/linux/patchkey.h:15:2: error: #error "patchkey.h included directly"
    #error "patchkey.h included directly"
     ^~~~~
   In file included from ../usr/include/asm/shmbuf.h:6:0,
                    from test.h:83,
                    from test.cpp:1:
>> ../usr/include/asm-generic/shmbuf.h:26:20: error: field 'shm_perm' has incomplete type 'ipc64_perm'
     struct ipc64_perm shm_perm; /* operation perms */
                       ^~~~~~~~
   ../usr/include/asm-generic/shmbuf.h:26:9: note: forward declaration of 'struct ipc64_perm'
     struct ipc64_perm shm_perm; /* operation perms */
            ^~~~~~~~~~
   In file included from ../usr/include/asm/msgbuf.h:6:0,
                    from test.h:112,
                    from test.cpp:1:
>> ../usr/include/asm-generic/msgbuf.h:25:20: error: field 'msg_perm' has incomplete type 'ipc64_perm'
     struct ipc64_perm msg_perm;
                       ^~~~~~~~
   In file included from ../usr/include/asm/shmbuf.h:6:0,
                    from test.h:83,
                    from test.cpp:1:
   ../usr/include/asm-generic/shmbuf.h:26:9: note: forward declaration of 'struct ipc64_perm'
     struct ipc64_perm shm_perm; /* operation perms */
            ^~~~~~~~~~
   In file included from test.h:868:0,
                    from test.cpp:1:
   ../usr/include/sound/skl-tplg-interface.h:146:2: error: 'u32' does not name a type; did you mean '__u32'?
     u32 set_params:2;
     ^~~
     __u32
   ../usr/include/sound/skl-tplg-interface.h:147:2: error: 'u32' does not name a type; did you mean '__u32'?
     u32 rsvd:30;
     ^~~
     __u32
   ../usr/include/sound/skl-tplg-interface.h:148:2: error: 'u32' does not name a type; did you mean '__u32'?
     u32 param_id;
     ^~~
     __u32
   ../usr/include/sound/skl-tplg-interface.h:149:2: error: 'u32' does not name a type; did you mean '__u32'?
     u32 max;
     ^~~
     __u32
   ../usr/include/sound/skl-tplg-interface.h:166:2: error: 'u16' does not name a type; did you mean '__u16'?
     u16 module_id;
     ^~~
     __u16
   ../usr/include/sound/skl-tplg-interface.h:167:2: error: 'u16' does not name a type; did you mean '__u16'?
     u16 instance_id;
     ^~~
     __u16
   ../usr/include/sound/skl-tplg-interface.h:171:2: error: 'u32' does not name a type; did you mean '__u32'?
     u32 channels;
     ^~~
     __u32
   ../usr/include/sound/skl-tplg-interface.h:172:2: error: 'u32' does not name a type; did you mean '__u32'?
     u32 freq;
     ^~~
     __u32
   ../usr/include/sound/skl-tplg-interface.h:173:2: error: 'u32' does not name a type; did you mean '__u32'?
     u32 bit_depth;
     ^~~
     __u32
   ../usr/include/sound/skl-tplg-interface.h:174:2: error: 'u32' does not name a type; did you mean '__u32'?
     u32 valid_bit_depth;
     ^~~
     __u32
   ../usr/include/sound/skl-tplg-interface.h:175:2: error: 'u32' does not name a type; did you mean '__u32'?
     u32 ch_cfg;
     ^~~
     __u32
   ../usr/include/sound/skl-tplg-interface.h:176:2: error: 'u32' does not name a type; did you mean '__u32'?
     u32 interleaving_style;
     ^~~
     __u32
   ../usr/include/sound/skl-tplg-interface.h:177:2: error: 'u32' does not name a type; did you mean '__u32'?
     u32 sample_type;
     ^~~
     __u32
   ../usr/include/sound/skl-tplg-interface.h:178:2: error: 'u32' does not name a type; did you mean '__u32'?
     u32 ch_map;
     ^~~
     __u32
   ../usr/include/sound/skl-tplg-interface.h:182:2: error: 'u32' does not name a type; did you mean '__u32'?
     u32 set_params:2;
     ^~~
     __u32
   ../usr/include/sound/skl-tplg-interface.h:183:2: error: 'u32' does not name a type; did you mean '__u32'?
     u32 rsvd:30;
     ^~~
     __u32
   ../usr/include/sound/skl-tplg-interface.h:184:2: error: 'u32' does not name a type; did you mean '__u32'?
     u32 param_id;
     ^~~
     __u32
   ../usr/include/sound/skl-tplg-interface.h:185:2: error: 'u32' does not name a type; did you mean '__u32'?
     u32 caps_size;
     ^~~
     __u32
   ../usr/include/sound/skl-tplg-interface.h:186:2: error: 'u32' does not name a type; did you mean '__u32'?
     u32 caps[HDA_SST_CFG_MAX];
     ^~~
     __u32
   ../usr/include/sound/skl-tplg-interface.h:190:2: error: 'u8' does not name a type; did you mean '__u8'?
     u8 pipe_id;
     ^~
     __u8
   ../usr/include/sound/skl-tplg-interface.h:191:2: error: 'u8' does not name a type; did you mean '__u8'?
     u8 pipe_priority;
     ^~
     __u8
   ../usr/include/sound/skl-tplg-interface.h:192:2: error: 'u16' does not name a type; did you mean '__u16'?
     u16 conn_type:4;
     ^~~
     __u16
   ../usr/include/sound/skl-tplg-interface.h:193:2: error: 'u16' does not name a type; did you mean '__u16'?
     u16 rsvd:4;
--
>> find: '../usr/include': No such file or directory
   In file included from test.cpp:1:0:
>> test.h:8:10: fatal error: linux/types.h: No such file or directory
    #include <linux/types.h>
             ^~~~~~~~~~~~~~~
   compilation terminated.
   make[1]: *** [headers_install] Error 1
   make: *** [sub-make] Error 2

---
0-DAY kernel test infrastructure                Open Source Technology Center
https://lists.01.org/pipermail/kbuild-all                   Intel Corporation

[-- Attachment #2: .config.gz --]
[-- Type: application/gzip, Size: 26038 bytes --]

WARNING: multiple messages have this Message-ID
From: kbuild test robot <lkp@intel.com>
To: David Howells <dhowells@redhat.com>
Cc: kbuild-all@01.org, linux-api@vger.kernel.org,
	linux-kbuild@vger.kernel.org,
	Masahiro Yamada <yamada.masahiro@socionext.com>,
	Michal Marek <michal.lkml@markovi.net>,
	linux-kernel@vger.kernel.org
Subject: Re: [PATCH 11/11] UAPI: Check headers build for C++ [ver #2]
Date: Tue, 11 Sep 2018 01:02:59 +0800	[thread overview]
Message-ID: <201809110155.db1DzqZ4%fengguang.wu@intel.com> (raw)
In-Reply-To: <153622557736.14298.10350496216090814292.stgit@warthog.procyon.org.uk>

[-- Attachment #1: Type: text/plain, Size: 5884 bytes --]

Hi David,

I love your patch! Yet something to improve:

[auto build test ERROR on linus/master]
[also build test ERROR on v4.19-rc3 next-20180910]
[if your patch is applied to the wrong git tree, please drop us a note to help improve the system]

url:    https://github.com/0day-ci/linux/commits/David-Howells/UAPI-drm-Fix-use-of-C-keywords-as-structural-members-ver-2/20180907-092121
config: x86_64-kexec (attached as .config)
compiler: gcc-7 (Debian 7.3.0-1) 7.3.0
reproduce:
        # save the attached .config to linux build tree
        make ARCH=x86_64 

All errors (new ones prefixed by >>):

   In file included from test.h:225:0,
                    from test.cpp:1:
>> ../usr/include/linux/patchkey.h:15:2: error: #error "patchkey.h included directly"
    #error "patchkey.h included directly"
     ^~~~~
   In file included from ../usr/include/asm/shmbuf.h:6:0,
                    from test.h:83,
                    from test.cpp:1:
>> ../usr/include/asm-generic/shmbuf.h:26:20: error: field 'shm_perm' has incomplete type 'ipc64_perm'
     struct ipc64_perm shm_perm; /* operation perms */
                       ^~~~~~~~
   ../usr/include/asm-generic/shmbuf.h:26:9: note: forward declaration of 'struct ipc64_perm'
     struct ipc64_perm shm_perm; /* operation perms */
            ^~~~~~~~~~
   In file included from ../usr/include/asm/msgbuf.h:6:0,
                    from test.h:112,
                    from test.cpp:1:
>> ../usr/include/asm-generic/msgbuf.h:25:20: error: field 'msg_perm' has incomplete type 'ipc64_perm'
     struct ipc64_perm msg_perm;
                       ^~~~~~~~
   In file included from ../usr/include/asm/shmbuf.h:6:0,
                    from test.h:83,
                    from test.cpp:1:
   ../usr/include/asm-generic/shmbuf.h:26:9: note: forward declaration of 'struct ipc64_perm'
     struct ipc64_perm shm_perm; /* operation perms */
            ^~~~~~~~~~
   In file included from test.h:868:0,
                    from test.cpp:1:
   ../usr/include/sound/skl-tplg-interface.h:146:2: error: 'u32' does not name a type; did you mean '__u32'?
     u32 set_params:2;
     ^~~
     __u32
   ../usr/include/sound/skl-tplg-interface.h:147:2: error: 'u32' does not name a type; did you mean '__u32'?
     u32 rsvd:30;
     ^~~
     __u32
   ../usr/include/sound/skl-tplg-interface.h:148:2: error: 'u32' does not name a type; did you mean '__u32'?
     u32 param_id;
     ^~~
     __u32
   ../usr/include/sound/skl-tplg-interface.h:149:2: error: 'u32' does not name a type; did you mean '__u32'?
     u32 max;
     ^~~
     __u32
   ../usr/include/sound/skl-tplg-interface.h:166:2: error: 'u16' does not name a type; did you mean '__u16'?
     u16 module_id;
     ^~~
     __u16
   ../usr/include/sound/skl-tplg-interface.h:167:2: error: 'u16' does not name a type; did you mean '__u16'?
     u16 instance_id;
     ^~~
     __u16
   ../usr/include/sound/skl-tplg-interface.h:171:2: error: 'u32' does not name a type; did you mean '__u32'?
     u32 channels;
     ^~~
     __u32
   ../usr/include/sound/skl-tplg-interface.h:172:2: error: 'u32' does not name a type; did you mean '__u32'?
     u32 freq;
     ^~~
     __u32
   ../usr/include/sound/skl-tplg-interface.h:173:2: error: 'u32' does not name a type; did you mean '__u32'?
     u32 bit_depth;
     ^~~
     __u32
   ../usr/include/sound/skl-tplg-interface.h:174:2: error: 'u32' does not name a type; did you mean '__u32'?
     u32 valid_bit_depth;
     ^~~
     __u32
   ../usr/include/sound/skl-tplg-interface.h:175:2: error: 'u32' does not name a type; did you mean '__u32'?
     u32 ch_cfg;
     ^~~
     __u32
   ../usr/include/sound/skl-tplg-interface.h:176:2: error: 'u32' does not name a type; did you mean '__u32'?
     u32 interleaving_style;
     ^~~
     __u32
   ../usr/include/sound/skl-tplg-interface.h:177:2: error: 'u32' does not name a type; did you mean '__u32'?
     u32 sample_type;
     ^~~
     __u32
   ../usr/include/sound/skl-tplg-interface.h:178:2: error: 'u32' does not name a type; did you mean '__u32'?
     u32 ch_map;
     ^~~
     __u32
   ../usr/include/sound/skl-tplg-interface.h:182:2: error: 'u32' does not name a type; did you mean '__u32'?
     u32 set_params:2;
     ^~~
     __u32
   ../usr/include/sound/skl-tplg-interface.h:183:2: error: 'u32' does not name a type; did you mean '__u32'?
     u32 rsvd:30;
     ^~~
     __u32
   ../usr/include/sound/skl-tplg-interface.h:184:2: error: 'u32' does not name a type; did you mean '__u32'?
     u32 param_id;
     ^~~
     __u32
   ../usr/include/sound/skl-tplg-interface.h:185:2: error: 'u32' does not name a type; did you mean '__u32'?
     u32 caps_size;
     ^~~
     __u32
   ../usr/include/sound/skl-tplg-interface.h:186:2: error: 'u32' does not name a type; did you mean '__u32'?
     u32 caps[HDA_SST_CFG_MAX];
     ^~~
     __u32
   ../usr/include/sound/skl-tplg-interface.h:190:2: error: 'u8' does not name a type; did you mean '__u8'?
     u8 pipe_id;
     ^~
     __u8
   ../usr/include/sound/skl-tplg-interface.h:191:2: error: 'u8' does not name a type; did you mean '__u8'?
     u8 pipe_priority;
     ^~
     __u8
   ../usr/include/sound/skl-tplg-interface.h:192:2: error: 'u16' does not name a type; did you mean '__u16'?
     u16 conn_type:4;
     ^~~
     __u16
   ../usr/include/sound/skl-tplg-interface.h:193:2: error: 'u16' does not name a type; did you mean '__u16'?
     u16 rsvd:4;
--
>> find: '../usr/include': No such file or directory
   In file included from test.cpp:1:0:
>> test.h:8:10: fatal error: linux/types.h: No such file or directory
    #include <linux/types.h>
             ^~~~~~~~~~~~~~~
   compilation terminated.
   make[1]: *** [headers_install] Error 1
   make: *** [sub-make] Error 2

---
0-DAY kernel test infrastructure                Open Source Technology Center
https://lists.01.org/pipermail/kbuild-all                   Intel Corporation

[-- Attachment #2: .config.gz --]
[-- Type: application/gzip, Size: 26038 bytes --]

WARNING: multiple messages have this Message-ID
From: kbuild test robot <lkp@intel.com>
Cc: kbuild-all@01.org, linux-api@vger.kernel.org,
	linux-kbuild@vger.kernel.org,
	Masahiro Yamada <yamada.masahiro@socionext.com>,
	Michal Marek <michal.lkml@markovi.net>,
	linux-kernel@vger.kernel.org, dhowells@redhat.com
Subject: Re: [PATCH 11/11] UAPI: Check headers build for C++ [ver #2]
Date: Tue, 11 Sep 2018 01:02:59 +0800	[thread overview]
Message-ID: <201809110155.db1DzqZ4%fengguang.wu@intel.com> (raw)
In-Reply-To: <153622557736.14298.10350496216090814292.stgit@warthog.procyon.org.uk>

[-- Attachment #1: Type: text/plain, Size: 5884 bytes --]

Hi David,

I love your patch! Yet something to improve:

[auto build test ERROR on linus/master]
[also build test ERROR on v4.19-rc3 next-20180910]
[if your patch is applied to the wrong git tree, please drop us a note to help improve the system]

url:    https://github.com/0day-ci/linux/commits/David-Howells/UAPI-drm-Fix-use-of-C-keywords-as-structural-members-ver-2/20180907-092121
config: x86_64-kexec (attached as .config)
compiler: gcc-7 (Debian 7.3.0-1) 7.3.0
reproduce:
        # save the attached .config to linux build tree
        make ARCH=x86_64 

All errors (new ones prefixed by >>):

   In file included from test.h:225:0,
                    from test.cpp:1:
>> ../usr/include/linux/patchkey.h:15:2: error: #error "patchkey.h included directly"
    #error "patchkey.h included directly"
     ^~~~~
   In file included from ../usr/include/asm/shmbuf.h:6:0,
                    from test.h:83,
                    from test.cpp:1:
>> ../usr/include/asm-generic/shmbuf.h:26:20: error: field 'shm_perm' has incomplete type 'ipc64_perm'
     struct ipc64_perm shm_perm; /* operation perms */
                       ^~~~~~~~
   ../usr/include/asm-generic/shmbuf.h:26:9: note: forward declaration of 'struct ipc64_perm'
     struct ipc64_perm shm_perm; /* operation perms */
            ^~~~~~~~~~
   In file included from ../usr/include/asm/msgbuf.h:6:0,
                    from test.h:112,
                    from test.cpp:1:
>> ../usr/include/asm-generic/msgbuf.h:25:20: error: field 'msg_perm' has incomplete type 'ipc64_perm'
     struct ipc64_perm msg_perm;
                       ^~~~~~~~
   In file included from ../usr/include/asm/shmbuf.h:6:0,
                    from test.h:83,
                    from test.cpp:1:
   ../usr/include/asm-generic/shmbuf.h:26:9: note: forward declaration of 'struct ipc64_perm'
     struct ipc64_perm shm_perm; /* operation perms */
            ^~~~~~~~~~
   In file included from test.h:868:0,
                    from test.cpp:1:
   ../usr/include/sound/skl-tplg-interface.h:146:2: error: 'u32' does not name a type; did you mean '__u32'?
     u32 set_params:2;
     ^~~
     __u32
   ../usr/include/sound/skl-tplg-interface.h:147:2: error: 'u32' does not name a type; did you mean '__u32'?
     u32 rsvd:30;
     ^~~
     __u32
   ../usr/include/sound/skl-tplg-interface.h:148:2: error: 'u32' does not name a type; did you mean '__u32'?
     u32 param_id;
     ^~~
     __u32
   ../usr/include/sound/skl-tplg-interface.h:149:2: error: 'u32' does not name a type; did you mean '__u32'?
     u32 max;
     ^~~
     __u32
   ../usr/include/sound/skl-tplg-interface.h:166:2: error: 'u16' does not name a type; did you mean '__u16'?
     u16 module_id;
     ^~~
     __u16
   ../usr/include/sound/skl-tplg-interface.h:167:2: error: 'u16' does not name a type; did you mean '__u16'?
     u16 instance_id;
     ^~~
     __u16
   ../usr/include/sound/skl-tplg-interface.h:171:2: error: 'u32' does not name a type; did you mean '__u32'?
     u32 channels;
     ^~~
     __u32
   ../usr/include/sound/skl-tplg-interface.h:172:2: error: 'u32' does not name a type; did you mean '__u32'?
     u32 freq;
     ^~~
     __u32
   ../usr/include/sound/skl-tplg-interface.h:173:2: error: 'u32' does not name a type; did you mean '__u32'?
     u32 bit_depth;
     ^~~
     __u32
   ../usr/include/sound/skl-tplg-interface.h:174:2: error: 'u32' does not name a type; did you mean '__u32'?
     u32 valid_bit_depth;
     ^~~
     __u32
   ../usr/include/sound/skl-tplg-interface.h:175:2: error: 'u32' does not name a type; did you mean '__u32'?
     u32 ch_cfg;
     ^~~
     __u32
   ../usr/include/sound/skl-tplg-interface.h:176:2: error: 'u32' does not name a type; did you mean '__u32'?
     u32 interleaving_style;
     ^~~
     __u32
   ../usr/include/sound/skl-tplg-interface.h:177:2: error: 'u32' does not name a type; did you mean '__u32'?
     u32 sample_type;
     ^~~
     __u32
   ../usr/include/sound/skl-tplg-interface.h:178:2: error: 'u32' does not name a type; did you mean '__u32'?
     u32 ch_map;
     ^~~
     __u32
   ../usr/include/sound/skl-tplg-interface.h:182:2: error: 'u32' does not name a type; did you mean '__u32'?
     u32 set_params:2;
     ^~~
     __u32
   ../usr/include/sound/skl-tplg-interface.h:183:2: error: 'u32' does not name a type; did you mean '__u32'?
     u32 rsvd:30;
     ^~~
     __u32
   ../usr/include/sound/skl-tplg-interface.h:184:2: error: 'u32' does not name a type; did you mean '__u32'?
     u32 param_id;
     ^~~
     __u32
   ../usr/include/sound/skl-tplg-interface.h:185:2: error: 'u32' does not name a type; did you mean '__u32'?
     u32 caps_size;
     ^~~
     __u32
   ../usr/include/sound/skl-tplg-interface.h:186:2: error: 'u32' does not name a type; did you mean '__u32'?
     u32 caps[HDA_SST_CFG_MAX];
     ^~~
     __u32
   ../usr/include/sound/skl-tplg-interface.h:190:2: error: 'u8' does not name a type; did you mean '__u8'?
     u8 pipe_id;
     ^~
     __u8
   ../usr/include/sound/skl-tplg-interface.h:191:2: error: 'u8' does not name a type; did you mean '__u8'?
     u8 pipe_priority;
     ^~
     __u8
   ../usr/include/sound/skl-tplg-interface.h:192:2: error: 'u16' does not name a type; did you mean '__u16'?
     u16 conn_type:4;
     ^~~
     __u16
   ../usr/include/sound/skl-tplg-interface.h:193:2: error: 'u16' does not name a type; did you mean '__u16'?
     u16 rsvd:4;
--
>> find: '../usr/include': No such file or directory
   In file included from test.cpp:1:0:
>> test.h:8:10: fatal error: linux/types.h: No such file or directory
    #include <linux/types.h>
             ^~~~~~~~~~~~~~~
   compilation terminated.
   make[1]: *** [headers_install] Error 1
   make: *** [sub-make] Error 2

---
0-DAY kernel test infrastructure                Open Source Technology Center
https://lists.01.org/pipermail/kbuild-all                   Intel Corporation

[-- Attachment #2: .config.gz --]
[-- Type: application/gzip, Size: 26038 bytes --]

  parent reply	other threads:[~2018-09-10 17:03 UTC|newest]

Thread overview: 124+ messages / expand[flat|nested]  mbox.gz  Atom feed  top
2018-09-06  9:18 [RFC] UAPI: Check headers by compiling all together as C++ David Howells
2018-09-06  9:18 ` David Howells
2018-09-06  9:18 ` David Howells
2018-09-06  9:18 ` David Howells
2018-09-06  9:18 ` David Howells
     [not found] ` <153622549721.14298.8116794954073122489.stgit-S6HVgzuS8uM4Awkfq6JHfwNdhmdF6hFW@public.gmane.org>
2018-09-06  9:18   ` [PATCH 01/11] UAPI: drm: Fix use of C++ keywords as structural members [ver #2] David Howells
2018-09-06  9:18     ` David Howells
2018-09-06  9:18 ` [PATCH 02/11] UAPI: keys: " David Howells
2018-09-06  9:18   ` David Howells
2018-09-06  9:18 ` [PATCH 03/11] UAPI: virtio_net: " David Howells
2018-09-06 15:02   ` Michael S. Tsirkin
2018-09-06 15:02   ` Michael S. Tsirkin
2018-09-06  9:18 ` David Howells
2018-09-06  9:18 ` [PATCH 04/11] UAPI: bcache: Fix use of embedded flexible array " David Howells
2018-09-06  9:18 ` [PATCH 05/11] UAPI: coda: Move kernel internals out of public view " David Howells
2018-09-06  9:18   ` David Howells
2018-09-06  9:19 ` [PATCH 06/11] coda: Move internal defs out of include/linux/ " David Howells
2018-09-06  9:19 ` [PATCH 07/11] UAPI: netfilter: Fix symbol collision issues " David Howells
2018-09-10 17:32   ` kbuild test robot
2018-09-10 17:32     ` kbuild test robot
2018-09-10 17:32     ` kbuild test robot
2018-09-28 13:07   ` [netfilter-core] " Pablo Neira Ayuso
2018-10-09 15:35   ` David Howells
2018-09-06  9:19 ` [PATCH 08/11] UAPI: nilfs2: Fix use of undefined byteswapping functions " David Howells
2018-09-06  9:19 ` [PATCH 09/11] UAPI: ndctl: Fix g++-unsupported initialisation in headers " David Howells
2018-09-06  9:19   ` David Howells
2018-09-06  9:19   ` David Howells
2018-09-25 20:22   ` Dan Williams
2018-09-25 20:22     ` Dan Williams
2018-09-25 20:22     ` Dan Williams
2018-09-06  9:19 ` [PATCH 10/11] UAPI: ndctl: Remove use of PAGE_SIZE " David Howells
2018-09-06  9:19   ` David Howells
2018-09-06  9:19   ` David Howells
2018-09-25 20:17   ` Dan Williams
2018-09-25 20:17     ` Dan Williams
2018-09-25 20:17     ` Dan Williams
2018-10-09 15:36   ` David Howells
2018-10-09 15:36     ` David Howells
2018-09-06  9:19 ` [PATCH 11/11] UAPI: Check headers build for C++ " David Howells
2018-09-10 16:26   ` kbuild test robot
2018-09-10 16:26     ` kbuild test robot
2018-09-10 16:26     ` kbuild test robot
2018-09-10 17:02   ` kbuild test robot [this message]
2018-09-10 17:02     ` kbuild test robot
2018-09-10 17:02     ` kbuild test robot
2018-09-14  9:10   ` Arnd Bergmann
  -- strict thread matches above, loose matches on Subject: below --
2018-09-05 15:54 [RFC] UAPI: Check headers by compiling all together as C++ David Howells
2018-09-05 15:54 ` David Howells
2018-09-05 15:54 ` David Howells
2018-09-05 15:54 ` David Howells
2018-09-05 15:54 ` David Howells
2018-09-05 15:54 ` [PATCH 01/11] UAPI: drm: Fix use of C++ keywords as structural members David Howells
2018-09-05 15:54   ` David Howells
2018-09-05 15:54 ` [PATCH 02/11] UAPI: keys: " David Howells
2018-09-05 15:54   ` David Howells
2018-09-05 15:54 ` [PATCH 03/11] UAPI: virtio_net: " David Howells
2018-09-05 16:54   ` Greg KH
2018-09-05 16:54   ` Greg KH
2018-09-05 17:15   ` David Howells
2018-09-05 17:15   ` David Howells
2018-09-05 17:35   ` Michael S. Tsirkin
2018-09-05 17:35   ` Michael S. Tsirkin
2018-09-06  7:09   ` David Howells
2018-09-06  7:09   ` David Howells
2018-09-06 14:36     ` Michael S. Tsirkin
2018-09-06 14:36     ` Michael S. Tsirkin
2018-09-05 15:54 ` David Howells
2018-09-05 15:55 ` [PATCH 04/11] UAPI: bcache: Fix use of embedded flexible array David Howells
2018-10-02 14:52   ` Jan Engelhardt
2018-10-09 15:41   ` David Howells
2018-10-09 16:54     ` Jan Engelhardt
2018-09-05 15:55 ` [PATCH 05/11] UAPI: coda: Don't use internal kernel structs in UAPI David Howells
2018-09-05 16:54   ` Jan Harkes
2018-09-05 17:12   ` Yann Droneaud
2018-09-05 17:28     ` Jan Harkes
2018-09-05 17:28       ` Jan Harkes
2018-09-05 17:24   ` David Howells
2018-09-06  7:13   ` David Howells
2018-09-06 11:52     ` Yann Droneaud
2018-09-06 12:16       ` Jan Harkes
2018-09-06 12:16         ` Jan Harkes
2018-09-06 14:53     ` David Howells
2018-09-05 15:55 ` [PATCH 06/11] UAPI: netfilter: Fix symbol collision issues David Howells
2018-09-05 15:55 ` [PATCH 07/11] UAPI: nilfs2: Fix use of undefined byteswapping functions David Howells
2018-09-05 22:20   ` Al Viro
2018-09-05 15:55 ` [PATCH 08/11] UAPI: sound: Fix use of u32 and co. in UAPI headers David Howells
2018-09-05 15:55   ` David Howells
2018-09-06  5:59   ` Takashi Sakamoto
2018-09-06  5:59     ` Takashi Sakamoto
2018-09-06  8:17   ` David Howells
2018-09-05 15:55 ` [PATCH 09/11] UAPI: ndctl: Fix g++-unsupported initialisation in headers David Howells
2018-09-05 15:55   ` David Howells
2018-09-05 15:55   ` David Howells
2018-09-05 15:55 ` [PATCH 10/11] UAPI: ndctl: Remove use of PAGE_SIZE David Howells
2018-09-05 15:55   ` David Howells
2018-09-05 15:55 ` [PATCH 11/11] UAPI: Check headers build for C++ David Howells
2018-09-05 16:55 ` [RFC] UAPI: Check headers by compiling all together as C++ Greg KH
2018-09-05 16:55 ` Greg KH
2018-09-05 16:55   ` Greg KH
2018-09-05 16:55   ` Greg KH
2018-09-05 16:55   ` Greg KH
2018-09-05 17:33   ` Yann Droneaud
2018-09-05 17:33     ` Yann Droneaud
2018-09-05 17:33     ` Yann Droneaud
2018-09-05 17:33     ` Yann Droneaud
2018-09-05 17:42     ` Michael S. Tsirkin
2018-09-05 17:42     ` Michael S. Tsirkin
2018-09-05 17:42       ` Michael S. Tsirkin
2018-09-05 17:42       ` Michael S. Tsirkin
2018-09-05 17:42       ` Michael S. Tsirkin
2018-09-05 17:42       ` Michael S. Tsirkin
2018-09-05 17:42       ` Michael S. Tsirkin
2018-09-06  7:12     ` Yann Droneaud
2018-09-06  7:12       ` Yann Droneaud
2018-09-06  7:12       ` Yann Droneaud
2018-09-06  7:12       ` Yann Droneaud
2018-09-05 19:22   ` Jan Engelhardt
2018-09-05 19:22   ` Jan Engelhardt
2018-09-05 19:22     ` Jan Engelhardt
2018-09-05 19:22     ` Jan Engelhardt
2018-09-05 19:22     ` Jan Engelhardt
2018-09-05 17:50 ` David Howells
2018-09-05 17:50 ` David Howells
2018-09-05 17:50   ` David Howells

Reply instructions:

You may reply publicly to this message via plain-text email
using any one of the following methods:

* Save the following mbox file, import it into your mail client,
  and reply-to-all from there: mbox

  Avoid top-posting and favor interleaved quoting:
  https://en.wikipedia.org/wiki/Posting_style#Interleaved_style

* Reply using the --to, --cc, and --in-reply-to
  switches of git-send-email(1):

  git send-email \
    --in-reply-to=201809110155.db1DzqZ4%fengguang.wu@intel.com \
    --to=lkp@intel.com \
    --cc=dhowells@redhat.com \
    --cc=kbuild-all@01.org \
    --cc=linux-api@vger.kernel.org \
    --cc=linux-kbuild@vger.kernel.org \
    --cc=linux-kernel@vger.kernel.org \
    --cc=michal.lkml@markovi.net \
    --cc=yamada.masahiro@socionext.com \
    --subject='Re: [PATCH 11/11] UAPI: Check headers build for C++ [ver #2]' \
    /path/to/YOUR_REPLY

  https://kernel.org/pub/software/scm/git/docs/git-send-email.html

* If your mail client supports setting the In-Reply-To header
  via mailto: links, try the mailto: link

This is an external index of several public inboxes,
see mirroring instructions on how to clone and mirror
all data and code used by this external index.