Linux-Next Archive on lore.kernel.org
 help / color / Atom feed
* next/master build: 230 builds: 12 failed, 218 passed, 15 errors, 1179 warnings (next-20190807)
@ 2019-08-07 11:32 kernelci.org bot
  2019-08-08  1:02 ` Stephen Rothwell
  0 siblings, 1 reply; 2+ messages in thread
From: kernelci.org bot @ 2019-08-07 11:32 UTC (permalink / raw)
  To: linux-next

next/master build: 230 builds: 12 failed, 218 passed, 15 errors, 1179 warnings (next-20190807)

Full Build Summary: https://kernelci.org/build/next/branch/master/kernel/next-20190807/

Tree: next
Branch: master
Git Describe: next-20190807
Git Commit: 3880be629e26f6c407593602398c6651860d5fae
Git URL: git://git.kernel.org/pub/scm/linux/kernel/git/next/linux-next.git
Built: 7 unique architectures

Build Failures Detected:

arm64:
    allmodconfig: (clang-8) FAIL
    defconfig: (clang-8) FAIL
    defconfig+CONFIG_CPU_BIG_ENDIAN=y: (clang-8) FAIL
    defconfig+CONFIG_RANDOMIZE_BASE=y: (clang-8) FAIL
    defconfig+kselftest: (clang-8) FAIL
    allmodconfig: (gcc-8) FAIL
    defconfig: (gcc-8) FAIL
    defconfig+CONFIG_CPU_BIG_ENDIAN=y: (gcc-8) FAIL
    defconfig+CONFIG_RANDOMIZE_BASE=y: (gcc-8) FAIL
    defconfig+kselftest: (gcc-8) FAIL

arm:
    allmodconfig: (gcc-8) FAIL

mips:
    cavium_octeon_defconfig: (gcc-8) FAIL

Errors and Warnings Detected:

arc:
    allnoconfig (gcc-8): 2 warnings
    axs103_defconfig (gcc-8): 4 warnings
    axs103_smp_defconfig (gcc-8): 4 warnings
    haps_hs_defconfig (gcc-8): 4 warnings
    haps_hs_smp_defconfig (gcc-8): 4 warnings
    hsdk_defconfig (gcc-8): 4 warnings
    nsim_hs_defconfig (gcc-8): 4 warnings
    nsim_hs_defconfig (gcc-8): 12 warnings
    nsim_hs_smp_defconfig (gcc-8): 4 warnings
    nsimosci_hs_defconfig (gcc-8): 4 warnings
    nsimosci_hs_smp_defconfig (gcc-8): 4 warnings
    tinyconfig (gcc-8): 2 warnings
    vdk_hs38_defconfig (gcc-8): 3 warnings
    vdk_hs38_smp_defconfig (gcc-8): 3 warnings

arm64:
    allmodconfig (clang-8): 1 error, 34 warnings
    allmodconfig (gcc-8): 1 error, 136 warnings
    allnoconfig (gcc-8): 1 warning
    defconfig (clang-8): 1 error
    defconfig (gcc-8): 1 error, 135 warnings
    defconfig (gcc-8): 1 error, 135 warnings
    defconfig (clang-8): 1 error
    defconfig (gcc-8): 1 error, 135 warnings
    defconfig (clang-8): 1 error
    defconfig (clang-8): 1 error
    defconfig (gcc-8): 1 error, 135 warnings
    tinyconfig (gcc-8): 1 warning

arm:
    allmodconfig (gcc-8): 1 error, 2 warnings
    allnoconfig (gcc-8): 1 warning
    aspeed_g4_defconfig (gcc-8): 1 warning
    aspeed_g5_defconfig (gcc-8): 1 warning
    assabet_defconfig (gcc-8): 2 warnings
    at91_dt_defconfig (gcc-8): 2 warnings
    axm55xx_defconfig (gcc-8): 9 warnings
    badge4_defconfig (gcc-8): 2 warnings
    bcm2835_defconfig (gcc-8): 1 warning
    cerfcube_defconfig (gcc-8): 2 warnings
    clps711x_defconfig (gcc-8): 1 warning
    cns3420vb_defconfig (gcc-8): 1 warning
    collie_defconfig (gcc-8): 2 warnings
    davinci_all_defconfig (gcc-8): 1 warning
    efm32_defconfig (gcc-8): 1 warning
    ep93xx_defconfig (gcc-8): 1 warning
    exynos_defconfig (gcc-8): 1 warning
    footbridge_defconfig (gcc-8): 1 warning
    gemini_defconfig (gcc-8): 1 warning
    h3600_defconfig (gcc-8): 2 warnings
    hisi_defconfig (gcc-8): 1 warning
    imx_v4_v5_defconfig (gcc-8): 1 warning
    imx_v6_v7_defconfig (gcc-8): 1 warning
    integrator_defconfig (gcc-8): 1 warning
    ixp4xx_defconfig (gcc-8): 1 warning
    keystone_defconfig (gcc-8): 1 warning
    lpc18xx_defconfig (gcc-8): 1 warning
    lpc32xx_defconfig (gcc-8): 2 warnings
    milbeaut_m10v_defconfig (gcc-8): 1 warning
    mini2440_defconfig (gcc-8): 3 warnings
    mmp2_defconfig (gcc-8): 1 warning
    moxart_defconfig (gcc-8): 1 warning
    mps2_defconfig (gcc-8): 1 warning
    multi_v4t_defconfig (gcc-8): 1 warning
    multi_v5_defconfig (gcc-8): 2 warnings
    multi_v7_defconfig (gcc-8): 5 warnings
    multi_v7_defconfig (gcc-8): 5 warnings
    multi_v7_defconfig (gcc-8): 5 warnings
    multi_v7_defconfig (gcc-8): 5 warnings
    multi_v7_defconfig (gcc-8): 13 warnings
    mv78xx0_defconfig (gcc-8): 1 warning
    mvebu_v5_defconfig (gcc-8): 1 warning
    mvebu_v7_defconfig (gcc-8): 1 warning
    mxs_defconfig (gcc-8): 1 warning
    neponset_defconfig (gcc-8): 2 warnings
    nhk8815_defconfig (gcc-8): 1 warning
    omap2plus_defconfig (gcc-8): 1 warning
    orion5x_defconfig (gcc-8): 1 warning
    oxnas_v6_defconfig (gcc-8): 1 warning
    pleb_defconfig (gcc-8): 2 warnings
    prima2_defconfig (gcc-8): 1 warning
    pxa168_defconfig (gcc-8): 1 warning
    pxa910_defconfig (gcc-8): 1 warning
    qcom_defconfig (gcc-8): 1 warning
    realview_defconfig (gcc-8): 1 warning
    rpc_defconfig (gcc-8): 2 warnings
    s3c2410_defconfig (gcc-8): 1 warning
    s3c6400_defconfig (gcc-8): 1 warning
    s5pv210_defconfig (gcc-8): 1 warning
    sama5_defconfig (gcc-8): 2 warnings
    shannon_defconfig (gcc-8): 2 warnings
    shmobile_defconfig (gcc-8): 3 warnings
    simpad_defconfig (gcc-8): 2 warnings
    socfpga_defconfig (gcc-8): 1 warning
    spear13xx_defconfig (gcc-8): 1 warning
    spear3xx_defconfig (gcc-8): 1 warning
    spear6xx_defconfig (gcc-8): 1 warning
    stm32_defconfig (gcc-8): 1 warning
    sunxi_defconfig (gcc-8): 3 warnings
    tango4_defconfig (gcc-8): 1 warning
    tct_hammer_defconfig (gcc-8): 3 warnings
    tegra_defconfig (gcc-8): 1 warning
    tinyconfig (gcc-8): 1 warning
    u300_defconfig (gcc-8): 1 warning
    u8500_defconfig (gcc-8): 1 warning
    versatile_defconfig (gcc-8): 1 warning
    vexpress_defconfig (gcc-8): 1 warning
    vf610m4_defconfig (gcc-8): 1 warning
    vt8500_v6_v7_defconfig (gcc-8): 1 warning
    zx_defconfig (gcc-8): 1 warning

i386:
    allnoconfig (gcc-8): 1 warning
    i386_defconfig (gcc-8): 2 warnings
    i386_defconfig (gcc-8): 10 warnings
    tinyconfig (gcc-8): 1 warning

mips:
    32r2el_defconfig (gcc-8): 4 warnings
    32r2el_defconfig (gcc-8): 12 warnings
    allnoconfig (gcc-8): 2 warnings
    ar7_defconfig (gcc-8): 2 warnings
    ath25_defconfig (gcc-8): 2 warnings
    ath79_defconfig (gcc-8): 3 warnings
    bcm47xx_defconfig (gcc-8): 2 warnings
    bcm63xx_defconfig (gcc-8): 1 warning
    bigsur_defconfig (gcc-8): 6 warnings
    bmips_be_defconfig (gcc-8): 2 warnings
    bmips_stb_defconfig (gcc-8): 2 warnings
    capcella_defconfig (gcc-8): 2 warnings
    cavium_octeon_defconfig (gcc-8): 4 errors, 7 warnings
    ci20_defconfig (gcc-8): 3 warnings
    cobalt_defconfig (gcc-8): 2 warnings
    db1xxx_defconfig (gcc-8): 2 warnings
    decstation_64_defconfig (gcc-8): 6 warnings
    decstation_defconfig (gcc-8): 2 warnings
    decstation_r4k_defconfig (gcc-8): 2 warnings
    e55_defconfig (gcc-8): 2 warnings
    fuloong2e_defconfig (gcc-8): 6 warnings
    gcw0_defconfig (gcc-8): 2 warnings
    gpr_defconfig (gcc-8): 3 warnings
    ip22_defconfig (gcc-8): 2 warnings
    ip27_defconfig (gcc-8): 7 warnings
    ip28_defconfig (gcc-8): 6 warnings
    ip32_defconfig (gcc-8): 7 warnings
    jazz_defconfig (gcc-8): 2 warnings
    jmr3927_defconfig (gcc-8): 1 warning
    lasat_defconfig (gcc-8): 1 warning
    lemote2f_defconfig (gcc-8): 6 warnings
    loongson1b_defconfig (gcc-8): 2 warnings
    loongson1c_defconfig (gcc-8): 2 warnings
    loongson3_defconfig (gcc-8): 6 warnings
    malta_defconfig (gcc-8): 3 warnings
    malta_kvm_defconfig (gcc-8): 3 warnings
    malta_kvm_guest_defconfig (gcc-8): 3 warnings
    malta_qemu_32r6_defconfig (gcc-8): 4 warnings
    maltaaprp_defconfig (gcc-8): 3 warnings
    maltasmvp_defconfig (gcc-8): 3 warnings
    maltasmvp_eva_defconfig (gcc-8): 3 warnings
    maltaup_defconfig (gcc-8): 3 warnings
    maltaup_xpa_defconfig (gcc-8): 3 warnings
    markeins_defconfig (gcc-8): 3 warnings
    mips_paravirt_defconfig (gcc-8): 6 warnings
    mpc30x_defconfig (gcc-8): 2 warnings
    msp71xx_defconfig (gcc-8): 2 warnings
    mtx1_defconfig (gcc-8): 3 warnings
    nlm_xlp_defconfig (gcc-8): 8 warnings
    nlm_xlr_defconfig (gcc-8): 11 warnings
    omega2p_defconfig (gcc-8): 2 warnings
    pic32mzda_defconfig (gcc-8): 3 warnings
    pistachio_defconfig (gcc-8): 3 warnings
    pnx8335_stb225_defconfig (gcc-8): 2 warnings
    qi_lb60_defconfig (gcc-8): 4 warnings
    rb532_defconfig (gcc-8): 3 warnings
    rbtx49xx_defconfig (gcc-8): 2 warnings
    rm200_defconfig (gcc-8): 3 warnings
    rt305x_defconfig (gcc-8): 3 warnings
    sb1250_swarm_defconfig (gcc-8): 4 warnings
    tb0219_defconfig (gcc-8): 2 warnings
    tb0226_defconfig (gcc-8): 3 warnings
    tb0287_defconfig (gcc-8): 2 warnings
    tinyconfig (gcc-8): 2 warnings
    vocore2_defconfig (gcc-8): 2 warnings
    workpad_defconfig (gcc-8): 2 warnings
    xway_defconfig (gcc-8): 3 warnings

riscv:
    allnoconfig (gcc-8): 1 warning
    defconfig (gcc-8): 1 warning
    defconfig (gcc-8): 1 warning
    rv32_defconfig (gcc-8): 7 warnings
    tinyconfig (gcc-8): 1 warning

x86_64:
    allmodconfig (gcc-8): 11 warnings
    allnoconfig (gcc-8): 1 warning
    tinyconfig (gcc-8): 2 warnings
    x86_64_defconfig (gcc-8): 2 warnings
    x86_64_defconfig (gcc-8): 2 warnings

Errors summary:

    5    include/linux/build_bug.h:16:45: error: negative width in bit-field '<anonymous>'
    5    drivers/phy/rockchip/phy-rockchip-inno-hdmi.c:1046:26: error: anonymous bit-field has negative width (-1)
    2    arch/mips/include/asm/octeon/cvmx-ipd.h:331:36: error: 'CVMX_PIP_SFT_RST' undeclared (first use in this function); did you mean 'CVMX_CIU_SOFT_RST'?
    2    arch/mips/include/asm/octeon/cvmx-ipd.h:330:27: error: storage size of 'pip_sft_rst' isn't known
    1    drivers/pinctrl/aspeed/pinctrl-aspeed-g6.c:2325:9: error: initialization of 'int (*)(struct aspeed_pinmux_data *, const struct aspeed_sig_expr *, _Bool)' from incompatible pointer type 'int (*)(const struct aspeed_pinmux_data *, const struct aspeed_sig_expr *, _Bool)' [-Werror=incompatible-pointer-types]

Warnings summary:

    315  arch/arm64/include/asm/sysreg.h:808:2: warning: this statement may fall through [-Wimplicit-fallthrough=]
    193  <stdin>:1511:2: warning: #warning syscall clone3 not implemented [-Wcpp]
    122  drivers/of/platform.c:650:18: warning: ?: using integer constants in boolean context [-Wint-in-bool-context]
    20   arch/arm64/kvm/hyp/debug-sr.c:34:18: warning: this statement may fall through [-Wimplicit-fallthrough=]
    20   arch/arm64/kvm/hyp/debug-sr.c:33:18: warning: this statement may fall through [-Wimplicit-fallthrough=]
    20   arch/arm64/kvm/hyp/debug-sr.c:32:18: warning: this statement may fall through [-Wimplicit-fallthrough=]
    20   arch/arm64/kvm/hyp/debug-sr.c:31:18: warning: this statement may fall through [-Wimplicit-fallthrough=]
    20   arch/arm64/kvm/hyp/debug-sr.c:30:18: warning: this statement may fall through [-Wimplicit-fallthrough=]
    20   arch/arm64/kvm/hyp/debug-sr.c:29:18: warning: this statement may fall through [-Wimplicit-fallthrough=]
    20   arch/arm64/kvm/hyp/debug-sr.c:28:18: warning: this statement may fall through [-Wimplicit-fallthrough=]
    20   arch/arm64/kvm/hyp/debug-sr.c:27:18: warning: this statement may fall through [-Wimplicit-fallthrough=]
    20   arch/arm64/kvm/hyp/debug-sr.c:26:18: warning: this statement may fall through [-Wimplicit-fallthrough=]
    20   arch/arm64/kvm/hyp/debug-sr.c:25:19: warning: this statement may fall through [-Wimplicit-fallthrough=]
    20   arch/arm64/kvm/hyp/debug-sr.c:24:19: warning: this statement may fall through [-Wimplicit-fallthrough=]
    20   arch/arm64/kvm/hyp/debug-sr.c:23:19: warning: this statement may fall through [-Wimplicit-fallthrough=]
    20   arch/arm64/kvm/hyp/debug-sr.c:22:19: warning: this statement may fall through [-Wimplicit-fallthrough=]
    20   arch/arm64/kvm/hyp/debug-sr.c:21:19: warning: this statement may fall through [-Wimplicit-fallthrough=]
    20   arch/arm64/kvm/hyp/debug-sr.c:20:19: warning: this statement may fall through [-Wimplicit-fallthrough=]
    12   include/linux/compiler.h:328:5: warning: this statement may fall through [-Wimplicit-fallthrough=]
    12   1 warning generated.
    11   drivers/gpu/drm/sun4i/sun4i_tcon.c:318:7: warning: this statement may fall through [-Wimplicit-fallthrough=]
    9    printk(KERN_WARNING "SA1100 flash: unknown base address "
    9    include/linux/printk.h:309:2: warning: this statement may fall through [-Wimplicit-fallthrough=]
    9    include/linux/build_bug.h:49: warning: "BUILD_BUG_ON" redefined
    9    drivers/mtd/maps/sa1100-flash.c:82:3: warning: this statement may fall through [-Wimplicit-fallthrough=]
    7    drivers/gpu/drm/sun4i/sun6i_mipi_dsi.c:993:6: warning: this statement may fall through [-Wimplicit-fallthrough=]
    6    drivers/video/fbdev/sh_mobile_lcdcfb.c:2086:22: warning: this statement may fall through [-Wimplicit-fallthrough=]
    6    drivers/video/fbdev/sh_mobile_lcdcfb.c:1596:22: warning: this statement may fall through [-Wimplicit-fallthrough=]
    5    include/linux/kern_levels.h:5:18: warning: format '%lu' expects argument of type 'long unsigned int', but argument 8 has type 'unsigned int' [-Wformat=]
    5    fs/btrfs/tree-checker.c:1216:10: warning: cast to pointer from integer of different size [-Wint-to-pointer-cast]
    5    fs/btrfs/tree-checker.c:1200:50: warning: format '%lu' expects argument of type 'long unsigned int', but argument 5 has type 'unsigned int' [-Wformat=]
    5    fs/btrfs/tree-checker.c:1083:10: warning: cast to pointer from integer of different size [-Wint-to-pointer-cast]
    5    fs/btrfs/tree-checker.c:1065:9: warning: cast from pointer to integer of different size [-Wpointer-to-int-cast]
    5    fs/btrfs/tree-checker.c:1057:10: warning: cast to pointer from integer of different size [-Wint-to-pointer-cast]
    5    fs/btrfs/tree-checker.c:1051:8: warning: cast from pointer to integer of different size [-Wpointer-to-int-cast]
    5    fs/btrfs/tree-checker.c:1003:47: warning: format '%lu' expects argument of type 'long unsigned int', but argument 5 has type 'unsigned int' [-Wformat=]
    5    drivers/iommu/arm-smmu-v3.c:1189:7: warning: this statement may fall through [-Wimplicit-fallthrough=]
    5    arch/arm64/kvm/hyp/../../../../virt/kvm/arm/hyp/vgic-v3-sr.c:396:3: warning: this statement may fall through [-Wimplicit-fallthrough=]
    5    arch/arm64/kvm/hyp/../../../../virt/kvm/arm/hyp/vgic-v3-sr.c:394:3: warning: this statement may fall through [-Wimplicit-fallthrough=]
    5    arch/arm64/kvm/hyp/../../../../virt/kvm/arm/hyp/vgic-v3-sr.c:386:3: warning: this statement may fall through [-Wimplicit-fallthrough=]
    5    arch/arm64/kvm/hyp/../../../../virt/kvm/arm/hyp/vgic-v3-sr.c:384:3: warning: this statement may fall through [-Wimplicit-fallthrough=]
    5    arch/arm64/kvm/hyp/../../../../virt/kvm/arm/hyp/vgic-v3-sr.c:363:24: warning: this statement may fall through [-Wimplicit-fallthrough=]
    5    arch/arm64/kvm/hyp/../../../../virt/kvm/arm/hyp/vgic-v3-sr.c:361:24: warning: this statement may fall through [-Wimplicit-fallthrough=]
    5    arch/arm64/kvm/hyp/../../../../virt/kvm/arm/hyp/vgic-v3-sr.c:353:24: warning: this statement may fall through [-Wimplicit-fallthrough=]
    5    arch/arm64/kvm/hyp/../../../../virt/kvm/arm/hyp/vgic-v3-sr.c:351:24: warning: this statement may fall through [-Wimplicit-fallthrough=]
    5    arch/arm64/include/asm/kvm_hyp.h:31:3: warning: this statement may fall through [-Wimplicit-fallthrough=]
    3    drivers/usb/gadget/udc/atmel_usba_udc.c:329:13: warning: this statement may fall through [-Wimplicit-fallthrough=]
    3    2 warnings generated.
    2    drivers/watchdog/jz4740_wdt.c:165:6: warning: unused variable 'ret' [-Wunused-variable]
    2    drivers/usb/gadget/udc/s3c2410_udc.c:418:7: warning: this statement may fall through [-Wimplicit-fallthrough=]
    2    drivers/usb/gadget/udc/s3c2410_udc.c:314:7: warning: this statement may fall through [-Wimplicit-fallthrough=]
    2    arch/x86/kernel/apic/probe_32.c:146:7: warning: this statement may fall through [-Wimplicit-fallthrough=]
    2    arch/mips/include/asm/octeon/cvmx-ipd.h:330:27: warning: unused variable 'pip_sft_rst' [-Wunused-variable]
    2    <stdin>:830:2: warning: #warning syscall fstat64 not implemented [-Wcpp]
    2    <stdin>:1127:2: warning: #warning syscall fstatat64 not implemented [-Wcpp]
    1    {standard input}:134: Warning: macro instruction expanded into multiple instructions
    1    net/nfc/hci/llc_shdlc.c:687:34: warning: variable 'connect_wq' is uninitialized when used within its own initialization [-Wuninitialized]
    1    net/nfc/hci/command.c:59:34: warning: variable 'ew_wq' is uninitialized when used within its own initialization [-Wuninitialized]
    1    mm/shmem.c:2734:35: warning: variable 'shmem_falloc_waitq' is uninitialized when used within its own initialization [-Wuninitialized]
    1    fs/proc/proc_sysctl.c:705:35: warning: variable 'wq' is uninitialized when used within its own initialization [-Wuninitialized]
    1    fs/proc/base.c:1894:35: warning: variable 'wq' is uninitialized when used within its own initialization [-Wuninitialized]
    1    fs/ocfs2/dlm/dlmdomain.c:2038:14: warning: variable 'ret' is used uninitialized whenever 'for' loop exits because its condition is false [-Wsometimes-uninitialized]
    1    fs/ocfs2/dlm/dlmdomain.c:1952:9: note: initialize the variable 'ret' to silence this warning
    1    fs/nfs/dir.c:448:34: warning: variable 'wq' is uninitialized when used within its own initialization [-Wuninitialized]
    1    fs/nfs/dir.c:1499:34: warning: variable 'wq' is uninitialized when used within its own initialization [-Wuninitialized]
    1    fs/namei.c:3136:34: warning: variable 'wq' is uninitialized when used within its own initialization [-Wuninitialized]
    1    fs/namei.c:1646:34: warning: variable 'wq' is uninitialized when used within its own initialization [-Wuninitialized]
    1    fs/fuse/readdir.c:161:34: warning: variable 'wq' is uninitialized when used within its own initialization [-Wuninitialized]
    1    fs/cifs/readdir.c:83:34: warning: variable 'wq' is uninitialized when used within its own initialization [-Wuninitialized]
    1    fs/afs/dir_silly.c:205:34: warning: variable 'wq' is uninitialized when used within its own initialization [-Wuninitialized]
    1    drivers/watchdog/wdt285.c:170:3: warning: this statement may fall through [-Wimplicit-fallthrough=]
    1    drivers/video/fbdev/acornfb.c:860:9: warning: this statement may fall through [-Wimplicit-fallthrough=]
    1    drivers/usb/gadget/udc/lpc32xx_udc.c:2231:3: warning: this statement may fall through [-Wimplicit-fallthrough=]
    1    drivers/soc/qcom/socinfo.c:366:3: warning: this statement may fall through [-Wimplicit-fallthrough=]
    1    drivers/soc/qcom/socinfo.c:360:3: warning: this statement may fall through [-Wimplicit-fallthrough=]
    1    drivers/soc/qcom/socinfo.c:354:3: warning: this statement may fall through [-Wimplicit-fallthrough=]
    1    drivers/soc/qcom/socinfo.c:348:3: warning: this statement may fall through [-Wimplicit-fallthrough=]
    1    drivers/soc/qcom/socinfo.c:341:3: warning: this statement may fall through [-Wimplicit-fallthrough=]
    1    drivers/soc/qcom/socinfo.c:331:3: warning: this statement may fall through [-Wimplicit-fallthrough=]
    1    drivers/soc/qcom/socinfo.c:323:3: warning: this statement may fall through [-Wimplicit-fallthrough=]
    1    drivers/soc/qcom/socinfo.c:231:2: warning: this statement may fall through [-Wimplicit-fallthrough=]
    1    drivers/net/usb/lan78xx.c:2662:34: warning: variable 'unlink_wakeup' is uninitialized when used within its own initialization [-Wuninitialized]
    1    drivers/mtd/nand/raw/au1550nd.c:443:57: warning: pointer type mismatch in conditional expression
    1    drivers/misc/mic/vop/vop_vringh.c:399:34: warning: variable 'wake' is uninitialized when used within its own initialization [-Wuninitialized]
    1    drivers/misc/mic/vop/vop_vringh.c:155:34: warning: variable 'wake' is uninitialized when used within its own initialization [-Wuninitialized]
    1    drivers/gpu/host1x/syncpt.c:208:34: warning: variable 'wq' is uninitialized when used within its own initialization [-Wuninitialized]
    1    drivers/gpu/drm/i915/gem/i915_gem_execbuffer.o: warning: objtool: .altinstr_replacement+0x36: redundant UACCESS disable
    1    drivers/gpu/drm/i915/gem/i915_gem_execbuffer.o: warning: objtool: .altinstr_replacement+0x34: redundant UACCESS disable
    1    drivers/gpu/drm/i915/gem/i915_gem_execbuffer.o: warning: objtool: .altinstr_replacement+0x1c: redundant UACCESS disable
    1    drivers/bluetooth/bluecard_cs.c:282:36: warning: variable 'wq' is uninitialized when used within its own initialization [-Wuninitialized]
    1    drivers/ata/pata_rb532_cf.c:161:24: warning: unused variable 'info' [-Wunused-variable]
    1    cc1: some warnings being treated as errors
    1    arch/mips/include/asm/octeon/cvmx-sli-defs.h:47:6: warning: this statement may fall through [-Wimplicit-fallthrough=]
    1    arch/arm/mach-rpc/riscpc.c:48:13: warning: this statement may fall through [-Wimplicit-fallthrough=]
    1    arch/arm/mach-ep93xx/crunch.c:46:3: warning: this statement may fall through [-Wimplicit-fallthrough=]
    1    arch/arm/kvm/hyp/../../../../virt/kvm/arm/hyp/vgic-v3-sr.c:396:3: warning: this statement may fall through [-Wimplicit-fallthrough=]
    1    arch/arm/kvm/hyp/../../../../virt/kvm/arm/hyp/vgic-v3-sr.c:394:3: warning: this statement may fall through [-Wimplicit-fallthrough=]
    1    arch/arm/kvm/hyp/../../../../virt/kvm/arm/hyp/vgic-v3-sr.c:386:3: warning: this statement may fall through [-Wimplicit-fallthrough=]
    1    arch/arm/kvm/hyp/../../../../virt/kvm/arm/hyp/vgic-v3-sr.c:384:3: warning: this statement may fall through [-Wimplicit-fallthrough=]
    1    arch/arm/kvm/hyp/../../../../virt/kvm/arm/hyp/vgic-v3-sr.c:363:24: warning: this statement may fall through [-Wimplicit-fallthrough=]
    1    arch/arm/kvm/hyp/../../../../virt/kvm/arm/hyp/vgic-v3-sr.c:361:24: warning: this statement may fall through [-Wimplicit-fallthrough=]
    1    arch/arm/kvm/hyp/../../../../virt/kvm/arm/hyp/vgic-v3-sr.c:353:24: warning: this statement may fall through [-Wimplicit-fallthrough=]
    1    arch/arm/kvm/hyp/../../../../virt/kvm/arm/hyp/vgic-v3-sr.c:351:24: warning: this statement may fall through [-Wimplicit-fallthrough=]
    1    .config:1177:warning: override: UNWINDER_GUESS changes choice state

================================================================================

Detailed per-defconfig build reports:

--------------------------------------------------------------------------------
32r2el_defconfig (mips, gcc-8) — PASS, 0 errors, 4 warnings, 0 section mismatches

Warnings:
    <stdin>:1511:2: warning: #warning syscall clone3 not implemented [-Wcpp]
    drivers/of/platform.c:650:18: warning: ?: using integer constants in boolean context [-Wint-in-bool-context]
    <stdin>:1511:2: warning: #warning syscall clone3 not implemented [-Wcpp]
    <stdin>:1511:2: warning: #warning syscall clone3 not implemented [-Wcpp]

--------------------------------------------------------------------------------
32r2el_defconfig+kselftest (mips, gcc-8) — PASS, 0 errors, 12 warnings, 0 section mismatches

Warnings:
    <stdin>:1511:2: warning: #warning syscall clone3 not implemented [-Wcpp]
    include/linux/kern_levels.h:5:18: warning: format '%lu' expects argument of type 'long unsigned int', but argument 8 has type 'unsigned int' [-Wformat=]
    fs/btrfs/tree-checker.c:1003:47: warning: format '%lu' expects argument of type 'long unsigned int', but argument 5 has type 'unsigned int' [-Wformat=]
    fs/btrfs/tree-checker.c:1051:8: warning: cast from pointer to integer of different size [-Wpointer-to-int-cast]
    fs/btrfs/tree-checker.c:1057:10: warning: cast to pointer from integer of different size [-Wint-to-pointer-cast]
    fs/btrfs/tree-checker.c:1065:9: warning: cast from pointer to integer of different size [-Wpointer-to-int-cast]
    fs/btrfs/tree-checker.c:1083:10: warning: cast to pointer from integer of different size [-Wint-to-pointer-cast]
    fs/btrfs/tree-checker.c:1200:50: warning: format '%lu' expects argument of type 'long unsigned int', but argument 5 has type 'unsigned int' [-Wformat=]
    fs/btrfs/tree-checker.c:1216:10: warning: cast to pointer from integer of different size [-Wint-to-pointer-cast]
    drivers/of/platform.c:650:18: warning: ?: using integer constants in boolean context [-Wint-in-bool-context]
    <stdin>:1511:2: warning: #warning syscall clone3 not implemented [-Wcpp]
    <stdin>:1511:2: warning: #warning syscall clone3 not implemented [-Wcpp]

--------------------------------------------------------------------------------
acs5k_defconfig (arm, gcc-8) — PASS, 0 errors, 0 warnings, 0 section mismatches

--------------------------------------------------------------------------------
acs5k_tiny_defconfig (arm, gcc-8) — PASS, 0 errors, 0 warnings, 0 section mismatches

--------------------------------------------------------------------------------
allmodconfig (arm, gcc-8) — FAIL, 1 error, 2 warnings, 0 section mismatches

Errors:
    drivers/pinctrl/aspeed/pinctrl-aspeed-g6.c:2325:9: error: initialization of 'int (*)(struct aspeed_pinmux_data *, const struct aspeed_sig_expr *, _Bool)' from incompatible pointer type 'int (*)(const struct aspeed_pinmux_data *, const struct aspeed_sig_expr *, _Bool)' [-Werror=incompatible-pointer-types]

Warnings:
    drivers/of/platform.c:650:18: warning: ?: using integer constants in boolean context [-Wint-in-bool-context]
    cc1: some warnings being treated as errors

--------------------------------------------------------------------------------
allmodconfig (arm64, clang-8) — FAIL, 1 error, 34 warnings, 0 section mismatches

Errors:
    drivers/phy/rockchip/phy-rockchip-inno-hdmi.c:1046:26: error: anonymous bit-field has negative width (-1)

Warnings:
    mm/shmem.c:2734:35: warning: variable 'shmem_falloc_waitq' is uninitialized when used within its own initialization [-Wuninitialized]
    1 warning generated.
    fs/proc/base.c:1894:35: warning: variable 'wq' is uninitialized when used within its own initialization [-Wuninitialized]
    1 warning generated.
    fs/proc/proc_sysctl.c:705:35: warning: variable 'wq' is uninitialized when used within its own initialization [-Wuninitialized]
    1 warning generated.
    fs/namei.c:1646:34: warning: variable 'wq' is uninitialized when used within its own initialization [-Wuninitialized]
    fs/namei.c:3136:34: warning: variable 'wq' is uninitialized when used within its own initialization [-Wuninitialized]
    2 warnings generated.
    fs/afs/dir_silly.c:205:34: warning: variable 'wq' is uninitialized when used within its own initialization [-Wuninitialized]
    1 warning generated.
    fs/cifs/readdir.c:83:34: warning: variable 'wq' is uninitialized when used within its own initialization [-Wuninitialized]
    1 warning generated.
    fs/fuse/readdir.c:161:34: warning: variable 'wq' is uninitialized when used within its own initialization [-Wuninitialized]
    1 warning generated.
    drivers/bluetooth/bluecard_cs.c:282:36: warning: variable 'wq' is uninitialized when used within its own initialization [-Wuninitialized]
    1 warning generated.
    fs/nfs/dir.c:448:34: warning: variable 'wq' is uninitialized when used within its own initialization [-Wuninitialized]
    fs/nfs/dir.c:1499:34: warning: variable 'wq' is uninitialized when used within its own initialization [-Wuninitialized]
    2 warnings generated.
    fs/ocfs2/dlm/dlmdomain.c:2038:14: warning: variable 'ret' is used uninitialized whenever 'for' loop exits because its condition is false [-Wsometimes-uninitialized]
    fs/ocfs2/dlm/dlmdomain.c:1952:9: note: initialize the variable 'ret' to silence this warning
    1 warning generated.
    drivers/gpu/host1x/syncpt.c:208:34: warning: variable 'wq' is uninitialized when used within its own initialization [-Wuninitialized]
    1 warning generated.
    net/nfc/hci/command.c:59:34: warning: variable 'ew_wq' is uninitialized when used within its own initialization [-Wuninitialized]
    1 warning generated.
    net/nfc/hci/llc_shdlc.c:687:34: warning: variable 'connect_wq' is uninitialized when used within its own initialization [-Wuninitialized]
    1 warning generated.
    drivers/misc/mic/vop/vop_vringh.c:155:34: warning: variable 'wake' is uninitialized when used within its own initialization [-Wuninitialized]
    drivers/misc/mic/vop/vop_vringh.c:399:34: warning: variable 'wake' is uninitialized when used within its own initialization [-Wuninitialized]
    2 warnings generated.
    drivers/net/usb/lan78xx.c:2662:34: warning: variable 'unlink_wakeup' is uninitialized when used within its own initialization [-Wuninitialized]
    1 warning generated.

--------------------------------------------------------------------------------
allmodconfig (arm64, gcc-8) — FAIL, 1 error, 136 warnings, 0 section mismatches

Errors:
    include/linux/build_bug.h:16:45: error: negative width in bit-field '<anonymous>'

Warnings:
    arch/arm64/kvm/hyp/../../../../virt/kvm/arm/hyp/vgic-v3-sr.c:351:24: warning: this statement may fall through [-Wimplicit-fallthrough=]
    arch/arm64/kvm/hyp/../../../../virt/kvm/arm/hyp/vgic-v3-sr.c:353:24: warning: this statement may fall through [-Wimplicit-fallthrough=]
    arch/arm64/kvm/hyp/../../../../virt/kvm/arm/hyp/vgic-v3-sr.c:361:24: warning: this statement may fall through [-Wimplicit-fallthrough=]
    arch/arm64/kvm/hyp/../../../../virt/kvm/arm/hyp/vgic-v3-sr.c:363:24: warning: this statement may fall through [-Wimplicit-fallthrough=]
    arch/arm64/kvm/hyp/../../../../virt/kvm/arm/hyp/vgic-v3-sr.c:384:3: warning: this statement may fall through [-Wimplicit-fallthrough=]
    arch/arm64/kvm/hyp/../../../../virt/kvm/arm/hyp/vgic-v3-sr.c:386:3: warning: this statement may fall through [-Wimplicit-fallthrough=]
    arch/arm64/kvm/hyp/../../../../virt/kvm/arm/hyp/vgic-v3-sr.c:394:3: warning: this statement may fall through [-Wimplicit-fallthrough=]
    arch/arm64/kvm/hyp/../../../../virt/kvm/arm/hyp/vgic-v3-sr.c:396:3: warning: this statement may fall through [-Wimplicit-fallthrough=]
    arch/arm64/kvm/hyp/debug-sr.c:20:19: warning: this statement may fall through [-Wimplicit-fallthrough=]
    arch/arm64/kvm/hyp/debug-sr.c:21:19: warning: this statement may fall through [-Wimplicit-fallthrough=]
    arch/arm64/kvm/hyp/debug-sr.c:22:19: warning: this statement may fall through [-Wimplicit-fallthrough=]
    arch/arm64/kvm/hyp/debug-sr.c:23:19: warning: this statement may fall through [-Wimplicit-fallthrough=]
    arch/arm64/kvm/hyp/debug-sr.c:24:19: warning: this statement may fall through [-Wimplicit-fallthrough=]
    arch/arm64/kvm/hyp/debug-sr.c:25:19: warning: this statement may fall through [-Wimplicit-fallthrough=]
    arch/arm64/kvm/hyp/debug-sr.c:26:18: warning: this statement may fall through [-Wimplicit-fallthrough=]
    arch/arm64/kvm/hyp/debug-sr.c:27:18: warning: this statement may fall through [-Wimplicit-fallthrough=]
    arch/arm64/kvm/hyp/debug-sr.c:28:18: warning: this statement may fall through [-Wimplicit-fallthrough=]
    arch/arm64/kvm/hyp/debug-sr.c:29:18: warning: this statement may fall through [-Wimplicit-fallthrough=]
    arch/arm64/kvm/hyp/debug-sr.c:30:18: warning: this statement may fall through [-Wimplicit-fallthrough=]
    arch/arm64/kvm/hyp/debug-sr.c:31:18: warning: this statement may fall through [-Wimplicit-fallthrough=]
    arch/arm64/kvm/hyp/debug-sr.c:32:18: warning: this statement may fall through [-Wimplicit-fallthrough=]
    arch/arm64/kvm/hyp/debug-sr.c:33:18: warning: this statement may fall through [-Wimplicit-fallthrough=]
    arch/arm64/kvm/hyp/debug-sr.c:34:18: warning: this statement may fall through [-Wimplicit-fallthrough=]
    arch/arm64/kvm/hyp/debug-sr.c:20:19: warning: this statement may fall through [-Wimplicit-fallthrough=]
    arch/arm64/kvm/hyp/debug-sr.c:21:19: warning: this statement may fall through [-Wimplicit-fallthrough=]
    arch/arm64/kvm/hyp/debug-sr.c:22:19: warning: this statement may fall through [-Wimplicit-fallthrough=]
    arch/arm64/kvm/hyp/debug-sr.c:23:19: warning: this statement may fall through [-Wimplicit-fallthrough=]
    arch/arm64/kvm/hyp/debug-sr.c:24:19: warning: this statement may fall through [-Wimplicit-fallthrough=]
    arch/arm64/kvm/hyp/debug-sr.c:25:19: warning: this statement may fall through [-Wimplicit-fallthrough=]
    arch/arm64/kvm/hyp/debug-sr.c:26:18: warning: this statement may fall through [-Wimplicit-fallthrough=]
    arch/arm64/kvm/hyp/debug-sr.c:27:18: warning: this statement may fall through [-Wimplicit-fallthrough=]
    arch/arm64/kvm/hyp/debug-sr.c:28:18: warning: this statement may fall through [-Wimplicit-fallthrough=]
    arch/arm64/kvm/hyp/debug-sr.c:29:18: warning: this statement may fall through [-Wimplicit-fallthrough=]
    arch/arm64/kvm/hyp/debug-sr.c:30:18: warning: this statement may fall through [-Wimplicit-fallthrough=]
    arch/arm64/kvm/hyp/debug-sr.c:31:18: warning: this statement may fall through [-Wimplicit-fallthrough=]
    arch/arm64/kvm/hyp/debug-sr.c:32:18: warning: this statement may fall through [-Wimplicit-fallthrough=]
    arch/arm64/kvm/hyp/debug-sr.c:33:18: warning: this statement may fall through [-Wimplicit-fallthrough=]
    arch/arm64/kvm/hyp/debug-sr.c:34:18: warning: this statement may fall through [-Wimplicit-fallthrough=]
    arch/arm64/kvm/hyp/debug-sr.c:20:19: warning: this statement may fall through [-Wimplicit-fallthrough=]
    arch/arm64/kvm/hyp/debug-sr.c:21:19: warning: this statement may fall through [-Wimplicit-fallthrough=]
    arch/arm64/kvm/hyp/debug-sr.c:22:19: warning: this statement may fall through [-Wimplicit-fallthrough=]
    arch/arm64/kvm/hyp/debug-sr.c:23:19: warning: this statement may fall through [-Wimplicit-fallthrough=]
    arch/arm64/kvm/hyp/debug-sr.c:24:19: warning: this statement may fall through [-Wimplicit-fallthrough=]
    arch/arm64/kvm/hyp/debug-sr.c:25:19: warning: this statement may fall through [-Wimplicit-fallthrough=]
    arch/arm64/kvm/hyp/debug-sr.c:26:18: warning: this statement may fall through [-Wimplicit-fallthrough=]
    arch/arm64/kvm/hyp/debug-sr.c:27:18: warning: this statement may fall through [-Wimplicit-fallthrough=]
    arch/arm64/kvm/hyp/debug-sr.c:28:18: warning: this statement may fall through [-Wimplicit-fallthrough=]
    arch/arm64/kvm/hyp/debug-sr.c:29:18: warning: this statement may fall through [-Wimplicit-fallthrough=]
    arch/arm64/kvm/hyp/debug-sr.c:30:18: warning: this statement may fall through [-Wimplicit-fallthrough=]
    arch/arm64/kvm/hyp/debug-sr.c:31:18: warning: this statement may fall through [-Wimplicit-fallthrough=]
    arch/arm64/kvm/hyp/debug-sr.c:32:18: warning: this statement may fall through [-Wimplicit-fallthrough=]
    arch/arm64/kvm/hyp/debug-sr.c:33:18: warning: this statement may fall through [-Wimplicit-fallthrough=]
    arch/arm64/kvm/hyp/debug-sr.c:34:18: warning: this statement may fall through [-Wimplicit-fallthrough=]
    arch/arm64/kvm/hyp/debug-sr.c:20:19: warning: this statement may fall through [-Wimplicit-fallthrough=]
    arch/arm64/kvm/hyp/debug-sr.c:21:19: warning: this statement may fall through [-Wimplicit-fallthrough=]
    arch/arm64/kvm/hyp/debug-sr.c:22:19: warning: this statement may fall through [-Wimplicit-fallthrough=]
    arch/arm64/kvm/hyp/debug-sr.c:23:19: warning: this statement may fall through [-Wimplicit-fallthrough=]
    arch/arm64/kvm/hyp/debug-sr.c:24:19: warning: this statement may fall through [-Wimplicit-fallthrough=]
    arch/arm64/kvm/hyp/debug-sr.c:25:19: warning: this statement may fall through [-Wimplicit-fallthrough=]
    arch/arm64/kvm/hyp/debug-sr.c:26:18: warning: this statement may fall through [-Wimplicit-fallthrough=]
    arch/arm64/kvm/hyp/debug-sr.c:27:18: warning: this statement may fall through [-Wimplicit-fallthrough=]
    arch/arm64/kvm/hyp/debug-sr.c:28:18: warning: this statement may fall through [-Wimplicit-fallthrough=]
    arch/arm64/kvm/hyp/debug-sr.c:29:18: warning: this statement may fall through [-Wimplicit-fallthrough=]
    arch/arm64/kvm/hyp/debug-sr.c:30:18: warning: this statement may fall through [-Wimplicit-fallthrough=]
    arch/arm64/kvm/hyp/debug-sr.c:31:18: warning: this statement may fall through [-Wimplicit-fallthrough=]
    arch/arm64/kvm/hyp/debug-sr.c:32:18: warning: this statement may fall through [-Wimplicit-fallthrough=]
    arch/arm64/kvm/hyp/debug-sr.c:33:18: warning: this statement may fall through [-Wimplicit-fallthrough=]
    arch/arm64/kvm/hyp/debug-sr.c:34:18: warning: this statement may fall through [-Wimplicit-fallthrough=]
    arch/arm64/include/asm/sysreg.h:808:2: warning: this statement may fall through [-Wimplicit-fallthrough=]
    arch/arm64/include/asm/sysreg.h:808:2: warning: this statement may fall through [-Wimplicit-fallthrough=]
    arch/arm64/include/asm/sysreg.h:808:2: warning: this statement may fall through [-Wimplicit-fallthrough=]
    arch/arm64/include/asm/sysreg.h:808:2: warning: this statement may fall through [-Wimplicit-fallthrough=]
    arch/arm64/include/asm/sysreg.h:808:2: warning: this statement may fall through [-Wimplicit-fallthrough=]
    arch/arm64/include/asm/sysreg.h:808:2: warning: this statement may fall through [-Wimplicit-fallthrough=]
    arch/arm64/include/asm/sysreg.h:808:2: warning: this statement may fall through [-Wimplicit-fallthrough=]
    arch/arm64/include/asm/sysreg.h:808:2: warning: this statement may fall through [-Wimplicit-fallthrough=]
    arch/arm64/include/asm/sysreg.h:808:2: warning: this statement may fall through [-Wimplicit-fallthrough=]
    arch/arm64/include/asm/sysreg.h:808:2: warning: this statement may fall through [-Wimplicit-fallthrough=]
    arch/arm64/include/asm/sysreg.h:808:2: warning: this statement may fall through [-Wimplicit-fallthrough=]
    arch/arm64/include/asm/sysreg.h:808:2: warning: this statement may fall through [-Wimplicit-fallthrough=]
    arch/arm64/include/asm/sysreg.h:808:2: warning: this statement may fall through [-Wimplicit-fallthrough=]
    arch/arm64/include/asm/sysreg.h:808:2: warning: this statement may fall through [-Wimplicit-fallthrough=]
    arch/arm64/include/asm/sysreg.h:808:2: warning: this statement may fall through [-Wimplicit-fallthrough=]
    arch/arm64/include/asm/sysreg.h:808:2: warning: this statement may fall through [-Wimplicit-fallthrough=]
    arch/arm64/include/asm/sysreg.h:808:2: warning: this statement may fall through [-Wimplicit-fallthrough=]
    arch/arm64/include/asm/sysreg.h:808:2: warning: this statement may fall through [-Wimplicit-fallthrough=]
    arch/arm64/include/asm/sysreg.h:808:2: warning: this statement may fall through [-Wimplicit-fallthrough=]
    arch/arm64/include/asm/sysreg.h:808:2: warning: this statement may fall through [-Wimplicit-fallthrough=]
    arch/arm64/include/asm/sysreg.h:808:2: warning: this statement may fall through [-Wimplicit-fallthrough=]
    arch/arm64/include/asm/sysreg.h:808:2: warning: this statement may fall through [-Wimplicit-fallthrough=]
    arch/arm64/include/asm/sysreg.h:808:2: warning: this statement may fall through [-Wimplicit-fallthrough=]
    arch/arm64/include/asm/sysreg.h:808:2: warning: this statement may fall through [-Wimplicit-fallthrough=]
    arch/arm64/include/asm/sysreg.h:808:2: warning: this statement may fall through [-Wimplicit-fallthrough=]
    arch/arm64/include/asm/sysreg.h:808:2: warning: this statement may fall through [-Wimplicit-fallthrough=]
    arch/arm64/include/asm/sysreg.h:808:2: warning: this statement may fall through [-Wimplicit-fallthrough=]
    arch/arm64/include/asm/sysreg.h:808:2: warning: this statement may fall through [-Wimplicit-fallthrough=]
    arch/arm64/include/asm/sysreg.h:808:2: warning: this statement may fall through [-Wimplicit-fallthrough=]
    arch/arm64/include/asm/sysreg.h:808:2: warning: this statement may fall through [-Wimplicit-fallthrough=]
    arch/arm64/include/asm/sysreg.h:808:2: warning: this statement may fall through [-Wimplicit-fallthrough=]
    arch/arm64/include/asm/sysreg.h:808:2: warning: this statement may fall through [-Wimplicit-fallthrough=]
    arch/arm64/include/asm/sysreg.h:808:2: warning: this statement may fall through [-Wimplicit-fallthrough=]
    arch/arm64/include/asm/sysreg.h:808:2: warning: this statement may fall through [-Wimplicit-fallthrough=]
    arch/arm64/include/asm/sysreg.h:808:2: warning: this statement may fall through [-Wimplicit-fallthrough=]
    arch/arm64/include/asm/sysreg.h:808:2: warning: this statement may fall through [-Wimplicit-fallthrough=]
    arch/arm64/include/asm/sysreg.h:808:2: warning: this statement may fall through [-Wimplicit-fallthrough=]
    arch/arm64/include/asm/sysreg.h:808:2: warning: this statement may fall through [-Wimplicit-fallthrough=]
    arch/arm64/include/asm/sysreg.h:808:2: warning: this statement may fall through [-Wimplicit-fallthrough=]
    arch/arm64/include/asm/sysreg.h:808:2: warning: this statement may fall through [-Wimplicit-fallthrough=]
    arch/arm64/include/asm/sysreg.h:808:2: warning: this statement may fall through [-Wimplicit-fallthrough=]
    arch/arm64/include/asm/sysreg.h:808:2: warning: this statement may fall through [-Wimplicit-fallthrough=]
    arch/arm64/include/asm/sysreg.h:808:2: warning: this statement may fall through [-Wimplicit-fallthrough=]
    arch/arm64/include/asm/sysreg.h:808:2: warning: this statement may fall through [-Wimplicit-fallthrough=]
    arch/arm64/include/asm/sysreg.h:808:2: warning: this statement may fall through [-Wimplicit-fallthrough=]
    arch/arm64/include/asm/sysreg.h:808:2: warning: this statement may fall through [-Wimplicit-fallthrough=]
    arch/arm64/include/asm/sysreg.h:808:2: warning: this statement may fall through [-Wimplicit-fallthrough=]
    arch/arm64/include/asm/sysreg.h:808:2: warning: this statement may fall through [-Wimplicit-fallthrough=]
    arch/arm64/include/asm/sysreg.h:808:2: warning: this statement may fall through [-Wimplicit-fallthrough=]
    arch/arm64/include/asm/sysreg.h:808:2: warning: this statement may fall through [-Wimplicit-fallthrough=]
    arch/arm64/include/asm/sysreg.h:808:2: warning: this statement may fall through [-Wimplicit-fallthrough=]
    arch/arm64/include/asm/sysreg.h:808:2: warning: this statement may fall through [-Wimplicit-fallthrough=]
    arch/arm64/include/asm/sysreg.h:808:2: warning: this statement may fall through [-Wimplicit-fallthrough=]
    arch/arm64/include/asm/sysreg.h:808:2: warning: this statement may fall through [-Wimplicit-fallthrough=]
    arch/arm64/include/asm/sysreg.h:808:2: warning: this statement may fall through [-Wimplicit-fallthrough=]
    arch/arm64/include/asm/sysreg.h:808:2: warning: this statement may fall through [-Wimplicit-fallthrough=]
    arch/arm64/include/asm/sysreg.h:808:2: warning: this statement may fall through [-Wimplicit-fallthrough=]
    arch/arm64/include/asm/sysreg.h:808:2: warning: this statement may fall through [-Wimplicit-fallthrough=]
    arch/arm64/include/asm/sysreg.h:808:2: warning: this statement may fall through [-Wimplicit-fallthrough=]
    arch/arm64/include/asm/sysreg.h:808:2: warning: this statement may fall through [-Wimplicit-fallthrough=]
    arch/arm64/include/asm/kvm_hyp.h:31:3: warning: this statement may fall through [-Wimplicit-fallthrough=]
    arch/arm64/include/asm/sysreg.h:808:2: warning: this statement may fall through [-Wimplicit-fallthrough=]
    arch/arm64/include/asm/sysreg.h:808:2: warning: this statement may fall through [-Wimplicit-fallthrough=]
    arch/arm64/include/asm/sysreg.h:808:2: warning: this statement may fall through [-Wimplicit-fallthrough=]
    drivers/iommu/arm-smmu-v3.c:1189:7: warning: this statement may fall through [-Wimplicit-fallthrough=]
    drivers/of/platform.c:650:18: warning: ?: using integer constants in boolean context [-Wint-in-bool-context]
    drivers/gpu/drm/sun4i/sun4i_tcon.c:318:7: warning: this statement may fall through [-Wimplicit-fallthrough=]
    drivers/gpu/drm/sun4i/sun6i_mipi_dsi.c:993:6: warning: this statement may fall through [-Wimplicit-fallthrough=]

--------------------------------------------------------------------------------
allmodconfig (x86_64, gcc-8) — PASS, 0 errors, 11 warnings, 0 section mismatches

Warnings:
    drivers/gpu/drm/i915/gem/i915_gem_execbuffer.o: warning: objtool: .altinstr_replacement+0x1c: redundant UACCESS disable
    drivers/of/platform.c:650:18: warning: ?: using integer constants in boolean context [-Wint-in-bool-context]
    drivers/soc/qcom/socinfo.c:323:3: warning: this statement may fall through [-Wimplicit-fallthrough=]
    drivers/soc/qcom/socinfo.c:331:3: warning: this statement may fall through [-Wimplicit-fallthrough=]
    drivers/soc/qcom/socinfo.c:231:2: warning: this statement may fall through [-Wimplicit-fallthrough=]
    drivers/soc/qcom/socinfo.c:341:3: warning: this statement may fall through [-Wimplicit-fallthrough=]
    drivers/soc/qcom/socinfo.c:348:3: warning: this statement may fall through [-Wimplicit-fallthrough=]
    drivers/soc/qcom/socinfo.c:354:3: warning: this statement may fall through [-Wimplicit-fallthrough=]
    drivers/soc/qcom/socinfo.c:360:3: warning: this statement may fall through [-Wimplicit-fallthrough=]
    drivers/soc/qcom/socinfo.c:366:3: warning: this statement may fall through [-Wimplicit-fallthrough=]
    include/linux/build_bug.h:49: warning: "BUILD_BUG_ON" redefined

--------------------------------------------------------------------------------
allnoconfig (arc, gcc-8) — PASS, 0 errors, 2 warnings, 0 section mismatches

Warnings:
    <stdin>:1511:2: warning: #warning syscall clone3 not implemented [-Wcpp]
    drivers/of/platform.c:650:18: warning: ?: using integer constants in boolean context [-Wint-in-bool-context]

--------------------------------------------------------------------------------
allnoconfig (arm64, gcc-8) — PASS, 0 errors, 1 warning, 0 section mismatches

Warnings:
    drivers/of/platform.c:650:18: warning: ?: using integer constants in boolean context [-Wint-in-bool-context]

--------------------------------------------------------------------------------
allnoconfig (arm, gcc-8) — PASS, 0 errors, 1 warning, 0 section mismatches

Warnings:
    drivers/of/platform.c:650:18: warning: ?: using integer constants in boolean context [-Wint-in-bool-context]

--------------------------------------------------------------------------------
allnoconfig (riscv, gcc-8) — PASS, 0 errors, 1 warning, 0 section mismatches

Warnings:
    drivers/of/platform.c:650:18: warning: ?: using integer constants in boolean context [-Wint-in-bool-context]

--------------------------------------------------------------------------------
allnoconfig (mips, gcc-8) — PASS, 0 errors, 2 warnings, 0 section mismatches

Warnings:
    <stdin>:1511:2: warning: #warning syscall clone3 not implemented [-Wcpp]
    drivers/of/platform.c:650:18: warning: ?: using integer constants in boolean context [-Wint-in-bool-context]

--------------------------------------------------------------------------------
allnoconfig (arm64, clang-8) — PASS, 0 errors, 0 warnings, 0 section mismatches

--------------------------------------------------------------------------------
allnoconfig (i386, gcc-8) — PASS, 0 errors, 1 warning, 0 section mismatches

Warnings:
    include/linux/build_bug.h:49: warning: "BUILD_BUG_ON" redefined

--------------------------------------------------------------------------------
allnoconfig (x86_64, gcc-8) — PASS, 0 errors, 1 warning, 0 section mismatches

Warnings:
    include/linux/build_bug.h:49: warning: "BUILD_BUG_ON" redefined

--------------------------------------------------------------------------------
am200epdkit_defconfig (arm, gcc-8) — PASS, 0 errors, 0 warnings, 0 section mismatches

--------------------------------------------------------------------------------
ar7_defconfig (mips, gcc-8) — PASS, 0 errors, 2 warnings, 0 section mismatches

Warnings:
    <stdin>:1511:2: warning: #warning syscall clone3 not implemented [-Wcpp]
    <stdin>:1511:2: warning: #warning syscall clone3 not implemented [-Wcpp]

--------------------------------------------------------------------------------
aspeed_g4_defconfig (arm, gcc-8) — PASS, 0 errors, 1 warning, 0 section mismatches

Warnings:
    drivers/of/platform.c:650:18: warning: ?: using integer constants in boolean context [-Wint-in-bool-context]

--------------------------------------------------------------------------------
aspeed_g5_defconfig (arm, gcc-8) — PASS, 0 errors, 1 warning, 0 section mismatches

Warnings:
    drivers/of/platform.c:650:18: warning: ?: using integer constants in boolean context [-Wint-in-bool-context]

--------------------------------------------------------------------------------
assabet_defconfig (arm, gcc-8) — PASS, 0 errors, 2 warnings, 0 section mismatches

Warnings:
    drivers/mtd/maps/sa1100-flash.c:82:3: warning: this statement may fall through [-Wimplicit-fallthrough=]
    printk(KERN_WARNING "SA1100 flash: unknown base address "

--------------------------------------------------------------------------------
at91_dt_defconfig (arm, gcc-8) — PASS, 0 errors, 2 warnings, 0 section mismatches

Warnings:
    drivers/of/platform.c:650:18: warning: ?: using integer constants in boolean context [-Wint-in-bool-context]
    drivers/usb/gadget/udc/atmel_usba_udc.c:329:13: warning: this statement may fall through [-Wimplicit-fallthrough=]

--------------------------------------------------------------------------------
ath25_defconfig (mips, gcc-8) — PASS, 0 errors, 2 warnings, 0 section mismatches

Warnings:
    <stdin>:1511:2: warning: #warning syscall clone3 not implemented [-Wcpp]
    <stdin>:1511:2: warning: #warning syscall clone3 not implemented [-Wcpp]

--------------------------------------------------------------------------------
ath79_defconfig (mips, gcc-8) — PASS, 0 errors, 3 warnings, 0 section mismatches

Warnings:
    <stdin>:1511:2: warning: #warning syscall clone3 not implemented [-Wcpp]
    drivers/of/platform.c:650:18: warning: ?: using integer constants in boolean context [-Wint-in-bool-context]
    <stdin>:1511:2: warning: #warning syscall clone3 not implemented [-Wcpp]

--------------------------------------------------------------------------------
axm55xx_defconfig (arm, gcc-8) — PASS, 0 errors, 9 warnings, 0 section mismatches

Warnings:
    arch/arm/kvm/hyp/../../../../virt/kvm/arm/hyp/vgic-v3-sr.c:351:24: warning: this statement may fall through [-Wimplicit-fallthrough=]
    arch/arm/kvm/hyp/../../../../virt/kvm/arm/hyp/vgic-v3-sr.c:353:24: warning: this statement may fall through [-Wimplicit-fallthrough=]
    arch/arm/kvm/hyp/../../../../virt/kvm/arm/hyp/vgic-v3-sr.c:361:24: warning: this statement may fall through [-Wimplicit-fallthrough=]
    arch/arm/kvm/hyp/../../../../virt/kvm/arm/hyp/vgic-v3-sr.c:363:24: warning: this statement may fall through [-Wimplicit-fallthrough=]
    arch/arm/kvm/hyp/../../../../virt/kvm/arm/hyp/vgic-v3-sr.c:384:3: warning: this statement may fall through [-Wimplicit-fallthrough=]
    arch/arm/kvm/hyp/../../../../virt/kvm/arm/hyp/vgic-v3-sr.c:386:3: warning: this statement may fall through [-Wimplicit-fallthrough=]
    arch/arm/kvm/hyp/../../../../virt/kvm/arm/hyp/vgic-v3-sr.c:394:3: warning: this statement may fall through [-Wimplicit-fallthrough=]
    arch/arm/kvm/hyp/../../../../virt/kvm/arm/hyp/vgic-v3-sr.c:396:3: warning: this statement may fall through [-Wimplicit-fallthrough=]
    drivers/of/platform.c:650:18: warning: ?: using integer constants in boolean context [-Wint-in-bool-context]

--------------------------------------------------------------------------------
axs103_defconfig (arc, gcc-8) — PASS, 0 errors, 4 warnings, 0 section mismatches

Warnings:
    <stdin>:1511:2: warning: #warning syscall clone3 not implemented [-Wcpp]
    include/linux/compiler.h:328:5: warning: this statement may fall through [-Wimplicit-fallthrough=]
    drivers/of/platform.c:650:18: warning: ?: using integer constants in boolean context [-Wint-in-bool-context]
    <stdin>:1511:2: warning: #warning syscall clone3 not implemented [-Wcpp]

--------------------------------------------------------------------------------
axs103_smp_defconfig (arc, gcc-8) — PASS, 0 errors, 4 warnings, 0 section mismatches

Warnings:
    <stdin>:1511:2: warning: #warning syscall clone3 not implemented [-Wcpp]
    include/linux/compiler.h:328:5: warning: this statement may fall through [-Wimplicit-fallthrough=]
    drivers/of/platform.c:650:18: warning: ?: using integer constants in boolean context [-Wint-in-bool-context]
    <stdin>:1511:2: warning: #warning syscall clone3 not implemented [-Wcpp]

--------------------------------------------------------------------------------
badge4_defconfig (arm, gcc-8) — PASS, 0 errors, 2 warnings, 0 section mismatches

Warnings:
    drivers/mtd/maps/sa1100-flash.c:82:3: warning: this statement may fall through [-Wimplicit-fallthrough=]
    printk(KERN_WARNING "SA1100 flash: unknown base address "

--------------------------------------------------------------------------------
bcm2835_defconfig (arm, gcc-8) — PASS, 0 errors, 1 warning, 0 section mismatches

Warnings:
    drivers/of/platform.c:650:18: warning: ?: using integer constants in boolean context [-Wint-in-bool-context]

--------------------------------------------------------------------------------
bcm47xx_defconfig (mips, gcc-8) — PASS, 0 errors, 2 warnings, 0 section mismatches

Warnings:
    <stdin>:1511:2: warning: #warning syscall clone3 not implemented [-Wcpp]
    <stdin>:1511:2: warning: #warning syscall clone3 not implemented [-Wcpp]

--------------------------------------------------------------------------------
bcm63xx_defconfig (mips, gcc-8) — PASS, 0 errors, 1 warning, 0 section mismatches

Warnings:
    <stdin>:1511:2: warning: #warning syscall clone3 not implemented [-Wcpp]

--------------------------------------------------------------------------------
bigsur_defconfig (mips, gcc-8) — PASS, 0 errors, 6 warnings, 0 section mismatches

Warnings:
    <stdin>:1511:2: warning: #warning syscall clone3 not implemented [-Wcpp]
    <stdin>:1511:2: warning: #warning syscall clone3 not implemented [-Wcpp]
    <stdin>:1511:2: warning: #warning syscall clone3 not implemented [-Wcpp]
    <stdin>:1511:2: warning: #warning syscall clone3 not implemented [-Wcpp]
    <stdin>:1511:2: warning: #warning syscall clone3 not implemented [-Wcpp]
    <stdin>:1511:2: warning: #warning syscall clone3 not implemented [-Wcpp]

--------------------------------------------------------------------------------
bmips_be_defconfig (mips, gcc-8) — PASS, 0 errors, 2 warnings, 0 section mismatches

Warnings:
    <stdin>:1511:2: warning: #warning syscall clone3 not implemented [-Wcpp]
    drivers/of/platform.c:650:18: warning: ?: using integer constants in boolean context [-Wint-in-bool-context]

--------------------------------------------------------------------------------
bmips_stb_defconfig (mips, gcc-8) — PASS, 0 errors, 2 warnings, 0 section mismatches

Warnings:
    <stdin>:1511:2: warning: #warning syscall clone3 not implemented [-Wcpp]
    drivers/of/platform.c:650:18: warning: ?: using integer constants in boolean context [-Wint-in-bool-context]

--------------------------------------------------------------------------------
capcella_defconfig (mips, gcc-8) — PASS, 0 errors, 2 warnings, 0 section mismatches

Warnings:
    <stdin>:1511:2: warning: #warning syscall clone3 not implemented [-Wcpp]
    <stdin>:1511:2: warning: #warning syscall clone3 not implemented [-Wcpp]

--------------------------------------------------------------------------------
cavium_octeon_defconfig (mips, gcc-8) — FAIL, 4 errors, 7 warnings, 0 section mismatches

Errors:
    arch/mips/include/asm/octeon/cvmx-ipd.h:330:27: error: storage size of 'pip_sft_rst' isn't known
    arch/mips/include/asm/octeon/cvmx-ipd.h:331:36: error: 'CVMX_PIP_SFT_RST' undeclared (first use in this function); did you mean 'CVMX_CIU_SOFT_RST'?
    arch/mips/include/asm/octeon/cvmx-ipd.h:330:27: error: storage size of 'pip_sft_rst' isn't known
    arch/mips/include/asm/octeon/cvmx-ipd.h:331:36: error: 'CVMX_PIP_SFT_RST' undeclared (first use in this function); did you mean 'CVMX_CIU_SOFT_RST'?

Warnings:
    <stdin>:1511:2: warning: #warning syscall clone3 not implemented [-Wcpp]
    <stdin>:1511:2: warning: #warning syscall clone3 not implemented [-Wcpp]
    <stdin>:1511:2: warning: #warning syscall clone3 not implemented [-Wcpp]
    arch/mips/include/asm/octeon/cvmx-sli-defs.h:47:6: warning: this statement may fall through [-Wimplicit-fallthrough=]
    drivers/of/platform.c:650:18: warning: ?: using integer constants in boolean context [-Wint-in-bool-context]
    arch/mips/include/asm/octeon/cvmx-ipd.h:330:27: warning: unused variable 'pip_sft_rst' [-Wunused-variable]
    arch/mips/include/asm/octeon/cvmx-ipd.h:330:27: warning: unused variable 'pip_sft_rst' [-Wunused-variable]

--------------------------------------------------------------------------------
cerfcube_defconfig (arm, gcc-8) — PASS, 0 errors, 2 warnings, 0 section mismatches

Warnings:
    drivers/mtd/maps/sa1100-flash.c:82:3: warning: this statement may fall through [-Wimplicit-fallthrough=]
    printk(KERN_WARNING "SA1100 flash: unknown base address "

--------------------------------------------------------------------------------
ci20_defconfig (mips, gcc-8) — PASS, 0 errors, 3 warnings, 0 section mismatches

Warnings:
    <stdin>:1511:2: warning: #warning syscall clone3 not implemented [-Wcpp]
    drivers/of/platform.c:650:18: warning: ?: using integer constants in boolean context [-Wint-in-bool-context]
    drivers/watchdog/jz4740_wdt.c:165:6: warning: unused variable 'ret' [-Wunused-variable]

--------------------------------------------------------------------------------
clps711x_defconfig (arm, gcc-8) — PASS, 0 errors, 1 warning, 0 section mismatches

Warnings:
    drivers/of/platform.c:650:18: warning: ?: using integer constants in boolean context [-Wint-in-bool-context]

--------------------------------------------------------------------------------
cm_x2xx_defconfig (arm, gcc-8) — PASS, 0 errors, 0 warnings, 0 section mismatches

--------------------------------------------------------------------------------
cm_x300_defconfig (arm, gcc-8) — PASS, 0 errors, 0 warnings, 0 section mismatches

--------------------------------------------------------------------------------
cns3420vb_defconfig (arm, gcc-8) — PASS, 0 errors, 1 warning, 0 section mismatches

Warnings:
    drivers/of/platform.c:650:18: warning: ?: using integer constants in boolean context [-Wint-in-bool-context]

--------------------------------------------------------------------------------
cobalt_defconfig (mips, gcc-8) — PASS, 0 errors, 2 warnings, 0 section mismatches

Warnings:
    <stdin>:1511:2: warning: #warning syscall clone3 not implemented [-Wcpp]
    <stdin>:1511:2: warning: #warning syscall clone3 not implemented [-Wcpp]

--------------------------------------------------------------------------------
colibri_pxa270_defconfig (arm, gcc-8) — PASS, 0 errors, 0 warnings, 0 section mismatches

--------------------------------------------------------------------------------
colibri_pxa300_defconfig (arm, gcc-8) — PASS, 0 errors, 0 warnings, 0 section mismatches

--------------------------------------------------------------------------------
collie_defconfig (arm, gcc-8) — PASS, 0 errors, 2 warnings, 0 section mismatches

Warnings:
    drivers/mtd/maps/sa1100-flash.c:82:3: warning: this statement may fall through [-Wimplicit-fallthrough=]
    printk(KERN_WARNING "SA1100 flash: unknown base address "

--------------------------------------------------------------------------------
corgi_defconfig (arm, gcc-8) — PASS, 0 errors, 0 warnings, 0 section mismatches

--------------------------------------------------------------------------------
davinci_all_defconfig (arm, gcc-8) — PASS, 0 errors, 1 warning, 0 section mismatches

Warnings:
    drivers/of/platform.c:650:18: warning: ?: using integer constants in boolean context [-Wint-in-bool-context]

--------------------------------------------------------------------------------
db1xxx_defconfig (mips, gcc-8) — PASS, 0 errors, 2 warnings, 0 section mismatches

Warnings:
    <stdin>:1511:2: warning: #warning syscall clone3 not implemented [-Wcpp]
    drivers/mtd/nand/raw/au1550nd.c:443:57: warning: pointer type mismatch in conditional expression

--------------------------------------------------------------------------------
decstation_64_defconfig (mips, gcc-8) — PASS, 0 errors, 6 warnings, 0 section mismatches

Warnings:
    <stdin>:1511:2: warning: #warning syscall clone3 not implemented [-Wcpp]
    <stdin>:1511:2: warning: #warning syscall clone3 not implemented [-Wcpp]
    <stdin>:1511:2: warning: #warning syscall clone3 not implemented [-Wcpp]
    <stdin>:1511:2: warning: #warning syscall clone3 not implemented [-Wcpp]
    <stdin>:1511:2: warning: #warning syscall clone3 not implemented [-Wcpp]
    <stdin>:1511:2: warning: #warning syscall clone3 not implemented [-Wcpp]

--------------------------------------------------------------------------------
decstation_defconfig (mips, gcc-8) — PASS, 0 errors, 2 warnings, 0 section mismatches

Warnings:
    <stdin>:1511:2: warning: #warning syscall clone3 not implemented [-Wcpp]
    <stdin>:1511:2: warning: #warning syscall clone3 not implemented [-Wcpp]

--------------------------------------------------------------------------------
decstation_r4k_defconfig (mips, gcc-8) — PASS, 0 errors, 2 warnings, 0 section mismatches

Warnings:
    <stdin>:1511:2: warning: #warning syscall clone3 not implemented [-Wcpp]
    <stdin>:1511:2: warning: #warning syscall clone3 not implemented [-Wcpp]

--------------------------------------------------------------------------------
defconfig (riscv, gcc-8) — PASS, 0 errors, 1 warning, 0 section mismatches

Warnings:
    drivers/of/platform.c:650:18: warning: ?: using integer constants in boolean context [-Wint-in-bool-context]

--------------------------------------------------------------------------------
defconfig (arm64, clang-8) — FAIL, 1 error, 0 warnings, 0 section mismatches

Errors:
    drivers/phy/rockchip/phy-rockchip-inno-hdmi.c:1046:26: error: anonymous bit-field has negative width (-1)

--------------------------------------------------------------------------------
defconfig (arm64, gcc-8) — FAIL, 1 error, 135 warnings, 0 section mismatches

Errors:
    include/linux/build_bug.h:16:45: error: negative width in bit-field '<anonymous>'

Warnings:
    arch/arm64/kvm/hyp/../../../../virt/kvm/arm/hyp/vgic-v3-sr.c:351:24: warning: this statement may fall through [-Wimplicit-fallthrough=]
    arch/arm64/kvm/hyp/../../../../virt/kvm/arm/hyp/vgic-v3-sr.c:353:24: warning: this statement may fall through [-Wimplicit-fallthrough=]
    arch/arm64/kvm/hyp/../../../../virt/kvm/arm/hyp/vgic-v3-sr.c:361:24: warning: this statement may fall through [-Wimplicit-fallthrough=]
    arch/arm64/kvm/hyp/../../../../virt/kvm/arm/hyp/vgic-v3-sr.c:363:24: warning: this statement may fall through [-Wimplicit-fallthrough=]
    arch/arm64/kvm/hyp/../../../../virt/kvm/arm/hyp/vgic-v3-sr.c:384:3: warning: this statement may fall through [-Wimplicit-fallthrough=]
    arch/arm64/kvm/hyp/../../../../virt/kvm/arm/hyp/vgic-v3-sr.c:386:3: warning: this statement may fall through [-Wimplicit-fallthrough=]
    arch/arm64/kvm/hyp/../../../../virt/kvm/arm/hyp/vgic-v3-sr.c:394:3: warning: this statement may fall through [-Wimplicit-fallthrough=]
    arch/arm64/kvm/hyp/../../../../virt/kvm/arm/hyp/vgic-v3-sr.c:396:3: warning: this statement may fall through [-Wimplicit-fallthrough=]
    arch/arm64/kvm/hyp/debug-sr.c:20:19: warning: this statement may fall through [-Wimplicit-fallthrough=]
    arch/arm64/kvm/hyp/debug-sr.c:21:19: warning: this statement may fall through [-Wimplicit-fallthrough=]
    arch/arm64/kvm/hyp/debug-sr.c:22:19: warning: this statement may fall through [-Wimplicit-fallthrough=]
    arch/arm64/kvm/hyp/debug-sr.c:23:19: warning: this statement may fall through [-Wimplicit-fallthrough=]
    arch/arm64/kvm/hyp/debug-sr.c:24:19: warning: this statement may fall through [-Wimplicit-fallthrough=]
    arch/arm64/kvm/hyp/debug-sr.c:25:19: warning: this statement may fall through [-Wimplicit-fallthrough=]
    arch/arm64/kvm/hyp/debug-sr.c:26:18: warning: this statement may fall through [-Wimplicit-fallthrough=]
    arch/arm64/kvm/hyp/debug-sr.c:27:18: warning: this statement may fall through [-Wimplicit-fallthrough=]
    arch/arm64/kvm/hyp/debug-sr.c:28:18: warning: this statement may fall through [-Wimplicit-fallthrough=]
    arch/arm64/kvm/hyp/debug-sr.c:29:18: warning: this statement may fall through [-Wimplicit-fallthrough=]
    arch/arm64/kvm/hyp/debug-sr.c:30:18: warning: this statement may fall through [-Wimplicit-fallthrough=]
    arch/arm64/kvm/hyp/debug-sr.c:31:18: warning: this statement may fall through [-Wimplicit-fallthrough=]
    arch/arm64/kvm/hyp/debug-sr.c:32:18: warning: this statement may fall through [-Wimplicit-fallthrough=]
    arch/arm64/kvm/hyp/debug-sr.c:33:18: warning: this statement may fall through [-Wimplicit-fallthrough=]
    arch/arm64/kvm/hyp/debug-sr.c:34:18: warning: this statement may fall through [-Wimplicit-fallthrough=]
    arch/arm64/kvm/hyp/debug-sr.c:20:19: warning: this statement may fall through [-Wimplicit-fallthrough=]
    arch/arm64/kvm/hyp/debug-sr.c:21:19: warning: this statement may fall through [-Wimplicit-fallthrough=]
    arch/arm64/kvm/hyp/debug-sr.c:22:19: warning: this statement may fall through [-Wimplicit-fallthrough=]
    arch/arm64/kvm/hyp/debug-sr.c:23:19: warning: this statement may fall through [-Wimplicit-fallthrough=]
    arch/arm64/kvm/hyp/debug-sr.c:24:19: warning: this statement may fall through [-Wimplicit-fallthrough=]
    arch/arm64/kvm/hyp/debug-sr.c:25:19: warning: this statement may fall through [-Wimplicit-fallthrough=]
    arch/arm64/kvm/hyp/debug-sr.c:26:18: warning: this statement may fall through [-Wimplicit-fallthrough=]
    arch/arm64/kvm/hyp/debug-sr.c:27:18: warning: this statement may fall through [-Wimplicit-fallthrough=]
    arch/arm64/kvm/hyp/debug-sr.c:28:18: warning: this statement may fall through [-Wimplicit-fallthrough=]
    arch/arm64/kvm/hyp/debug-sr.c:29:18: warning: this statement may fall through [-Wimplicit-fallthrough=]
    arch/arm64/kvm/hyp/debug-sr.c:30:18: warning: this statement may fall through [-Wimplicit-fallthrough=]
    arch/arm64/kvm/hyp/debug-sr.c:31:18: warning: this statement may fall through [-Wimplicit-fallthrough=]
    arch/arm64/kvm/hyp/debug-sr.c:32:18: warning: this statement may fall through [-Wimplicit-fallthrough=]
    arch/arm64/kvm/hyp/debug-sr.c:33:18: warning: this statement may fall through [-Wimplicit-fallthrough=]
    arch/arm64/kvm/hyp/debug-sr.c:34:18: warning: this statement may fall through [-Wimplicit-fallthrough=]
    arch/arm64/kvm/hyp/debug-sr.c:20:19: warning: this statement may fall through [-Wimplicit-fallthrough=]
    arch/arm64/kvm/hyp/debug-sr.c:21:19: warning: this statement may fall through [-Wimplicit-fallthrough=]
    arch/arm64/kvm/hyp/debug-sr.c:22:19: warning: this statement may fall through [-Wimplicit-fallthrough=]
    arch/arm64/kvm/hyp/debug-sr.c:23:19: warning: this statement may fall through [-Wimplicit-fallthrough=]
    arch/arm64/kvm/hyp/debug-sr.c:24:19: warning: this statement may fall through [-Wimplicit-fallthrough=]
    arch/arm64/kvm/hyp/debug-sr.c:25:19: warning: this statement may fall through [-Wimplicit-fallthrough=]
    arch/arm64/kvm/hyp/debug-sr.c:26:18: warning: this statement may fall through [-Wimplicit-fallthrough=]
    arch/arm64/kvm/hyp/debug-sr.c:27:18: warning: this statement may fall through [-Wimplicit-fallthrough=]
    arch/arm64/kvm/hyp/debug-sr.c:28:18: warning: this statement may fall through [-Wimplicit-fallthrough=]
    arch/arm64/kvm/hyp/debug-sr.c:29:18: warning: this statement may fall through [-Wimplicit-fallthrough=]
    arch/arm64/kvm/hyp/debug-sr.c:30:18: warning: this statement may fall through [-Wimplicit-fallthrough=]
    arch/arm64/kvm/hyp/debug-sr.c:31:18: warning: this statement may fall through [-Wimplicit-fallthrough=]
    arch/arm64/kvm/hyp/debug-sr.c:32:18: warning: this statement may fall through [-Wimplicit-fallthrough=]
    arch/arm64/kvm/hyp/debug-sr.c:33:18: warning: this statement may fall through [-Wimplicit-fallthrough=]
    arch/arm64/kvm/hyp/debug-sr.c:34:18: warning: this statement may fall through [-Wimplicit-fallthrough=]
    arch/arm64/kvm/hyp/debug-sr.c:20:19: warning: this statement may fall through [-Wimplicit-fallthrough=]
    arch/arm64/kvm/hyp/debug-sr.c:21:19: warning: this statement may fall through [-Wimplicit-fallthrough=]
    arch/arm64/kvm/hyp/debug-sr.c:22:19: warning: this statement may fall through [-Wimplicit-fallthrough=]
    arch/arm64/kvm/hyp/debug-sr.c:23:19: warning: this statement may fall through [-Wimplicit-fallthrough=]
    arch/arm64/kvm/hyp/debug-sr.c:24:19: warning: this statement may fall through [-Wimplicit-fallthrough=]
    arch/arm64/kvm/hyp/debug-sr.c:25:19: warning: this statement may fall through [-Wimplicit-fallthrough=]
    arch/arm64/kvm/hyp/debug-sr.c:26:18: warning: this statement may fall through [-Wimplicit-fallthrough=]
    arch/arm64/kvm/hyp/debug-sr.c:27:18: warning: this statement may fall through [-Wimplicit-fallthrough=]
    arch/arm64/kvm/hyp/debug-sr.c:28:18: warning: this statement may fall through [-Wimplicit-fallthrough=]
    arch/arm64/kvm/hyp/debug-sr.c:29:18: warning: this statement may fall through [-Wimplicit-fallthrough=]
    arch/arm64/kvm/hyp/debug-sr.c:30:18: warning: this statement may fall through [-Wimplicit-fallthrough=]
    arch/arm64/kvm/hyp/debug-sr.c:31:18: warning: this statement may fall through [-Wimplicit-fallthrough=]
    arch/arm64/kvm/hyp/debug-sr.c:32:18: warning: this statement may fall through [-Wimplicit-fallthrough=]
    arch/arm64/kvm/hyp/debug-sr.c:33:18: warning: this statement may fall through [-Wimplicit-fallthrough=]
    arch/arm64/kvm/hyp/debug-sr.c:34:18: warning: this statement may fall through [-Wimplicit-fallthrough=]
    arch/arm64/include/asm/sysreg.h:808:2: warning: this statement may fall through [-Wimplicit-fallthrough=]
    arch/arm64/include/asm/sysreg.h:808:2: warning: this statement may fall through [-Wimplicit-fallthrough=]
    arch/arm64/include/asm/sysreg.h:808:2: warning: this statement may fall through [-Wimplicit-fallthrough=]
    arch/arm64/include/asm/sysreg.h:808:2: warning: this statement may fall through [-Wimplicit-fallthrough=]
    arch/arm64/include/asm/sysreg.h:808:2: warning: this statement may fall through [-Wimplicit-fallthrough=]
    arch/arm64/include/asm/sysreg.h:808:2: warning: this statement may fall through [-Wimplicit-fallthrough=]
    arch/arm64/include/asm/sysreg.h:808:2: warning: this statement may fall through [-Wimplicit-fallthrough=]
    arch/arm64/include/asm/sysreg.h:808:2: warning: this statement may fall through [-Wimplicit-fallthrough=]
    arch/arm64/include/asm/sysreg.h:808:2: warning: this statement may fall through [-Wimplicit-fallthrough=]
    arch/arm64/include/asm/sysreg.h:808:2: warning: this statement may fall through [-Wimplicit-fallthrough=]
    arch/arm64/include/asm/sysreg.h:808:2: warning: this statement may fall through [-Wimplicit-fallthrough=]
    arch/arm64/include/asm/sysreg.h:808:2: warning: this statement may fall through [-Wimplicit-fallthrough=]
    arch/arm64/include/asm/sysreg.h:808:2: warning: this statement may fall through [-Wimplicit-fallthrough=]
    arch/arm64/include/asm/sysreg.h:808:2: warning: this statement may fall through [-Wimplicit-fallthrough=]
    arch/arm64/include/asm/sysreg.h:808:2: warning: this statement may fall through [-Wimplicit-fallthrough=]
    arch/arm64/include/asm/sysreg.h:808:2: warning: this statement may fall through [-Wimplicit-fallthrough=]
    arch/arm64/include/asm/sysreg.h:808:2: warning: this statement may fall through [-Wimplicit-fallthrough=]
    arch/arm64/include/asm/sysreg.h:808:2: warning: this statement may fall through [-Wimplicit-fallthrough=]
    arch/arm64/include/asm/sysreg.h:808:2: warning: this statement may fall through [-Wimplicit-fallthrough=]
    arch/arm64/include/asm/sysreg.h:808:2: warning: this statement may fall through [-Wimplicit-fallthrough=]
    arch/arm64/include/asm/sysreg.h:808:2: warning: this statement may fall through [-Wimplicit-fallthrough=]
    arch/arm64/include/asm/sysreg.h:808:2: warning: this statement may fall through [-Wimplicit-fallthrough=]
    arch/arm64/include/asm/sysreg.h:808:2: warning: this statement may fall through [-Wimplicit-fallthrough=]
    arch/arm64/include/asm/sysreg.h:808:2: warning: this statement may fall through [-Wimplicit-fallthrough=]
    arch/arm64/include/asm/sysreg.h:808:2: warning: this statement may fall through [-Wimplicit-fallthrough=]
    arch/arm64/include/asm/sysreg.h:808:2: warning: this statement may fall through [-Wimplicit-fallthrough=]
    arch/arm64/include/asm/sysreg.h:808:2: warning: this statement may fall through [-Wimplicit-fallthrough=]
    arch/arm64/include/asm/sysreg.h:808:2: warning: this statement may fall through [-Wimplicit-fallthrough=]
    arch/arm64/include/asm/sysreg.h:808:2: warning: this statement may fall through [-Wimplicit-fallthrough=]
    arch/arm64/include/asm/sysreg.h:808:2: warning: this statement may fall through [-Wimplicit-fallthrough=]
    arch/arm64/include/asm/sysreg.h:808:2: warning: this statement may fall through [-Wimplicit-fallthrough=]
    arch/arm64/include/asm/sysreg.h:808:2: warning: this statement may fall through [-Wimplicit-fallthrough=]
    arch/arm64/include/asm/sysreg.h:808:2: warning: this statement may fall through [-Wimplicit-fallthrough=]
    arch/arm64/include/asm/sysreg.h:808:2: warning: this statement may fall through [-Wimplicit-fallthrough=]
    arch/arm64/include/asm/sysreg.h:808:2: warning: this statement may fall through [-Wimplicit-fallthrough=]
    arch/arm64/include/asm/sysreg.h:808:2: warning: this statement may fall through [-Wimplicit-fallthrough=]
    arch/arm64/include/asm/sysreg.h:808:2: warning: this statement may fall through [-Wimplicit-fallthrough=]
    arch/arm64/include/asm/sysreg.h:808:2: warning: this statement may fall through [-Wimplicit-fallthrough=]
    arch/arm64/include/asm/sysreg.h:808:2: warning: this statement may fall through [-Wimplicit-fallthrough=]
    arch/arm64/include/asm/sysreg.h:808:2: warning: this statement may fall through [-Wimplicit-fallthrough=]
    arch/arm64/include/asm/sysreg.h:808:2: warning: this statement may fall through [-Wimplicit-fallthrough=]
    arch/arm64/include/asm/sysreg.h:808:2: warning: this statement may fall through [-Wimplicit-fallthrough=]
    arch/arm64/include/asm/sysreg.h:808:2: warning: this statement may fall through [-Wimplicit-fallthrough=]
    arch/arm64/include/asm/sysreg.h:808:2: warning: this statement may fall through [-Wimplicit-fallthrough=]
    arch/arm64/include/asm/sysreg.h:808:2: warning: this statement may fall through [-Wimplicit-fallthrough=]
    arch/arm64/include/asm/sysreg.h:808:2: warning: this statement may fall through [-Wimplicit-fallthrough=]
    arch/arm64/include/asm/sysreg.h:808:2: warning: this statement may fall through [-Wimplicit-fallthrough=]
    arch/arm64/include/asm/sysreg.h:808:2: warning: this statement may fall through [-Wimplicit-fallthrough=]
    arch/arm64/include/asm/sysreg.h:808:2: warning: this statement may fall through [-Wimplicit-fallthrough=]
    arch/arm64/include/asm/sysreg.h:808:2: warning: this statement may fall through [-Wimplicit-fallthrough=]
    arch/arm64/include/asm/sysreg.h:808:2: warning: this statement may fall through [-Wimplicit-fallthrough=]
    arch/arm64/include/asm/sysreg.h:808:2: warning: this statement may fall through [-Wimplicit-fallthrough=]
    arch/arm64/include/asm/sysreg.h:808:2: warning: this statement may fall through [-Wimplicit-fallthrough=]
    arch/arm64/include/asm/sysreg.h:808:2: warning: this statement may fall through [-Wimplicit-fallthrough=]
    arch/arm64/include/asm/sysreg.h:808:2: warning: this statement may fall through [-Wimplicit-fallthrough=]
    arch/arm64/include/asm/sysreg.h:808:2: warning: this statement may fall through [-Wimplicit-fallthrough=]
    arch/arm64/include/asm/sysreg.h:808:2: warning: this statement may fall through [-Wimplicit-fallthrough=]
    arch/arm64/include/asm/sysreg.h:808:2: warning: this statement may fall through [-Wimplicit-fallthrough=]
    arch/arm64/include/asm/sysreg.h:808:2: warning: this statement may fall through [-Wimplicit-fallthrough=]
    arch/arm64/include/asm/sysreg.h:808:2: warning: this statement may fall through [-Wimplicit-fallthrough=]
    arch/arm64/include/asm/kvm_hyp.h:31:3: warning: this statement may fall through [-Wimplicit-fallthrough=]
    arch/arm64/include/asm/sysreg.h:808:2: warning: this statement may fall through [-Wimplicit-fallthrough=]
    arch/arm64/include/asm/sysreg.h:808:2: warning: this statement may fall through [-Wimplicit-fallthrough=]
    arch/arm64/include/asm/sysreg.h:808:2: warning: this statement may fall through [-Wimplicit-fallthrough=]
    drivers/iommu/arm-smmu-v3.c:1189:7: warning: this statement may fall through [-Wimplicit-fallthrough=]
    drivers/of/platform.c:650:18: warning: ?: using integer constants in boolean context [-Wint-in-bool-context]
    drivers/gpu/drm/sun4i/sun4i_tcon.c:318:7: warning: this statement may fall through [-Wimplicit-fallthrough=]

--------------------------------------------------------------------------------
defconfig+CONFIG_CPU_BIG_ENDIAN=y (arm64, gcc-8) — FAIL, 1 error, 135 warnings, 0 section mismatches

Errors:
    include/linux/build_bug.h:16:45: error: negative width in bit-field '<anonymous>'

Warnings:
    arch/arm64/kvm/hyp/../../../../virt/kvm/arm/hyp/vgic-v3-sr.c:351:24: warning: this statement may fall through [-Wimplicit-fallthrough=]
    arch/arm64/kvm/hyp/../../../../virt/kvm/arm/hyp/vgic-v3-sr.c:353:24: warning: this statement may fall through [-Wimplicit-fallthrough=]
    arch/arm64/kvm/hyp/../../../../virt/kvm/arm/hyp/vgic-v3-sr.c:361:24: warning: this statement may fall through [-Wimplicit-fallthrough=]
    arch/arm64/kvm/hyp/../../../../virt/kvm/arm/hyp/vgic-v3-sr.c:363:24: warning: this statement may fall through [-Wimplicit-fallthrough=]
    arch/arm64/kvm/hyp/../../../../virt/kvm/arm/hyp/vgic-v3-sr.c:384:3: warning: this statement may fall through [-Wimplicit-fallthrough=]
    arch/arm64/kvm/hyp/../../../../virt/kvm/arm/hyp/vgic-v3-sr.c:386:3: warning: this statement may fall through [-Wimplicit-fallthrough=]
    arch/arm64/kvm/hyp/../../../../virt/kvm/arm/hyp/vgic-v3-sr.c:394:3: warning: this statement may fall through [-Wimplicit-fallthrough=]
    arch/arm64/kvm/hyp/../../../../virt/kvm/arm/hyp/vgic-v3-sr.c:396:3: warning: this statement may fall through [-Wimplicit-fallthrough=]
    arch/arm64/kvm/hyp/debug-sr.c:20:19: warning: this statement may fall through [-Wimplicit-fallthrough=]
    arch/arm64/kvm/hyp/debug-sr.c:21:19: warning: this statement may fall through [-Wimplicit-fallthrough=]
    arch/arm64/kvm/hyp/debug-sr.c:22:19: warning: this statement may fall through [-Wimplicit-fallthrough=]
    arch/arm64/kvm/hyp/debug-sr.c:23:19: warning: this statement may fall through [-Wimplicit-fallthrough=]
    arch/arm64/kvm/hyp/debug-sr.c:24:19: warning: this statement may fall through [-Wimplicit-fallthrough=]
    arch/arm64/kvm/hyp/debug-sr.c:25:19: warning: this statement may fall through [-Wimplicit-fallthrough=]
    arch/arm64/kvm/hyp/debug-sr.c:26:18: warning: this statement may fall through [-Wimplicit-fallthrough=]
    arch/arm64/kvm/hyp/debug-sr.c:27:18: warning: this statement may fall through [-Wimplicit-fallthrough=]
    arch/arm64/kvm/hyp/debug-sr.c:28:18: warning: this statement may fall through [-Wimplicit-fallthrough=]
    arch/arm64/kvm/hyp/debug-sr.c:29:18: warning: this statement may fall through [-Wimplicit-fallthrough=]
    arch/arm64/kvm/hyp/debug-sr.c:30:18: warning: this statement may fall through [-Wimplicit-fallthrough=]
    arch/arm64/kvm/hyp/debug-sr.c:31:18: warning: this statement may fall through [-Wimplicit-fallthrough=]
    arch/arm64/kvm/hyp/debug-sr.c:32:18: warning: this statement may fall through [-Wimplicit-fallthrough=]
    arch/arm64/kvm/hyp/debug-sr.c:33:18: warning: this statement may fall through [-Wimplicit-fallthrough=]
    arch/arm64/kvm/hyp/debug-sr.c:34:18: warning: this statement may fall through [-Wimplicit-fallthrough=]
    arch/arm64/kvm/hyp/debug-sr.c:20:19: warning: this statement may fall through [-Wimplicit-fallthrough=]
    arch/arm64/kvm/hyp/debug-sr.c:21:19: warning: this statement may fall through [-Wimplicit-fallthrough=]
    arch/arm64/kvm/hyp/debug-sr.c:22:19: warning: this statement may fall through [-Wimplicit-fallthrough=]
    arch/arm64/kvm/hyp/debug-sr.c:23:19: warning: this statement may fall through [-Wimplicit-fallthrough=]
    arch/arm64/kvm/hyp/debug-sr.c:24:19: warning: this statement may fall through [-Wimplicit-fallthrough=]
    arch/arm64/kvm/hyp/debug-sr.c:25:19: warning: this statement may fall through [-Wimplicit-fallthrough=]
    arch/arm64/kvm/hyp/debug-sr.c:26:18: warning: this statement may fall through [-Wimplicit-fallthrough=]
    arch/arm64/kvm/hyp/debug-sr.c:27:18: warning: this statement may fall through [-Wimplicit-fallthrough=]
    arch/arm64/kvm/hyp/debug-sr.c:28:18: warning: this statement may fall through [-Wimplicit-fallthrough=]
    arch/arm64/kvm/hyp/debug-sr.c:29:18: warning: this statement may fall through [-Wimplicit-fallthrough=]
    arch/arm64/kvm/hyp/debug-sr.c:30:18: warning: this statement may fall through [-Wimplicit-fallthrough=]
    arch/arm64/kvm/hyp/debug-sr.c:31:18: warning: this statement may fall through [-Wimplicit-fallthrough=]
    arch/arm64/kvm/hyp/debug-sr.c:32:18: warning: this statement may fall through [-Wimplicit-fallthrough=]
    arch/arm64/kvm/hyp/debug-sr.c:33:18: warning: this statement may fall through [-Wimplicit-fallthrough=]
    arch/arm64/kvm/hyp/debug-sr.c:34:18: warning: this statement may fall through [-Wimplicit-fallthrough=]
    arch/arm64/kvm/hyp/debug-sr.c:20:19: warning: this statement may fall through [-Wimplicit-fallthrough=]
    arch/arm64/kvm/hyp/debug-sr.c:21:19: warning: this statement may fall through [-Wimplicit-fallthrough=]
    arch/arm64/kvm/hyp/debug-sr.c:22:19: warning: this statement may fall through [-Wimplicit-fallthrough=]
    arch/arm64/kvm/hyp/debug-sr.c:23:19: warning: this statement may fall through [-Wimplicit-fallthrough=]
    arch/arm64/kvm/hyp/debug-sr.c:24:19: warning: this statement may fall through [-Wimplicit-fallthrough=]
    arch/arm64/kvm/hyp/debug-sr.c:25:19: warning: this statement may fall through [-Wimplicit-fallthrough=]
    arch/arm64/kvm/hyp/debug-sr.c:26:18: warning: this statement may fall through [-Wimplicit-fallthrough=]
    arch/arm64/kvm/hyp/debug-sr.c:27:18: warning: this statement may fall through [-Wimplicit-fallthrough=]
    arch/arm64/kvm/hyp/debug-sr.c:28:18: warning: this statement may fall through [-Wimplicit-fallthrough=]
    arch/arm64/kvm/hyp/debug-sr.c:29:18: warning: this statement may fall through [-Wimplicit-fallthrough=]
    arch/arm64/kvm/hyp/debug-sr.c:30:18: warning: this statement may fall through [-Wimplicit-fallthrough=]
    arch/arm64/kvm/hyp/debug-sr.c:31:18: warning: this statement may fall through [-Wimplicit-fallthrough=]
    arch/arm64/kvm/hyp/debug-sr.c:32:18: warning: this statement may fall through [-Wimplicit-fallthrough=]
    arch/arm64/kvm/hyp/debug-sr.c:33:18: warning: this statement may fall through [-Wimplicit-fallthrough=]
    arch/arm64/kvm/hyp/debug-sr.c:34:18: warning: this statement may fall through [-Wimplicit-fallthrough=]
    arch/arm64/kvm/hyp/debug-sr.c:20:19: warning: this statement may fall through [-Wimplicit-fallthrough=]
    arch/arm64/kvm/hyp/debug-sr.c:21:19: warning: this statement may fall through [-Wimplicit-fallthrough=]
    arch/arm64/kvm/hyp/debug-sr.c:22:19: warning: this statement may fall through [-Wimplicit-fallthrough=]
    arch/arm64/kvm/hyp/debug-sr.c:23:19: warning: this statement may fall through [-Wimplicit-fallthrough=]
    arch/arm64/kvm/hyp/debug-sr.c:24:19: warning: this statement may fall through [-Wimplicit-fallthrough=]
    arch/arm64/kvm/hyp/debug-sr.c:25:19: warning: this statement may fall through [-Wimplicit-fallthrough=]
    arch/arm64/kvm/hyp/debug-sr.c:26:18: warning: this statement may fall through [-Wimplicit-fallthrough=]
    arch/arm64/kvm/hyp/debug-sr.c:27:18: warning: this statement may fall through [-Wimplicit-fallthrough=]
    arch/arm64/kvm/hyp/debug-sr.c:28:18: warning: this statement may fall through [-Wimplicit-fallthrough=]
    arch/arm64/kvm/hyp/debug-sr.c:29:18: warning: this statement may fall through [-Wimplicit-fallthrough=]
    arch/arm64/kvm/hyp/debug-sr.c:30:18: warning: this statement may fall through [-Wimplicit-fallthrough=]
    arch/arm64/kvm/hyp/debug-sr.c:31:18: warning: this statement may fall through [-Wimplicit-fallthrough=]
    arch/arm64/kvm/hyp/debug-sr.c:32:18: warning: this statement may fall through [-Wimplicit-fallthrough=]
    arch/arm64/kvm/hyp/debug-sr.c:33:18: warning: this statement may fall through [-Wimplicit-fallthrough=]
    arch/arm64/kvm/hyp/debug-sr.c:34:18: warning: this statement may fall through [-Wimplicit-fallthrough=]
    arch/arm64/include/asm/sysreg.h:808:2: warning: this statement may fall through [-Wimplicit-fallthrough=]
    arch/arm64/include/asm/sysreg.h:808:2: warning: this statement may fall through [-Wimplicit-fallthrough=]
    arch/arm64/include/asm/sysreg.h:808:2: warning: this statement may fall through [-Wimplicit-fallthrough=]
    arch/arm64/include/asm/sysreg.h:808:2: warning: this statement may fall through [-Wimplicit-fallthrough=]
    arch/arm64/include/asm/sysreg.h:808:2: warning: this statement may fall through [-Wimplicit-fallthrough=]
    arch/arm64/include/asm/sysreg.h:808:2: warning: this statement may fall through [-Wimplicit-fallthrough=]
    arch/arm64/include/asm/sysreg.h:808:2: warning: this statement may fall through [-Wimplicit-fallthrough=]
    arch/arm64/include/asm/sysreg.h:808:2: warning: this statement may fall through [-Wimplicit-fallthrough=]
    arch/arm64/include/asm/sysreg.h:808:2: warning: this statement may fall through [-Wimplicit-fallthrough=]
    arch/arm64/include/asm/sysreg.h:808:2: warning: this statement may fall through [-Wimplicit-fallthrough=]
    arch/arm64/include/asm/sysreg.h:808:2: warning: this statement may fall through [-Wimplicit-fallthrough=]
    arch/arm64/include/asm/sysreg.h:808:2: warning: this statement may fall through [-Wimplicit-fallthrough=]
    arch/arm64/include/asm/sysreg.h:808:2: warning: this statement may fall through [-Wimplicit-fallthrough=]
    arch/arm64/include/asm/sysreg.h:808:2: warning: this statement may fall through [-Wimplicit-fallthrough=]
    arch/arm64/include/asm/sysreg.h:808:2: warning: this statement may fall through [-Wimplicit-fallthrough=]
    arch/arm64/include/asm/sysreg.h:808:2: warning: this statement may fall through [-Wimplicit-fallthrough=]
    arch/arm64/include/asm/sysreg.h:808:2: warning: this statement may fall through [-Wimplicit-fallthrough=]
    arch/arm64/include/asm/sysreg.h:808:2: warning: this statement may fall through [-Wimplicit-fallthrough=]
    arch/arm64/include/asm/sysreg.h:808:2: warning: this statement may fall through [-Wimplicit-fallthrough=]
    arch/arm64/include/asm/sysreg.h:808:2: warning: this statement may fall through [-Wimplicit-fallthrough=]
    arch/arm64/include/asm/sysreg.h:808:2: warning: this statement may fall through [-Wimplicit-fallthrough=]
    arch/arm64/include/asm/sysreg.h:808:2: warning: this statement may fall through [-Wimplicit-fallthrough=]
    arch/arm64/include/asm/sysreg.h:808:2: warning: this statement may fall through [-Wimplicit-fallthrough=]
    arch/arm64/include/asm/sysreg.h:808:2: warning: this statement may fall through [-Wimplicit-fallthrough=]
    arch/arm64/include/asm/sysreg.h:808:2: warning: this statement may fall through [-Wimplicit-fallthrough=]
    arch/arm64/include/asm/sysreg.h:808:2: warning: this statement may fall through [-Wimplicit-fallthrough=]
    arch/arm64/include/asm/sysreg.h:808:2: warning: this statement may fall through [-Wimplicit-fallthrough=]
    arch/arm64/include/asm/sysreg.h:808:2: warning: this statement may fall through [-Wimplicit-fallthrough=]
    arch/arm64/include/asm/sysreg.h:808:2: warning: this statement may fall through [-Wimplicit-fallthrough=]
    arch/arm64/include/asm/sysreg.h:808:2: warning: this statement may fall through [-Wimplicit-fallthrough=]
    arch/arm64/include/asm/sysreg.h:808:2: warning: this statement may fall through [-Wimplicit-fallthrough=]
    arch/arm64/include/asm/sysreg.h:808:2: warning: this statement may fall through [-Wimplicit-fallthrough=]
    arch/arm64/include/asm/sysreg.h:808:2: warning: this statement may fall through [-Wimplicit-fallthrough=]
    arch/arm64/include/asm/sysreg.h:808:2: warning: this statement may fall through [-Wimplicit-fallthrough=]
    arch/arm64/include/asm/sysreg.h:808:2: warning: this statement may fall through [-Wimplicit-fallthrough=]
    arch/arm64/include/asm/sysreg.h:808:2: warning: this statement may fall through [-Wimplicit-fallthrough=]
    arch/arm64/include/asm/sysreg.h:808:2: warning: this statement may fall through [-Wimplicit-fallthrough=]
    arch/arm64/include/asm/sysreg.h:808:2: warning: this statement may fall through [-Wimplicit-fallthrough=]
    arch/arm64/include/asm/sysreg.h:808:2: warning: this statement may fall through [-Wimplicit-fallthrough=]
    arch/arm64/include/asm/sysreg.h:808:2: warning: this statement may fall through [-Wimplicit-fallthrough=]
    arch/arm64/include/asm/sysreg.h:808:2: warning: this statement may fall through [-Wimplicit-fallthrough=]
    arch/arm64/include/asm/sysreg.h:808:2: warning: this statement may fall through [-Wimplicit-fallthrough=]
    arch/arm64/include/asm/sysreg.h:808:2: warning: this statement may fall through [-Wimplicit-fallthrough=]
    arch/arm64/include/asm/sysreg.h:808:2: warning: this statement may fall through [-Wimplicit-fallthrough=]
    arch/arm64/include/asm/sysreg.h:808:2: warning: this statement may fall through [-Wimplicit-fallthrough=]
    arch/arm64/include/asm/sysreg.h:808:2: warning: this statement may fall through [-Wimplicit-fallthrough=]
    arch/arm64/include/asm/sysreg.h:808:2: warning: this statement may fall through [-Wimplicit-fallthrough=]
    arch/arm64/include/asm/sysreg.h:808:2: warning: this statement may fall through [-Wimplicit-fallthrough=]
    arch/arm64/include/asm/sysreg.h:808:2: warning: this statement may fall through [-Wimplicit-fallthrough=]
    arch/arm64/include/asm/sysreg.h:808:2: warning: this statement may fall through [-Wimplicit-fallthrough=]
    arch/arm64/include/asm/sysreg.h:808:2: warning: this statement may fall through [-Wimplicit-fallthrough=]
    arch/arm64/include/asm/sysreg.h:808:2: warning: this statement may fall through [-Wimplicit-fallthrough=]
    arch/arm64/include/asm/sysreg.h:808:2: warning: this statement may fall through [-Wimplicit-fallthrough=]
    arch/arm64/include/asm/sysreg.h:808:2: warning: this statement may fall through [-Wimplicit-fallthrough=]
    arch/arm64/include/asm/sysreg.h:808:2: warning: this statement may fall through [-Wimplicit-fallthrough=]
    arch/arm64/include/asm/sysreg.h:808:2: warning: this statement may fall through [-Wimplicit-fallthrough=]
    arch/arm64/include/asm/sysreg.h:808:2: warning: this statement may fall through [-Wimplicit-fallthrough=]
    arch/arm64/include/asm/sysreg.h:808:2: warning: this statement may fall through [-Wimplicit-fallthrough=]
    arch/arm64/include/asm/sysreg.h:808:2: warning: this statement may fall through [-Wimplicit-fallthrough=]
    arch/arm64/include/asm/sysreg.h:808:2: warning: this statement may fall through [-Wimplicit-fallthrough=]
    arch/arm64/include/asm/kvm_hyp.h:31:3: warning: this statement may fall through [-Wimplicit-fallthrough=]
    arch/arm64/include/asm/sysreg.h:808:2: warning: this statement may fall through [-Wimplicit-fallthrough=]
    arch/arm64/include/asm/sysreg.h:808:2: warning: this statement may fall through [-Wimplicit-fallthrough=]
    arch/arm64/include/asm/sysreg.h:808:2: warning: this statement may fall through [-Wimplicit-fallthrough=]
    drivers/iommu/arm-smmu-v3.c:1189:7: warning: this statement may fall through [-Wimplicit-fallthrough=]
    drivers/of/platform.c:650:18: warning: ?: using integer constants in boolean context [-Wint-in-bool-context]
    drivers/gpu/drm/sun4i/sun4i_tcon.c:318:7: warning: this statement may fall through [-Wimplicit-fallthrough=]

--------------------------------------------------------------------------------
defconfig+CONFIG_CPU_BIG_ENDIAN=y (arm64, clang-8) — FAIL, 1 error, 0 warnings, 0 section mismatches

Errors:
    drivers/phy/rockchip/phy-rockchip-inno-hdmi.c:1046:26: error: anonymous bit-field has negative width (-1)

--------------------------------------------------------------------------------
defconfig+CONFIG_RANDOMIZE_BASE=y (arm64, gcc-8) — FAIL, 1 error, 135 warnings, 0 section mismatches

Errors:
    include/linux/build_bug.h:16:45: error: negative width in bit-field '<anonymous>'

Warnings:
    arch/arm64/kvm/hyp/../../../../virt/kvm/arm/hyp/vgic-v3-sr.c:351:24: warning: this statement may fall through [-Wimplicit-fallthrough=]
    arch/arm64/kvm/hyp/../../../../virt/kvm/arm/hyp/vgic-v3-sr.c:353:24: warning: this statement may fall through [-Wimplicit-fallthrough=]
    arch/arm64/kvm/hyp/../../../../virt/kvm/arm/hyp/vgic-v3-sr.c:361:24: warning: this statement may fall through [-Wimplicit-fallthrough=]
    arch/arm64/kvm/hyp/../../../../virt/kvm/arm/hyp/vgic-v3-sr.c:363:24: warning: this statement may fall through [-Wimplicit-fallthrough=]
    arch/arm64/kvm/hyp/../../../../virt/kvm/arm/hyp/vgic-v3-sr.c:384:3: warning: this statement may fall through [-Wimplicit-fallthrough=]
    arch/arm64/kvm/hyp/../../../../virt/kvm/arm/hyp/vgic-v3-sr.c:386:3: warning: this statement may fall through [-Wimplicit-fallthrough=]
    arch/arm64/kvm/hyp/../../../../virt/kvm/arm/hyp/vgic-v3-sr.c:394:3: warning: this statement may fall through [-Wimplicit-fallthrough=]
    arch/arm64/kvm/hyp/../../../../virt/kvm/arm/hyp/vgic-v3-sr.c:396:3: warning: this statement may fall through [-Wimplicit-fallthrough=]
    arch/arm64/kvm/hyp/debug-sr.c:20:19: warning: this statement may fall through [-Wimplicit-fallthrough=]
    arch/arm64/kvm/hyp/debug-sr.c:21:19: warning: this statement may fall through [-Wimplicit-fallthrough=]
    arch/arm64/kvm/hyp/debug-sr.c:22:19: warning: this statement may fall through [-Wimplicit-fallthrough=]
    arch/arm64/kvm/hyp/debug-sr.c:23:19: warning: this statement may fall through [-Wimplicit-fallthrough=]
    arch/arm64/kvm/hyp/debug-sr.c:24:19: warning: this statement may fall through [-Wimplicit-fallthrough=]
    arch/arm64/kvm/hyp/debug-sr.c:25:19: warning: this statement may fall through [-Wimplicit-fallthrough=]
    arch/arm64/kvm/hyp/debug-sr.c:26:18: warning: this statement may fall through [-Wimplicit-fallthrough=]
    arch/arm64/kvm/hyp/debug-sr.c:27:18: warning: this statement may fall through [-Wimplicit-fallthrough=]
    arch/arm64/kvm/hyp/debug-sr.c:28:18: warning: this statement may fall through [-Wimplicit-fallthrough=]
    arch/arm64/kvm/hyp/debug-sr.c:29:18: warning: this statement may fall through [-Wimplicit-fallthrough=]
    arch/arm64/kvm/hyp/debug-sr.c:30:18: warning: this statement may fall through [-Wimplicit-fallthrough=]
    arch/arm64/kvm/hyp/debug-sr.c:31:18: warning: this statement may fall through [-Wimplicit-fallthrough=]
    arch/arm64/kvm/hyp/debug-sr.c:32:18: warning: this statement may fall through [-Wimplicit-fallthrough=]
    arch/arm64/kvm/hyp/debug-sr.c:33:18: warning: this statement may fall through [-Wimplicit-fallthrough=]
    arch/arm64/kvm/hyp/debug-sr.c:34:18: warning: this statement may fall through [-Wimplicit-fallthrough=]
    arch/arm64/kvm/hyp/debug-sr.c:20:19: warning: this statement may fall through [-Wimplicit-fallthrough=]
    arch/arm64/kvm/hyp/debug-sr.c:21:19: warning: this statement may fall through [-Wimplicit-fallthrough=]
    arch/arm64/kvm/hyp/debug-sr.c:22:19: warning: this statement may fall through [-Wimplicit-fallthrough=]
    arch/arm64/kvm/hyp/debug-sr.c:23:19: warning: this statement may fall through [-Wimplicit-fallthrough=]
    arch/arm64/kvm/hyp/debug-sr.c:24:19: warning: this statement may fall through [-Wimplicit-fallthrough=]
    arch/arm64/kvm/hyp/debug-sr.c:25:19: warning: this statement may fall through [-Wimplicit-fallthrough=]
    arch/arm64/kvm/hyp/debug-sr.c:26:18: warning: this statement may fall through [-Wimplicit-fallthrough=]
    arch/arm64/kvm/hyp/debug-sr.c:27:18: warning: this statement may fall through [-Wimplicit-fallthrough=]
    arch/arm64/kvm/hyp/debug-sr.c:28:18: warning: this statement may fall through [-Wimplicit-fallthrough=]
    arch/arm64/kvm/hyp/debug-sr.c:29:18: warning: this statement may fall through [-Wimplicit-fallthrough=]
    arch/arm64/kvm/hyp/debug-sr.c:30:18: warning: this statement may fall through [-Wimplicit-fallthrough=]
    arch/arm64/kvm/hyp/debug-sr.c:31:18: warning: this statement may fall through [-Wimplicit-fallthrough=]
    arch/arm64/kvm/hyp/debug-sr.c:32:18: warning: this statement may fall through [-Wimplicit-fallthrough=]
    arch/arm64/kvm/hyp/debug-sr.c:33:18: warning: this statement may fall through [-Wimplicit-fallthrough=]
    arch/arm64/kvm/hyp/debug-sr.c:34:18: warning: this statement may fall through [-Wimplicit-fallthrough=]
    arch/arm64/kvm/hyp/debug-sr.c:20:19: warning: this statement may fall through [-Wimplicit-fallthrough=]
    arch/arm64/kvm/hyp/debug-sr.c:21:19: warning: this statement may fall through [-Wimplicit-fallthrough=]
    arch/arm64/kvm/hyp/debug-sr.c:22:19: warning: this statement may fall through [-Wimplicit-fallthrough=]
    arch/arm64/kvm/hyp/debug-sr.c:23:19: warning: this statement may fall through [-Wimplicit-fallthrough=]
    arch/arm64/kvm/hyp/debug-sr.c:24:19: warning: this statement may fall through [-Wimplicit-fallthrough=]
    arch/arm64/kvm/hyp/debug-sr.c:25:19: warning: this statement may fall through [-Wimplicit-fallthrough=]
    arch/arm64/kvm/hyp/debug-sr.c:26:18: warning: this statement may fall through [-Wimplicit-fallthrough=]
    arch/arm64/kvm/hyp/debug-sr.c:27:18: warning: this statement may fall through [-Wimplicit-fallthrough=]
    arch/arm64/kvm/hyp/debug-sr.c:28:18: warning: this statement may fall through [-Wimplicit-fallthrough=]
    arch/arm64/kvm/hyp/debug-sr.c:29:18: warning: this statement may fall through [-Wimplicit-fallthrough=]
    arch/arm64/kvm/hyp/debug-sr.c:30:18: warning: this statement may fall through [-Wimplicit-fallthrough=]
    arch/arm64/kvm/hyp/debug-sr.c:31:18: warning: this statement may fall through [-Wimplicit-fallthrough=]
    arch/arm64/kvm/hyp/debug-sr.c:32:18: warning: this statement may fall through [-Wimplicit-fallthrough=]
    arch/arm64/kvm/hyp/debug-sr.c:33:18: warning: this statement may fall through [-Wimplicit-fallthrough=]
    arch/arm64/kvm/hyp/debug-sr.c:34:18: warning: this statement may fall through [-Wimplicit-fallthrough=]
    arch/arm64/kvm/hyp/debug-sr.c:20:19: warning: this statement may fall through [-Wimplicit-fallthrough=]
    arch/arm64/kvm/hyp/debug-sr.c:21:19: warning: this statement may fall through [-Wimplicit-fallthrough=]
    arch/arm64/kvm/hyp/debug-sr.c:22:19: warning: this statement may fall through [-Wimplicit-fallthrough=]
    arch/arm64/kvm/hyp/debug-sr.c:23:19: warning: this statement may fall through [-Wimplicit-fallthrough=]
    arch/arm64/kvm/hyp/debug-sr.c:24:19: warning: this statement may fall through [-Wimplicit-fallthrough=]
    arch/arm64/kvm/hyp/debug-sr.c:25:19: warning: this statement may fall through [-Wimplicit-fallthrough=]
    arch/arm64/kvm/hyp/debug-sr.c:26:18: warning: this statement may fall through [-Wimplicit-fallthrough=]
    arch/arm64/kvm/hyp/debug-sr.c:27:18: warning: this statement may fall through [-Wimplicit-fallthrough=]
    arch/arm64/kvm/hyp/debug-sr.c:28:18: warning: this statement may fall through [-Wimplicit-fallthrough=]
    arch/arm64/kvm/hyp/debug-sr.c:29:18: warning: this statement may fall through [-Wimplicit-fallthrough=]
    arch/arm64/kvm/hyp/debug-sr.c:30:18: warning: this statement may fall through [-Wimplicit-fallthrough=]
    arch/arm64/kvm/hyp/debug-sr.c:31:18: warning: this statement may fall through [-Wimplicit-fallthrough=]
    arch/arm64/kvm/hyp/debug-sr.c:32:18: warning: this statement may fall through [-Wimplicit-fallthrough=]
    arch/arm64/kvm/hyp/debug-sr.c:33:18: warning: this statement may fall through [-Wimplicit-fallthrough=]
    arch/arm64/kvm/hyp/debug-sr.c:34:18: warning: this statement may fall through [-Wimplicit-fallthrough=]
    arch/arm64/include/asm/sysreg.h:808:2: warning: this statement may fall through [-Wimplicit-fallthrough=]
    arch/arm64/include/asm/sysreg.h:808:2: warning: this statement may fall through [-Wimplicit-fallthrough=]
    arch/arm64/include/asm/sysreg.h:808:2: warning: this statement may fall through [-Wimplicit-fallthrough=]
    arch/arm64/include/asm/sysreg.h:808:2: warning: this statement may fall through [-Wimplicit-fallthrough=]
    arch/arm64/include/asm/sysreg.h:808:2: warning: this statement may fall through [-Wimplicit-fallthrough=]
    arch/arm64/include/asm/sysreg.h:808:2: warning: this statement may fall through [-Wimplicit-fallthrough=]
    arch/arm64/include/asm/sysreg.h:808:2: warning: this statement may fall through [-Wimplicit-fallthrough=]
    arch/arm64/include/asm/sysreg.h:808:2: warning: this statement may fall through [-Wimplicit-fallthrough=]
    arch/arm64/include/asm/sysreg.h:808:2: warning: this statement may fall through [-Wimplicit-fallthrough=]
    arch/arm64/include/asm/sysreg.h:808:2: warning: this statement may fall through [-Wimplicit-fallthrough=]
    arch/arm64/include/asm/sysreg.h:808:2: warning: this statement may fall through [-Wimplicit-fallthrough=]
    arch/arm64/include/asm/sysreg.h:808:2: warning: this statement may fall through [-Wimplicit-fallthrough=]
    arch/arm64/include/asm/sysreg.h:808:2: warning: this statement may fall through [-Wimplicit-fallthrough=]
    arch/arm64/include/asm/sysreg.h:808:2: warning: this statement may fall through [-Wimplicit-fallthrough=]
    arch/arm64/include/asm/sysreg.h:808:2: warning: this statement may fall through [-Wimplicit-fallthrough=]
    arch/arm64/include/asm/sysreg.h:808:2: warning: this statement may fall through [-Wimplicit-fallthrough=]
    arch/arm64/include/asm/sysreg.h:808:2: warning: this statement may fall through [-Wimplicit-fallthrough=]
    arch/arm64/include/asm/sysreg.h:808:2: warning: this statement may fall through [-Wimplicit-fallthrough=]
    arch/arm64/include/asm/sysreg.h:808:2: warning: this statement may fall through [-Wimplicit-fallthrough=]
    arch/arm64/include/asm/sysreg.h:808:2: warning: this statement may fall through [-Wimplicit-fallthrough=]
    arch/arm64/include/asm/sysreg.h:808:2: warning: this statement may fall through [-Wimplicit-fallthrough=]
    arch/arm64/include/asm/sysreg.h:808:2: warning: this statement may fall through [-Wimplicit-fallthrough=]
    arch/arm64/include/asm/sysreg.h:808:2: warning: this statement may fall through [-Wimplicit-fallthrough=]
    arch/arm64/include/asm/sysreg.h:808:2: warning: this statement may fall through [-Wimplicit-fallthrough=]
    arch/arm64/include/asm/sysreg.h:808:2: warning: this statement may fall through [-Wimplicit-fallthrough=]
    arch/arm64/include/asm/sysreg.h:808:2: warning: this statement may fall through [-Wimplicit-fallthrough=]
    arch/arm64/include/asm/sysreg.h:808:2: warning: this statement may fall through [-Wimplicit-fallthrough=]
    arch/arm64/include/asm/sysreg.h:808:2: warning: this statement may fall through [-Wimplicit-fallthrough=]
    arch/arm64/include/asm/sysreg.h:808:2: warning: this statement may fall through [-Wimplicit-fallthrough=]
    arch/arm64/include/asm/sysreg.h:808:2: warning: this statement may fall through [-Wimplicit-fallthrough=]
    arch/arm64/include/asm/sysreg.h:808:2: warning: this statement may fall through [-Wimplicit-fallthrough=]
    arch/arm64/include/asm/sysreg.h:808:2: warning: this statement may fall through [-Wimplicit-fallthrough=]
    arch/arm64/include/asm/sysreg.h:808:2: warning: this statement may fall through [-Wimplicit-fallthrough=]
    arch/arm64/include/asm/sysreg.h:808:2: warning: this statement may fall through [-Wimplicit-fallthrough=]
    arch/arm64/include/asm/sysreg.h:808:2: warning: this statement may fall through [-Wimplicit-fallthrough=]
    arch/arm64/include/asm/sysreg.h:808:2: warning: this statement may fall through [-Wimplicit-fallthrough=]
    arch/arm64/include/asm/sysreg.h:808:2: warning: this statement may fall through [-Wimplicit-fallthrough=]
    arch/arm64/include/asm/sysreg.h:808:2: warning: this statement may fall through [-Wimplicit-fallthrough=]
    arch/arm64/include/asm/sysreg.h:808:2: warning: this statement may fall through [-Wimplicit-fallthrough=]
    arch/arm64/include/asm/sysreg.h:808:2: warning: this statement may fall through [-Wimplicit-fallthrough=]
    arch/arm64/include/asm/sysreg.h:808:2: warning: this statement may fall through [-Wimplicit-fallthrough=]
    arch/arm64/include/asm/sysreg.h:808:2: warning: this statement may fall through [-Wimplicit-fallthrough=]
    arch/arm64/include/asm/sysreg.h:808:2: warning: this statement may fall through [-Wimplicit-fallthrough=]
    arch/arm64/include/asm/sysreg.h:808:2: warning: this statement may fall through [-Wimplicit-fallthrough=]
    arch/arm64/include/asm/sysreg.h:808:2: warning: this statement may fall through [-Wimplicit-fallthrough=]
    arch/arm64/include/asm/sysreg.h:808:2: warning: this statement may fall through [-Wimplicit-fallthrough=]
    arch/arm64/include/asm/sysreg.h:808:2: warning: this statement may fall through [-Wimplicit-fallthrough=]
    arch/arm64/include/asm/sysreg.h:808:2: warning: this statement may fall through [-Wimplicit-fallthrough=]
    arch/arm64/include/asm/sysreg.h:808:2: warning: this statement may fall through [-Wimplicit-fallthrough=]
    arch/arm64/include/asm/sysreg.h:808:2: warning: this statement may fall through [-Wimplicit-fallthrough=]
    arch/arm64/include/asm/sysreg.h:808:2: warning: this statement may fall through [-Wimplicit-fallthrough=]
    arch/arm64/include/asm/sysreg.h:808:2: warning: this statement may fall through [-Wimplicit-fallthrough=]
    arch/arm64/include/asm/sysreg.h:808:2: warning: this statement may fall through [-Wimplicit-fallthrough=]
    arch/arm64/include/asm/sysreg.h:808:2: warning: this statement may fall through [-Wimplicit-fallthrough=]
    arch/arm64/include/asm/sysreg.h:808:2: warning: this statement may fall through [-Wimplicit-fallthrough=]
    arch/arm64/include/asm/sysreg.h:808:2: warning: this statement may fall through [-Wimplicit-fallthrough=]
    arch/arm64/include/asm/sysreg.h:808:2: warning: this statement may fall through [-Wimplicit-fallthrough=]
    arch/arm64/include/asm/sysreg.h:808:2: warning: this statement may fall through [-Wimplicit-fallthrough=]
    arch/arm64/include/asm/sysreg.h:808:2: warning: this statement may fall through [-Wimplicit-fallthrough=]
    arch/arm64/include/asm/sysreg.h:808:2: warning: this statement may fall through [-Wimplicit-fallthrough=]
    arch/arm64/include/asm/kvm_hyp.h:31:3: warning: this statement may fall through [-Wimplicit-fallthrough=]
    arch/arm64/include/asm/sysreg.h:808:2: warning: this statement may fall through [-Wimplicit-fallthrough=]
    arch/arm64/include/asm/sysreg.h:808:2: warning: this statement may fall through [-Wimplicit-fallthrough=]
    arch/arm64/include/asm/sysreg.h:808:2: warning: this statement may fall through [-Wimplicit-fallthrough=]
    drivers/iommu/arm-smmu-v3.c:1189:7: warning: this statement may fall through [-Wimplicit-fallthrough=]
    drivers/of/platform.c:650:18: warning: ?: using integer constants in boolean context [-Wint-in-bool-context]
    drivers/gpu/drm/sun4i/sun4i_tcon.c:318:7: warning: this statement may fall through [-Wimplicit-fallthrough=]

--------------------------------------------------------------------------------
defconfig+CONFIG_RANDOMIZE_BASE=y (arm64, clang-8) — FAIL, 1 error, 0 warnings, 0 section mismatches

Errors:
    drivers/phy/rockchip/phy-rockchip-inno-hdmi.c:1046:26: error: anonymous bit-field has negative width (-1)

--------------------------------------------------------------------------------
defconfig+kselftest (arm64, clang-8) — FAIL, 1 error, 0 warnings, 0 section mismatches

Errors:
    drivers/phy/rockchip/phy-rockchip-inno-hdmi.c:1046:26: error: anonymous bit-field has negative width (-1)

--------------------------------------------------------------------------------
defconfig+kselftest (riscv, gcc-8) — PASS, 0 errors, 1 warning, 0 section mismatches

Warnings:
    drivers/of/platform.c:650:18: warning: ?: using integer constants in boolean context [-Wint-in-bool-context]

--------------------------------------------------------------------------------
defconfig+kselftest (arm64, gcc-8) — FAIL, 1 error, 135 warnings, 0 section mismatches

Errors:
    include/linux/build_bug.h:16:45: error: negative width in bit-field '<anonymous>'

Warnings:
    arch/arm64/kvm/hyp/../../../../virt/kvm/arm/hyp/vgic-v3-sr.c:351:24: warning: this statement may fall through [-Wimplicit-fallthrough=]
    arch/arm64/kvm/hyp/../../../../virt/kvm/arm/hyp/vgic-v3-sr.c:353:24: warning: this statement may fall through [-Wimplicit-fallthrough=]
    arch/arm64/kvm/hyp/../../../../virt/kvm/arm/hyp/vgic-v3-sr.c:361:24: warning: this statement may fall through [-Wimplicit-fallthrough=]
    arch/arm64/kvm/hyp/../../../../virt/kvm/arm/hyp/vgic-v3-sr.c:363:24: warning: this statement may fall through [-Wimplicit-fallthrough=]
    arch/arm64/kvm/hyp/../../../../virt/kvm/arm/hyp/vgic-v3-sr.c:384:3: warning: this statement may fall through [-Wimplicit-fallthrough=]
    arch/arm64/kvm/hyp/../../../../virt/kvm/arm/hyp/vgic-v3-sr.c:386:3: warning: this statement may fall through [-Wimplicit-fallthrough=]
    arch/arm64/kvm/hyp/../../../../virt/kvm/arm/hyp/vgic-v3-sr.c:394:3: warning: this statement may fall through [-Wimplicit-fallthrough=]
    arch/arm64/kvm/hyp/../../../../virt/kvm/arm/hyp/vgic-v3-sr.c:396:3: warning: this statement may fall through [-Wimplicit-fallthrough=]
    arch/arm64/kvm/hyp/debug-sr.c:20:19: warning: this statement may fall through [-Wimplicit-fallthrough=]
    arch/arm64/kvm/hyp/debug-sr.c:21:19: warning: this statement may fall through [-Wimplicit-fallthrough=]
    arch/arm64/kvm/hyp/debug-sr.c:22:19: warning: this statement may fall through [-Wimplicit-fallthrough=]
    arch/arm64/kvm/hyp/debug-sr.c:23:19: warning: this statement may fall through [-Wimplicit-fallthrough=]
    arch/arm64/kvm/hyp/debug-sr.c:24:19: warning: this statement may fall through [-Wimplicit-fallthrough=]
    arch/arm64/kvm/hyp/debug-sr.c:25:19: warning: this statement may fall through [-Wimplicit-fallthrough=]
    arch/arm64/kvm/hyp/debug-sr.c:26:18: warning: this statement may fall through [-Wimplicit-fallthrough=]
    arch/arm64/kvm/hyp/debug-sr.c:27:18: warning: this statement may fall through [-Wimplicit-fallthrough=]
    arch/arm64/kvm/hyp/debug-sr.c:28:18: warning: this statement may fall through [-Wimplicit-fallthrough=]
    arch/arm64/kvm/hyp/debug-sr.c:29:18: warning: this statement may fall through [-Wimplicit-fallthrough=]
    arch/arm64/kvm/hyp/debug-sr.c:30:18: warning: this statement may fall through [-Wimplicit-fallthrough=]
    arch/arm64/kvm/hyp/debug-sr.c:31:18: warning: this statement may fall through [-Wimplicit-fallthrough=]
    arch/arm64/kvm/hyp/debug-sr.c:32:18: warning: this statement may fall through [-Wimplicit-fallthrough=]
    arch/arm64/kvm/hyp/debug-sr.c:33:18: warning: this statement may fall through [-Wimplicit-fallthrough=]
    arch/arm64/kvm/hyp/debug-sr.c:34:18: warning: this statement may fall through [-Wimplicit-fallthrough=]
    arch/arm64/kvm/hyp/debug-sr.c:20:19: warning: this statement may fall through [-Wimplicit-fallthrough=]
    arch/arm64/kvm/hyp/debug-sr.c:21:19: warning: this statement may fall through [-Wimplicit-fallthrough=]
    arch/arm64/kvm/hyp/debug-sr.c:22:19: warning: this statement may fall through [-Wimplicit-fallthrough=]
    arch/arm64/kvm/hyp/debug-sr.c:23:19: warning: this statement may fall through [-Wimplicit-fallthrough=]
    arch/arm64/kvm/hyp/debug-sr.c:24:19: warning: this statement may fall through [-Wimplicit-fallthrough=]
    arch/arm64/kvm/hyp/debug-sr.c:25:19: warning: this statement may fall through [-Wimplicit-fallthrough=]
    arch/arm64/kvm/hyp/debug-sr.c:26:18: warning: this statement may fall through [-Wimplicit-fallthrough=]
    arch/arm64/kvm/hyp/debug-sr.c:27:18: warning: this statement may fall through [-Wimplicit-fallthrough=]
    arch/arm64/kvm/hyp/debug-sr.c:28:18: warning: this statement may fall through [-Wimplicit-fallthrough=]
    arch/arm64/kvm/hyp/debug-sr.c:29:18: warning: this statement may fall through [-Wimplicit-fallthrough=]
    arch/arm64/kvm/hyp/debug-sr.c:30:18: warning: this statement may fall through [-Wimplicit-fallthrough=]
    arch/arm64/kvm/hyp/debug-sr.c:31:18: warning: this statement may fall through [-Wimplicit-fallthrough=]
    arch/arm64/kvm/hyp/debug-sr.c:32:18: warning: this statement may fall through [-Wimplicit-fallthrough=]
    arch/arm64/kvm/hyp/debug-sr.c:33:18: warning: this statement may fall through [-Wimplicit-fallthrough=]
    arch/arm64/kvm/hyp/debug-sr.c:34:18: warning: this statement may fall through [-Wimplicit-fallthrough=]
    arch/arm64/kvm/hyp/debug-sr.c:20:19: warning: this statement may fall through [-Wimplicit-fallthrough=]
    arch/arm64/kvm/hyp/debug-sr.c:21:19: warning: this statement may fall through [-Wimplicit-fallthrough=]
    arch/arm64/kvm/hyp/debug-sr.c:22:19: warning: this statement may fall through [-Wimplicit-fallthrough=]
    arch/arm64/kvm/hyp/debug-sr.c:23:19: warning: this statement may fall through [-Wimplicit-fallthrough=]
    arch/arm64/kvm/hyp/debug-sr.c:24:19: warning: this statement may fall through [-Wimplicit-fallthrough=]
    arch/arm64/kvm/hyp/debug-sr.c:25:19: warning: this statement may fall through [-Wimplicit-fallthrough=]
    arch/arm64/kvm/hyp/debug-sr.c:26:18: warning: this statement may fall through [-Wimplicit-fallthrough=]
    arch/arm64/kvm/hyp/debug-sr.c:27:18: warning: this statement may fall through [-Wimplicit-fallthrough=]
    arch/arm64/kvm/hyp/debug-sr.c:28:18: warning: this statement may fall through [-Wimplicit-fallthrough=]
    arch/arm64/kvm/hyp/debug-sr.c:29:18: warning: this statement may fall through [-Wimplicit-fallthrough=]
    arch/arm64/kvm/hyp/debug-sr.c:30:18: warning: this statement may fall through [-Wimplicit-fallthrough=]
    arch/arm64/kvm/hyp/debug-sr.c:31:18: warning: this statement may fall through [-Wimplicit-fallthrough=]
    arch/arm64/kvm/hyp/debug-sr.c:32:18: warning: this statement may fall through [-Wimplicit-fallthrough=]
    arch/arm64/kvm/hyp/debug-sr.c:33:18: warning: this statement may fall through [-Wimplicit-fallthrough=]
    arch/arm64/kvm/hyp/debug-sr.c:34:18: warning: this statement may fall through [-Wimplicit-fallthrough=]
    arch/arm64/kvm/hyp/debug-sr.c:20:19: warning: this statement may fall through [-Wimplicit-fallthrough=]
    arch/arm64/kvm/hyp/debug-sr.c:21:19: warning: this statement may fall through [-Wimplicit-fallthrough=]
    arch/arm64/kvm/hyp/debug-sr.c:22:19: warning: this statement may fall through [-Wimplicit-fallthrough=]
    arch/arm64/kvm/hyp/debug-sr.c:23:19: warning: this statement may fall through [-Wimplicit-fallthrough=]
    arch/arm64/kvm/hyp/debug-sr.c:24:19: warning: this statement may fall through [-Wimplicit-fallthrough=]
    arch/arm64/kvm/hyp/debug-sr.c:25:19: warning: this statement may fall through [-Wimplicit-fallthrough=]
    arch/arm64/kvm/hyp/debug-sr.c:26:18: warning: this statement may fall through [-Wimplicit-fallthrough=]
    arch/arm64/kvm/hyp/debug-sr.c:27:18: warning: this statement may fall through [-Wimplicit-fallthrough=]
    arch/arm64/kvm/hyp/debug-sr.c:28:18: warning: this statement may fall through [-Wimplicit-fallthrough=]
    arch/arm64/kvm/hyp/debug-sr.c:29:18: warning: this statement may fall through [-Wimplicit-fallthrough=]
    arch/arm64/kvm/hyp/debug-sr.c:30:18: warning: this statement may fall through [-Wimplicit-fallthrough=]
    arch/arm64/kvm/hyp/debug-sr.c:31:18: warning: this statement may fall through [-Wimplicit-fallthrough=]
    arch/arm64/kvm/hyp/debug-sr.c:32:18: warning: this statement may fall through [-Wimplicit-fallthrough=]
    arch/arm64/kvm/hyp/debug-sr.c:33:18: warning: this statement may fall through [-Wimplicit-fallthrough=]
    arch/arm64/kvm/hyp/debug-sr.c:34:18: warning: this statement may fall through [-Wimplicit-fallthrough=]
    arch/arm64/include/asm/sysreg.h:808:2: warning: this statement may fall through [-Wimplicit-fallthrough=]
    arch/arm64/include/asm/sysreg.h:808:2: warning: this statement may fall through [-Wimplicit-fallthrough=]
    arch/arm64/include/asm/sysreg.h:808:2: warning: this statement may fall through [-Wimplicit-fallthrough=]
    arch/arm64/include/asm/sysreg.h:808:2: warning: this statement may fall through [-Wimplicit-fallthrough=]
    arch/arm64/include/asm/sysreg.h:808:2: warning: this statement may fall through [-Wimplicit-fallthrough=]
    arch/arm64/include/asm/sysreg.h:808:2: warning: this statement may fall through [-Wimplicit-fallthrough=]
    arch/arm64/include/asm/sysreg.h:808:2: warning: this statement may fall through [-Wimplicit-fallthrough=]
    arch/arm64/include/asm/sysreg.h:808:2: warning: this statement may fall through [-Wimplicit-fallthrough=]
    arch/arm64/include/asm/sysreg.h:808:2: warning: this statement may fall through [-Wimplicit-fallthrough=]
    arch/arm64/include/asm/sysreg.h:808:2: warning: this statement may fall through [-Wimplicit-fallthrough=]
    arch/arm64/include/asm/sysreg.h:808:2: warning: this statement may fall through [-Wimplicit-fallthrough=]
    arch/arm64/include/asm/sysreg.h:808:2: warning: this statement may fall through [-Wimplicit-fallthrough=]
    arch/arm64/include/asm/sysreg.h:808:2: warning: this statement may fall through [-Wimplicit-fallthrough=]
    arch/arm64/include/asm/sysreg.h:808:2: warning: this statement may fall through [-Wimplicit-fallthrough=]
    arch/arm64/include/asm/sysreg.h:808:2: warning: this statement may fall through [-Wimplicit-fallthrough=]
    arch/arm64/include/asm/sysreg.h:808:2: warning: this statement may fall through [-Wimplicit-fallthrough=]
    arch/arm64/include/asm/sysreg.h:808:2: warning: this statement may fall through [-Wimplicit-fallthrough=]
    arch/arm64/include/asm/sysreg.h:808:2: warning: this statement may fall through [-Wimplicit-fallthrough=]
    arch/arm64/include/asm/sysreg.h:808:2: warning: this statement may fall through [-Wimplicit-fallthrough=]
    arch/arm64/include/asm/sysreg.h:808:2: warning: this statement may fall through [-Wimplicit-fallthrough=]
    arch/arm64/include/asm/sysreg.h:808:2: warning: this statement may fall through [-Wimplicit-fallthrough=]
    arch/arm64/include/asm/sysreg.h:808:2: warning: this statement may fall through [-Wimplicit-fallthrough=]
    arch/arm64/include/asm/sysreg.h:808:2: warning: this statement may fall through [-Wimplicit-fallthrough=]
    arch/arm64/include/asm/sysreg.h:808:2: warning: this statement may fall through [-Wimplicit-fallthrough=]
    arch/arm64/include/asm/sysreg.h:808:2: warning: this statement may fall through [-Wimplicit-fallthrough=]
    arch/arm64/include/asm/sysreg.h:808:2: warning: this statement may fall through [-Wimplicit-fallthrough=]
    arch/arm64/include/asm/sysreg.h:808:2: warning: this statement may fall through [-Wimplicit-fallthrough=]
    arch/arm64/include/asm/sysreg.h:808:2: warning: this statement may fall through [-Wimplicit-fallthrough=]
    arch/arm64/include/asm/sysreg.h:808:2: warning: this statement may fall through [-Wimplicit-fallthrough=]
    arch/arm64/include/asm/sysreg.h:808:2: warning: this statement may fall through [-Wimplicit-fallthrough=]
    arch/arm64/include/asm/sysreg.h:808:2: warning: this statement may fall through [-Wimplicit-fallthrough=]
    arch/arm64/include/asm/sysreg.h:808:2: warning: this statement may fall through [-Wimplicit-fallthrough=]
    arch/arm64/include/asm/sysreg.h:808:2: warning: this statement may fall through [-Wimplicit-fallthrough=]
    arch/arm64/include/asm/sysreg.h:808:2: warning: this statement may fall through [-Wimplicit-fallthrough=]
    arch/arm64/include/asm/sysreg.h:808:2: warning: this statement may fall through [-Wimplicit-fallthrough=]
    arch/arm64/include/asm/sysreg.h:808:2: warning: this statement may fall through [-Wimplicit-fallthrough=]
    arch/arm64/include/asm/sysreg.h:808:2: warning: this statement may fall through [-Wimplicit-fallthrough=]
    arch/arm64/include/asm/sysreg.h:808:2: warning: this statement may fall through [-Wimplicit-fallthrough=]
    arch/arm64/include/asm/sysreg.h:808:2: warning: this statement may fall through [-Wimplicit-fallthrough=]
    arch/arm64/include/asm/sysreg.h:808:2: warning: this statement may fall through [-Wimplicit-fallthrough=]
    arch/arm64/include/asm/sysreg.h:808:2: warning: this statement may fall through [-Wimplicit-fallthrough=]
    arch/arm64/include/asm/sysreg.h:808:2: warning: this statement may fall through [-Wimplicit-fallthrough=]
    arch/arm64/include/asm/sysreg.h:808:2: warning: this statement may fall through [-Wimplicit-fallthrough=]
    arch/arm64/include/asm/sysreg.h:808:2: warning: this statement may fall through [-Wimplicit-fallthrough=]
    arch/arm64/include/asm/sysreg.h:808:2: warning: this statement may fall through [-Wimplicit-fallthrough=]
    arch/arm64/include/asm/sysreg.h:808:2: warning: this statement may fall through [-Wimplicit-fallthrough=]
    arch/arm64/include/asm/sysreg.h:808:2: warning: this statement may fall through [-Wimplicit-fallthrough=]
    arch/arm64/include/asm/sysreg.h:808:2: warning: this statement may fall through [-Wimplicit-fallthrough=]
    arch/arm64/include/asm/sysreg.h:808:2: warning: this statement may fall through [-Wimplicit-fallthrough=]
    arch/arm64/include/asm/sysreg.h:808:2: warning: this statement may fall through [-Wimplicit-fallthrough=]
    arch/arm64/include/asm/sysreg.h:808:2: warning: this statement may fall through [-Wimplicit-fallthrough=]
    arch/arm64/include/asm/sysreg.h:808:2: warning: this statement may fall through [-Wimplicit-fallthrough=]
    arch/arm64/include/asm/sysreg.h:808:2: warning: this statement may fall through [-Wimplicit-fallthrough=]
    arch/arm64/include/asm/sysreg.h:808:2: warning: this statement may fall through [-Wimplicit-fallthrough=]
    arch/arm64/include/asm/sysreg.h:808:2: warning: this statement may fall through [-Wimplicit-fallthrough=]
    arch/arm64/include/asm/sysreg.h:808:2: warning: this statement may fall through [-Wimplicit-fallthrough=]
    arch/arm64/include/asm/sysreg.h:808:2: warning: this statement may fall through [-Wimplicit-fallthrough=]
    arch/arm64/include/asm/sysreg.h:808:2: warning: this statement may fall through [-Wimplicit-fallthrough=]
    arch/arm64/include/asm/sysreg.h:808:2: warning: this statement may fall through [-Wimplicit-fallthrough=]
    arch/arm64/include/asm/sysreg.h:808:2: warning: this statement may fall through [-Wimplicit-fallthrough=]
    arch/arm64/include/asm/kvm_hyp.h:31:3: warning: this statement may fall through [-Wimplicit-fallthrough=]
    arch/arm64/include/asm/sysreg.h:808:2: warning: this statement may fall through [-Wimplicit-fallthrough=]
    arch/arm64/include/asm/sysreg.h:808:2: warning: this statement may fall through [-Wimplicit-fallthrough=]
    arch/arm64/include/asm/sysreg.h:808:2: warning: this statement may fall through [-Wimplicit-fallthrough=]
    drivers/iommu/arm-smmu-v3.c:1189:7: warning: this statement may fall through [-Wimplicit-fallthrough=]
    drivers/of/platform.c:650:18: warning: ?: using integer constants in boolean context [-Wint-in-bool-context]
    drivers/gpu/drm/sun4i/sun4i_tcon.c:318:7: warning: this statement may fall through [-Wimplicit-fallthrough=]

--------------------------------------------------------------------------------
dove_defconfig (arm, gcc-8) — PASS, 0 errors, 0 warnings, 0 section mismatches

--------------------------------------------------------------------------------
e55_defconfig (mips, gcc-8) — PASS, 0 errors, 2 warnings, 0 section mismatches

Warnings:
    <stdin>:1511:2: warning: #warning syscall clone3 not implemented [-Wcpp]
    <stdin>:1511:2: warning: #warning syscall clone3 not implemented [-Wcpp]

--------------------------------------------------------------------------------
ebsa110_defconfig (arm, gcc-8) — PASS, 0 errors, 0 warnings, 0 section mismatches

--------------------------------------------------------------------------------
efm32_defconfig (arm, gcc-8) — PASS, 0 errors, 1 warning, 0 section mismatches

Warnings:
    drivers/of/platform.c:650:18: warning: ?: using integer constants in boolean context [-Wint-in-bool-context]

--------------------------------------------------------------------------------
em_x270_defconfig (arm, gcc-8) — PASS, 0 errors, 0 warnings, 0 section mismatches

--------------------------------------------------------------------------------
ep93xx_defconfig (arm, gcc-8) — PASS, 0 errors, 1 warning, 0 section mismatches

Warnings:
    arch/arm/mach-ep93xx/crunch.c:46:3: warning: this statement may fall through [-Wimplicit-fallthrough=]

--------------------------------------------------------------------------------
eseries_pxa_defconfig (arm, gcc-8) — PASS, 0 errors, 0 warnings, 0 section mismatches

--------------------------------------------------------------------------------
exynos_defconfig (arm, gcc-8) — PASS, 0 errors, 1 warning, 0 section mismatches

Warnings:
    drivers/of/platform.c:650:18: warning: ?: using integer constants in boolean context [-Wint-in-bool-context]

--------------------------------------------------------------------------------
ezx_defconfig (arm, gcc-8) — PASS, 0 errors, 0 warnings, 0 section mismatches

--------------------------------------------------------------------------------
footbridge_defconfig (arm, gcc-8) — PASS, 0 errors, 1 warning, 0 section mismatches

Warnings:
    drivers/watchdog/wdt285.c:170:3: warning: this statement may fall through [-Wimplicit-fallthrough=]

--------------------------------------------------------------------------------
fuloong2e_defconfig (mips, gcc-8) — PASS, 0 errors, 6 warnings, 0 section mismatches

Warnings:
    <stdin>:1511:2: warning: #warning syscall clone3 not implemented [-Wcpp]
    <stdin>:1511:2: warning: #warning syscall clone3 not implemented [-Wcpp]
    <stdin>:1511:2: warning: #warning syscall clone3 not implemented [-Wcpp]
    <stdin>:1511:2: warning: #warning syscall clone3 not implemented [-Wcpp]
    <stdin>:1511:2: warning: #warning syscall clone3 not implemented [-Wcpp]
    <stdin>:1511:2: warning: #warning syscall clone3 not implemented [-Wcpp]

--------------------------------------------------------------------------------
gcw0_defconfig (mips, gcc-8) — PASS, 0 errors, 2 warnings, 0 section mismatches

Warnings:
    <stdin>:1511:2: warning: #warning syscall clone3 not implemented [-Wcpp]
    drivers/of/platform.c:650:18: warning: ?: using integer constants in boolean context [-Wint-in-bool-context]

--------------------------------------------------------------------------------
gemini_defconfig (arm, gcc-8) — PASS, 0 errors, 1 warning, 0 section mismatches

Warnings:
    drivers/of/platform.c:650:18: warning: ?: using integer constants in boolean context [-Wint-in-bool-context]

--------------------------------------------------------------------------------
gpr_defconfig (mips, gcc-8) — PASS, 0 errors, 3 warnings, 0 section mismatches

Warnings:
    <stdin>:1511:2: warning: #warning syscall clone3 not implemented [-Wcpp]
    include/linux/printk.h:309:2: warning: this statement may fall through [-Wimplicit-fallthrough=]
    <stdin>:1511:2: warning: #warning syscall clone3 not implemented [-Wcpp]

--------------------------------------------------------------------------------
h3600_defconfig (arm, gcc-8) — PASS, 0 errors, 2 warnings, 0 section mismatches

Warnings:
    drivers/mtd/maps/sa1100-flash.c:82:3: warning: this statement may fall through [-Wimplicit-fallthrough=]
    printk(KERN_WARNING "SA1100 flash: unknown base address "

--------------------------------------------------------------------------------
h5000_defconfig (arm, gcc-8) — PASS, 0 errors, 0 warnings, 0 section mismatches

--------------------------------------------------------------------------------
hackkit_defconfig (arm, gcc-8) — PASS, 0 errors, 0 warnings, 0 section mismatches

--------------------------------------------------------------------------------
haps_hs_defconfig (arc, gcc-8) — PASS, 0 errors, 4 warnings, 0 section mismatches

Warnings:
    <stdin>:1511:2: warning: #warning syscall clone3 not implemented [-Wcpp]
    include/linux/compiler.h:328:5: warning: this statement may fall through [-Wimplicit-fallthrough=]
    drivers/of/platform.c:650:18: warning: ?: using integer constants in boolean context [-Wint-in-bool-context]
    <stdin>:1511:2: warning: #warning syscall clone3 not implemented [-Wcpp]

--------------------------------------------------------------------------------
haps_hs_smp_defconfig (arc, gcc-8) — PASS, 0 errors, 4 warnings, 0 section mismatches

Warnings:
    <stdin>:1511:2: warning: #warning syscall clone3 not implemented [-Wcpp]
    include/linux/compiler.h:328:5: warning: this statement may fall through [-Wimplicit-fallthrough=]
    drivers/of/platform.c:650:18: warning: ?: using integer constants in boolean context [-Wint-in-bool-context]
    <stdin>:1511:2: warning: #warning syscall clone3 not implemented [-Wcpp]

--------------------------------------------------------------------------------
hisi_defconfig (arm, gcc-8) — PASS, 0 errors, 1 warning, 0 section mismatches

Warnings:
    drivers/of/platform.c:650:18: warning: ?: using integer constants in boolean context [-Wint-in-bool-context]

--------------------------------------------------------------------------------
hsdk_defconfig (arc, gcc-8) — PASS, 0 errors, 4 warnings, 0 section mismatches

Warnings:
    <stdin>:1511:2: warning: #warning syscall clone3 not implemented [-Wcpp]
    include/linux/compiler.h:328:5: warning: this statement may fall through [-Wimplicit-fallthrough=]
    drivers/of/platform.c:650:18: warning: ?: using integer constants in boolean context [-Wint-in-bool-context]
    <stdin>:1511:2: warning: #warning syscall clone3 not implemented [-Wcpp]

--------------------------------------------------------------------------------
i386_defconfig (i386, gcc-8) — PASS, 0 errors, 2 warnings, 0 section mismatches

Warnings:
    arch/x86/kernel/apic/probe_32.c:146:7: warning: this statement may fall through [-Wimplicit-fallthrough=]
    include/linux/build_bug.h:49: warning: "BUILD_BUG_ON" redefined

--------------------------------------------------------------------------------
i386_defconfig+kselftest (i386, gcc-8) — PASS, 0 errors, 10 warnings, 0 section mismatches

Warnings:
    arch/x86/kernel/apic/probe_32.c:146:7: warning: this statement may fall through [-Wimplicit-fallthrough=]
    include/linux/kern_levels.h:5:18: warning: format '%lu' expects argument of type 'long unsigned int', but argument 8 has type 'unsigned int' [-Wformat=]
    fs/btrfs/tree-checker.c:1003:47: warning: format '%lu' expects argument of type 'long unsigned int', but argument 5 has type 'unsigned int' [-Wformat=]
    fs/btrfs/tree-checker.c:1051:8: warning: cast from pointer to integer of different size [-Wpointer-to-int-cast]
    fs/btrfs/tree-checker.c:1057:10: warning: cast to pointer from integer of different size [-Wint-to-pointer-cast]
    fs/btrfs/tree-checker.c:1065:9: warning: cast from pointer to integer of different size [-Wpointer-to-int-cast]
    fs/btrfs/tree-checker.c:1083:10: warning: cast to pointer from integer of different size [-Wint-to-pointer-cast]
    fs/btrfs/tree-checker.c:1200:50: warning: format '%lu' expects argument of type 'long unsigned int', but argument 5 has type 'unsigned int' [-Wformat=]
    fs/btrfs/tree-checker.c:1216:10: warning: cast to pointer from integer of different size [-Wint-to-pointer-cast]
    include/linux/build_bug.h:49: warning: "BUILD_BUG_ON" redefined

--------------------------------------------------------------------------------
imote2_defconfig (arm, gcc-8) — PASS, 0 errors, 0 warnings, 0 section mismatches

--------------------------------------------------------------------------------
imx_v4_v5_defconfig (arm, gcc-8) — PASS, 0 errors, 1 warning, 0 section mismatches

Warnings:
    drivers/of/platform.c:650:18: warning: ?: using integer constants in boolean context [-Wint-in-bool-context]

--------------------------------------------------------------------------------
imx_v6_v7_defconfig (arm, gcc-8) — PASS, 0 errors, 1 warning, 0 section mismatches

Warnings:
    drivers/of/platform.c:650:18: warning: ?: using integer constants in boolean context [-Wint-in-bool-context]

--------------------------------------------------------------------------------
integrator_defconfig (arm, gcc-8) — PASS, 0 errors, 1 warning, 0 section mismatches

Warnings:
    drivers/of/platform.c:650:18: warning: ?: using integer constants in boolean context [-Wint-in-bool-context]

--------------------------------------------------------------------------------
iop13xx_defconfig (arm, gcc-8) — PASS, 0 errors, 0 warnings, 0 section mismatches

--------------------------------------------------------------------------------
iop32x_defconfig (arm, gcc-8) — PASS, 0 errors, 0 warnings, 0 section mismatches

--------------------------------------------------------------------------------
iop33x_defconfig (arm, gcc-8) — PASS, 0 errors, 0 warnings, 0 section mismatches

--------------------------------------------------------------------------------
ip22_defconfig (mips, gcc-8) — PASS, 0 errors, 2 warnings, 0 section mismatches

Warnings:
    <stdin>:1511:2: warning: #warning syscall clone3 not implemented [-Wcpp]
    <stdin>:1511:2: warning: #warning syscall clone3 not implemented [-Wcpp]

--------------------------------------------------------------------------------
ip27_defconfig (mips, gcc-8) — PASS, 0 errors, 7 warnings, 0 section mismatches

Warnings:
    <stdin>:1511:2: warning: #warning syscall clone3 not implemented [-Wcpp]
    <stdin>:1511:2: warning: #warning syscall clone3 not implemented [-Wcpp]
    <stdin>:1511:2: warning: #warning syscall clone3 not implemented [-Wcpp]
    include/linux/printk.h:309:2: warning: this statement may fall through [-Wimplicit-fallthrough=]
    <stdin>:1511:2: warning: #warning syscall clone3 not implemented [-Wcpp]
    <stdin>:1511:2: warning: #warning syscall clone3 not implemented [-Wcpp]
    <stdin>:1511:2: warning: #warning syscall clone3 not implemented [-Wcpp]

--------------------------------------------------------------------------------
ip28_defconfig (mips, gcc-8) — PASS, 0 errors, 6 warnings, 0 section mismatches

Warnings:
    <stdin>:1511:2: warning: #warning syscall clone3 not implemented [-Wcpp]
    <stdin>:1511:2: warning: #warning syscall clone3 not implemented [-Wcpp]
    <stdin>:1511:2: warning: #warning syscall clone3 not implemented [-Wcpp]
    <stdin>:1511:2: warning: #warning syscall clone3 not implemented [-Wcpp]
    <stdin>:1511:2: warning: #warning syscall clone3 not implemented [-Wcpp]
    <stdin>:1511:2: warning: #warning syscall clone3 not implemented [-Wcpp]

--------------------------------------------------------------------------------
ip32_defconfig (mips, gcc-8) — PASS, 0 errors, 7 warnings, 0 section mismatches

Warnings:
    <stdin>:1511:2: warning: #warning syscall clone3 not implemented [-Wcpp]
    <stdin>:1511:2: warning: #warning syscall clone3 not implemented [-Wcpp]
    <stdin>:1511:2: warning: #warning syscall clone3 not implemented [-Wcpp]
    include/linux/printk.h:309:2: warning: this statement may fall through [-Wimplicit-fallthrough=]
    <stdin>:1511:2: warning: #warning syscall clone3 not implemented [-Wcpp]
    <stdin>:1511:2: warning: #warning syscall clone3 not implemented [-Wcpp]
    <stdin>:1511:2: warning: #warning syscall clone3 not implemented [-Wcpp]

--------------------------------------------------------------------------------
ixp4xx_defconfig (arm, gcc-8) — PASS, 0 errors, 1 warning, 0 section mismatches

Warnings:
    drivers/of/platform.c:650:18: warning: ?: using integer constants in boolean context [-Wint-in-bool-context]

--------------------------------------------------------------------------------
jazz_defconfig (mips, gcc-8) — PASS, 0 errors, 2 warnings, 0 section mismatches

Warnings:
    <stdin>:1511:2: warning: #warning syscall clone3 not implemented [-Wcpp]
    <stdin>:1511:2: warning: #warning syscall clone3 not implemented [-Wcpp]

--------------------------------------------------------------------------------
jmr3927_defconfig (mips, gcc-8) — PASS, 0 errors, 1 warning, 0 section mismatches

Warnings:
    <stdin>:1511:2: warning: #warning syscall clone3 not implemented [-Wcpp]

--------------------------------------------------------------------------------
jornada720_defconfig (arm, gcc-8) — PASS, 0 errors, 0 warnings, 0 section mismatches

--------------------------------------------------------------------------------
keystone_defconfig (arm, gcc-8) — PASS, 0 errors, 1 warning, 0 section mismatches

Warnings:
    drivers/of/platform.c:650:18: warning: ?: using integer constants in boolean context [-Wint-in-bool-context]

--------------------------------------------------------------------------------
ks8695_defconfig (arm, gcc-8) — PASS, 0 errors, 0 warnings, 0 section mismatches

--------------------------------------------------------------------------------
lart_defconfig (arm, gcc-8) — PASS, 0 errors, 0 warnings, 0 section mismatches

--------------------------------------------------------------------------------
lasat_defconfig (mips, gcc-8) — PASS, 0 errors, 1 warning, 0 section mismatches

Warnings:
    <stdin>:1511:2: warning: #warning syscall clone3 not implemented [-Wcpp]

--------------------------------------------------------------------------------
lemote2f_defconfig (mips, gcc-8) — PASS, 0 errors, 6 warnings, 0 section mismatches

Warnings:
    <stdin>:1511:2: warning: #warning syscall clone3 not implemented [-Wcpp]
    <stdin>:1511:2: warning: #warning syscall clone3 not implemented [-Wcpp]
    <stdin>:1511:2: warning: #warning syscall clone3 not implemented [-Wcpp]
    <stdin>:1511:2: warning: #warning syscall clone3 not implemented [-Wcpp]
    <stdin>:1511:2: warning: #warning syscall clone3 not implemented [-Wcpp]
    <stdin>:1511:2: warning: #warning syscall clone3 not implemented [-Wcpp]

--------------------------------------------------------------------------------
loongson1b_defconfig (mips, gcc-8) — PASS, 0 errors, 2 warnings, 0 section mismatches

Warnings:
    <stdin>:1511:2: warning: #warning syscall clone3 not implemented [-Wcpp]
    <stdin>:1511:2: warning: #warning syscall clone3 not implemented [-Wcpp]

--------------------------------------------------------------------------------
loongson1c_defconfig (mips, gcc-8) — PASS, 0 errors, 2 warnings, 0 section mismatches

Warnings:
    <stdin>:1511:2: warning: #warning syscall clone3 not implemented [-Wcpp]
    <stdin>:1511:2: warning: #warning syscall clone3 not implemented [-Wcpp]

--------------------------------------------------------------------------------
loongson3_defconfig (mips, gcc-8) — PASS, 0 errors, 6 warnings, 0 section mismatches

Warnings:
    <stdin>:1511:2: warning: #warning syscall clone3 not implemented [-Wcpp]
    <stdin>:1511:2: warning: #warning syscall clone3 not implemented [-Wcpp]
    <stdin>:1511:2: warning: #warning syscall clone3 not implemented [-Wcpp]
    <stdin>:1511:2: warning: #warning syscall clone3 not implemented [-Wcpp]
    <stdin>:1511:2: warning: #warning syscall clone3 not implemented [-Wcpp]
    <stdin>:1511:2: warning: #warning syscall clone3 not implemented [-Wcpp]

--------------------------------------------------------------------------------
lpc18xx_defconfig (arm, gcc-8) — PASS, 0 errors, 1 warning, 0 section mismatches

Warnings:
    drivers/of/platform.c:650:18: warning: ?: using integer constants in boolean context [-Wint-in-bool-context]

--------------------------------------------------------------------------------
lpc32xx_defconfig (arm, gcc-8) — PASS, 0 errors, 2 warnings, 0 section mismatches

Warnings:
    drivers/of/platform.c:650:18: warning: ?: using integer constants in boolean context [-Wint-in-bool-context]
    drivers/usb/gadget/udc/lpc32xx_udc.c:2231:3: warning: this statement may fall through [-Wimplicit-fallthrough=]

--------------------------------------------------------------------------------
lpd270_defconfig (arm, gcc-8) — PASS, 0 errors, 0 warnings, 0 section mismatches

--------------------------------------------------------------------------------
lubbock_defconfig (arm, gcc-8) — PASS, 0 errors, 0 warnings, 0 section mismatches

--------------------------------------------------------------------------------
magician_defconfig (arm, gcc-8) — PASS, 0 errors, 0 warnings, 0 section mismatches

--------------------------------------------------------------------------------
mainstone_defconfig (arm, gcc-8) — PASS, 0 errors, 0 warnings, 0 section mismatches

--------------------------------------------------------------------------------
malta_defconfig (mips, gcc-8) — PASS, 0 errors, 3 warnings, 0 section mismatches

Warnings:
    <stdin>:1511:2: warning: #warning syscall clone3 not implemented [-Wcpp]
    drivers/of/platform.c:650:18: warning: ?: using integer constants in boolean context [-Wint-in-bool-context]
    <stdin>:1511:2: warning: #warning syscall clone3 not implemented [-Wcpp]

--------------------------------------------------------------------------------
malta_kvm_defconfig (mips, gcc-8) — PASS, 0 errors, 3 warnings, 0 section mismatches

Warnings:
    <stdin>:1511:2: warning: #warning syscall clone3 not implemented [-Wcpp]
    drivers/of/platform.c:650:18: warning: ?: using integer constants in boolean context [-Wint-in-bool-context]
    <stdin>:1511:2: warning: #warning syscall clone3 not implemented [-Wcpp]

--------------------------------------------------------------------------------
malta_kvm_guest_defconfig (mips, gcc-8) — PASS, 0 errors, 3 warnings, 0 section mismatches

Warnings:
    <stdin>:1511:2: warning: #warning syscall clone3 not implemented [-Wcpp]
    drivers/of/platform.c:650:18: warning: ?: using integer constants in boolean context [-Wint-in-bool-context]
    <stdin>:1511:2: warning: #warning syscall clone3 not implemented [-Wcpp]

--------------------------------------------------------------------------------
malta_qemu_32r6_defconfig (mips, gcc-8) — PASS, 0 errors, 4 warnings, 0 section mismatches

Warnings:
    <stdin>:1511:2: warning: #warning syscall clone3 not implemented [-Wcpp]
    drivers/of/platform.c:650:18: warning: ?: using integer constants in boolean context [-Wint-in-bool-context]
    {standard input}:134: Warning: macro instruction expanded into multiple instructions
    <stdin>:1511:2: warning: #warning syscall clone3 not implemented [-Wcpp]

--------------------------------------------------------------------------------
maltaaprp_defconfig (mips, gcc-8) — PASS, 0 errors, 3 warnings, 0 section mismatches

Warnings:
    <stdin>:1511:2: warning: #warning syscall clone3 not implemented [-Wcpp]
    drivers/of/platform.c:650:18: warning: ?: using integer constants in boolean context [-Wint-in-bool-context]
    <stdin>:1511:2: warning: #warning syscall clone3 not implemented [-Wcpp]

--------------------------------------------------------------------------------
maltasmvp_defconfig (mips, gcc-8) — PASS, 0 errors, 3 warnings, 0 section mismatches

Warnings:
    <stdin>:1511:2: warning: #warning syscall clone3 not implemented [-Wcpp]
    drivers/of/platform.c:650:18: warning: ?: using integer constants in boolean context [-Wint-in-bool-context]
    <stdin>:1511:2: warning: #warning syscall clone3 not implemented [-Wcpp]

--------------------------------------------------------------------------------
maltasmvp_eva_defconfig (mips, gcc-8) — PASS, 0 errors, 3 warnings, 0 section mismatches

Warnings:
    <stdin>:1511:2: warning: #warning syscall clone3 not implemented [-Wcpp]
    drivers/of/platform.c:650:18: warning: ?: using integer constants in boolean context [-Wint-in-bool-context]
    <stdin>:1511:2: warning: #warning syscall clone3 not implemented [-Wcpp]

--------------------------------------------------------------------------------
maltaup_defconfig (mips, gcc-8) — PASS, 0 errors, 3 warnings, 0 section mismatches

Warnings:
    <stdin>:1511:2: warning: #warning syscall clone3 not implemented [-Wcpp]
    drivers/of/platform.c:650:18: warning: ?: using integer constants in boolean context [-Wint-in-bool-context]
    <stdin>:1511:2: warning: #warning syscall clone3 not implemented [-Wcpp]

--------------------------------------------------------------------------------
maltaup_xpa_defconfig (mips, gcc-8) — PASS, 0 errors, 3 warnings, 0 section mismatches

Warnings:
    <stdin>:1511:2: warning: #warning syscall clone3 not implemented [-Wcpp]
    drivers/of/platform.c:650:18: warning: ?: using integer constants in boolean context [-Wint-in-bool-context]
    <stdin>:1511:2: warning: #warning syscall clone3 not implemented [-Wcpp]

--------------------------------------------------------------------------------
markeins_defconfig (mips, gcc-8) — PASS, 0 errors, 3 warnings, 0 section mismatches

Warnings:
    <stdin>:1511:2: warning: #warning syscall clone3 not implemented [-Wcpp]
    include/linux/printk.h:309:2: warning: this statement may fall through [-Wimplicit-fallthrough=]
    <stdin>:1511:2: warning: #warning syscall clone3 not implemented [-Wcpp]

--------------------------------------------------------------------------------
milbeaut_m10v_defconfig (arm, gcc-8) — PASS, 0 errors, 1 warning, 0 section mismatches

Warnings:
    drivers/of/platform.c:650:18: warning: ?: using integer constants in boolean context [-Wint-in-bool-context]

--------------------------------------------------------------------------------
mini2440_defconfig (arm, gcc-8) — PASS, 0 errors, 3 warnings, 0 section mismatches

Warnings:
    drivers/of/platform.c:650:18: warning: ?: using integer constants in boolean context [-Wint-in-bool-context]
    drivers/usb/gadget/udc/s3c2410_udc.c:314:7: warning: this statement may fall through [-Wimplicit-fallthrough=]
    drivers/usb/gadget/udc/s3c2410_udc.c:418:7: warning: this statement may fall through [-Wimplicit-fallthrough=]

--------------------------------------------------------------------------------
mips_paravirt_defconfig (mips, gcc-8) — PASS, 0 errors, 6 warnings, 0 section mismatches

Warnings:
    <stdin>:1511:2: warning: #warning syscall clone3 not implemented [-Wcpp]
    <stdin>:1511:2: warning: #warning syscall clone3 not implemented [-Wcpp]
    <stdin>:1511:2: warning: #warning syscall clone3 not implemented [-Wcpp]
    <stdin>:1511:2: warning: #warning syscall clone3 not implemented [-Wcpp]
    <stdin>:1511:2: warning: #warning syscall clone3 not implemented [-Wcpp]
    <stdin>:1511:2: warning: #warning syscall clone3 not implemented [-Wcpp]

--------------------------------------------------------------------------------
mmp2_defconfig (arm, gcc-8) — PASS, 0 errors, 1 warning, 0 section mismatches

Warnings:
    drivers/of/platform.c:650:18: warning: ?: using integer constants in boolean context [-Wint-in-bool-context]

--------------------------------------------------------------------------------
moxart_defconfig (arm, gcc-8) — PASS, 0 errors, 1 warning, 0 section mismatches

Warnings:
    drivers/of/platform.c:650:18: warning: ?: using integer constants in boolean context [-Wint-in-bool-context]

--------------------------------------------------------------------------------
mpc30x_defconfig (mips, gcc-8) — PASS, 0 errors, 2 warnings, 0 section mismatches

Warnings:
    <stdin>:1511:2: warning: #warning syscall clone3 not implemented [-Wcpp]
    <stdin>:1511:2: warning: #warning syscall clone3 not implemented [-Wcpp]

--------------------------------------------------------------------------------
mps2_defconfig (arm, gcc-8) — PASS, 0 errors, 1 warning, 0 section mismatches

Warnings:
    drivers/of/platform.c:650:18: warning: ?: using integer constants in boolean context [-Wint-in-bool-context]

--------------------------------------------------------------------------------
msp71xx_defconfig (mips, gcc-8) — PASS, 0 errors, 2 warnings, 0 section mismatches

Warnings:
    <stdin>:1511:2: warning: #warning syscall clone3 not implemented [-Wcpp]
    <stdin>:1511:2: warning: #warning syscall clone3 not implemented [-Wcpp]

--------------------------------------------------------------------------------
mtx1_defconfig (mips, gcc-8) — PASS, 0 errors, 3 warnings, 0 section mismatches

Warnings:
    <stdin>:1511:2: warning: #warning syscall clone3 not implemented [-Wcpp]
    include/linux/printk.h:309:2: warning: this statement may fall through [-Wimplicit-fallthrough=]
    <stdin>:1511:2: warning: #warning syscall clone3 not implemented [-Wcpp]

--------------------------------------------------------------------------------
multi_v4t_defconfig (arm, gcc-8) — PASS, 0 errors, 1 warning, 0 section mismatches

Warnings:
    drivers/of/platform.c:650:18: warning: ?: using integer constants in boolean context [-Wint-in-bool-context]

--------------------------------------------------------------------------------
multi_v5_defconfig (arm, gcc-8) — PASS, 0 errors, 2 warnings, 0 section mismatches

Warnings:
    drivers/of/platform.c:650:18: warning: ?: using integer constants in boolean context [-Wint-in-bool-context]
    drivers/usb/gadget/udc/atmel_usba_udc.c:329:13: warning: this statement may fall through [-Wimplicit-fallthrough=]

--------------------------------------------------------------------------------
multi_v7_defconfig (arm, gcc-8) — PASS, 0 errors, 5 warnings, 0 section mismatches

Warnings:
    drivers/of/platform.c:650:18: warning: ?: using integer constants in boolean context [-Wint-in-bool-context]
    drivers/video/fbdev/sh_mobile_lcdcfb.c:2086:22: warning: this statement may fall through [-Wimplicit-fallthrough=]
    drivers/video/fbdev/sh_mobile_lcdcfb.c:1596:22: warning: this statement may fall through [-Wimplicit-fallthrough=]
    drivers/gpu/drm/sun4i/sun4i_tcon.c:318:7: warning: this statement may fall through [-Wimplicit-fallthrough=]
    drivers/gpu/drm/sun4i/sun6i_mipi_dsi.c:993:6: warning: this statement may fall through [-Wimplicit-fallthrough=]

--------------------------------------------------------------------------------
multi_v7_defconfig+CONFIG_CPU_BIG_ENDIAN=y (arm, gcc-8) — PASS, 0 errors, 5 warnings, 0 section mismatches

Warnings:
    drivers/of/platform.c:650:18: warning: ?: using integer constants in boolean context [-Wint-in-bool-context]
    drivers/video/fbdev/sh_mobile_lcdcfb.c:2086:22: warning: this statement may fall through [-Wimplicit-fallthrough=]
    drivers/video/fbdev/sh_mobile_lcdcfb.c:1596:22: warning: this statement may fall through [-Wimplicit-fallthrough=]
    drivers/gpu/drm/sun4i/sun4i_tcon.c:318:7: warning: this statement may fall through [-Wimplicit-fallthrough=]
    drivers/gpu/drm/sun4i/sun6i_mipi_dsi.c:993:6: warning: this statement may fall through [-Wimplicit-fallthrough=]

--------------------------------------------------------------------------------
multi_v7_defconfig+CONFIG_EFI=y+CONFIG_ARM_LPAE=y (arm, gcc-8) — PASS, 0 errors, 5 warnings, 0 section mismatches

Warnings:
    drivers/of/platform.c:650:18: warning: ?: using integer constants in boolean context [-Wint-in-bool-context]
    drivers/video/fbdev/sh_mobile_lcdcfb.c:2086:22: warning: this statement may fall through [-Wimplicit-fallthrough=]
    drivers/video/fbdev/sh_mobile_lcdcfb.c:1596:22: warning: this statement may fall through [-Wimplicit-fallthrough=]
    drivers/gpu/drm/sun4i/sun4i_tcon.c:318:7: warning: this statement may fall through [-Wimplicit-fallthrough=]
    drivers/gpu/drm/sun4i/sun6i_mipi_dsi.c:993:6: warning: this statement may fall through [-Wimplicit-fallthrough=]

--------------------------------------------------------------------------------
multi_v7_defconfig+CONFIG_SMP=n (arm, gcc-8) — PASS, 0 errors, 5 warnings, 0 section mismatches

Warnings:
    drivers/of/platform.c:650:18: warning: ?: using integer constants in boolean context [-Wint-in-bool-context]
    drivers/video/fbdev/sh_mobile_lcdcfb.c:2086:22: warning: this statement may fall through [-Wimplicit-fallthrough=]
    drivers/video/fbdev/sh_mobile_lcdcfb.c:1596:22: warning: this statement may fall through [-Wimplicit-fallthrough=]
    drivers/gpu/drm/sun4i/sun4i_tcon.c:318:7: warning: this statement may fall through [-Wimplicit-fallthrough=]
    drivers/gpu/drm/sun4i/sun6i_mipi_dsi.c:993:6: warning: this statement may fall through [-Wimplicit-fallthrough=]

--------------------------------------------------------------------------------
multi_v7_defconfig+kselftest (arm, gcc-8) — PASS, 0 errors, 13 warnings, 0 section mismatches

Warnings:
    drivers/of/platform.c:650:18: warning: ?: using integer constants in boolean context [-Wint-in-bool-context]
    drivers/video/fbdev/sh_mobile_lcdcfb.c:2086:22: warning: this statement may fall through [-Wimplicit-fallthrough=]
    drivers/video/fbdev/sh_mobile_lcdcfb.c:1596:22: warning: this statement may fall through [-Wimplicit-fallthrough=]
    include/linux/kern_levels.h:5:18: warning: format '%lu' expects argument of type 'long unsigned int', but argument 8 has type 'unsigned int' [-Wformat=]
    fs/btrfs/tree-checker.c:1003:47: warning: format '%lu' expects argument of type 'long unsigned int', but argument 5 has type 'unsigned int' [-Wformat=]
    fs/btrfs/tree-checker.c:1051:8: warning: cast from pointer to integer of different size [-Wpointer-to-int-cast]
    fs/btrfs/tree-checker.c:1057:10: warning: cast to pointer from integer of different size [-Wint-to-pointer-cast]
    fs/btrfs/tree-checker.c:1065:9: warning: cast from pointer to integer of different size [-Wpointer-to-int-cast]
    fs/btrfs/tree-checker.c:1083:10: warning: cast to pointer from integer of different size [-Wint-to-pointer-cast]
    fs/btrfs/tree-checker.c:1200:50: warning: format '%lu' expects argument of type 'long unsigned int', but argument 5 has type 'unsigned int' [-Wformat=]
    fs/btrfs/tree-checker.c:1216:10: warning: cast to pointer from integer of different size [-Wint-to-pointer-cast]
    drivers/gpu/drm/sun4i/sun4i_tcon.c:318:7: warning: this statement may fall through [-Wimplicit-fallthrough=]
    drivers/gpu/drm/sun4i/sun6i_mipi_dsi.c:993:6: warning: this statement may fall through [-Wimplicit-fallthrough=]

--------------------------------------------------------------------------------
mv78xx0_defconfig (arm, gcc-8) — PASS, 0 errors, 1 warning, 0 section mismatches

Warnings:
    drivers/of/platform.c:650:18: warning: ?: using integer constants in boolean context [-Wint-in-bool-context]

--------------------------------------------------------------------------------
mvebu_v5_defconfig (arm, gcc-8) — PASS, 0 errors, 1 warning, 0 section mismatches

Warnings:
    drivers/of/platform.c:650:18: warning: ?: using integer constants in boolean context [-Wint-in-bool-context]

--------------------------------------------------------------------------------
mvebu_v7_defconfig (arm, gcc-8) — PASS, 0 errors, 1 warning, 0 section mismatches

Warnings:
    drivers/of/platform.c:650:18: warning: ?: using integer constants in boolean context [-Wint-in-bool-context]

--------------------------------------------------------------------------------
mxs_defconfig (arm, gcc-8) — PASS, 0 errors, 1 warning, 0 section mismatches

Warnings:
    drivers/of/platform.c:650:18: warning: ?: using integer constants in boolean context [-Wint-in-bool-context]

--------------------------------------------------------------------------------
neponset_defconfig (arm, gcc-8) — PASS, 0 errors, 2 warnings, 0 section mismatches

Warnings:
    drivers/mtd/maps/sa1100-flash.c:82:3: warning: this statement may fall through [-Wimplicit-fallthrough=]
    printk(KERN_WARNING "SA1100 flash: unknown base address "

--------------------------------------------------------------------------------
netwinder_defconfig (arm, gcc-8) — PASS, 0 errors, 0 warnings, 0 section mismatches

--------------------------------------------------------------------------------
nhk8815_defconfig (arm, gcc-8) — PASS, 0 errors, 1 warning, 0 section mismatches

Warnings:
    drivers/of/platform.c:650:18: warning: ?: using integer constants in boolean context [-Wint-in-bool-context]

--------------------------------------------------------------------------------
nlm_xlp_defconfig (mips, gcc-8) — PASS, 0 errors, 8 warnings, 0 section mismatches

Warnings:
    <stdin>:1511:2: warning: #warning syscall clone3 not implemented [-Wcpp]
    <stdin>:1511:2: warning: #warning syscall clone3 not implemented [-Wcpp]
    <stdin>:1511:2: warning: #warning syscall clone3 not implemented [-Wcpp]
    drivers/of/platform.c:650:18: warning: ?: using integer constants in boolean context [-Wint-in-bool-context]
    include/linux/printk.h:309:2: warning: this statement may fall through [-Wimplicit-fallthrough=]
    <stdin>:1511:2: warning: #warning syscall clone3 not implemented [-Wcpp]
    <stdin>:1511:2: warning: #warning syscall clone3 not implemented [-Wcpp]
    <stdin>:1511:2: warning: #warning syscall clone3 not implemented [-Wcpp]

--------------------------------------------------------------------------------
nlm_xlr_defconfig (mips, gcc-8) — PASS, 0 errors, 11 warnings, 0 section mismatches

Warnings:
    <stdin>:1511:2: warning: #warning syscall clone3 not implemented [-Wcpp]
    include/linux/kern_levels.h:5:18: warning: format '%lu' expects argument of type 'long unsigned int', but argument 8 has type 'unsigned int' [-Wformat=]
    fs/btrfs/tree-checker.c:1003:47: warning: format '%lu' expects argument of type 'long unsigned int', but argument 5 has type 'unsigned int' [-Wformat=]
    fs/btrfs/tree-checker.c:1051:8: warning: cast from pointer to integer of different size [-Wpointer-to-int-cast]
    fs/btrfs/tree-checker.c:1057:10: warning: cast to pointer from integer of different size [-Wint-to-pointer-cast]
    fs/btrfs/tree-checker.c:1065:9: warning: cast from pointer to integer of different size [-Wpointer-to-int-cast]
    fs/btrfs/tree-checker.c:1083:10: warning: cast to pointer from integer of different size [-Wint-to-pointer-cast]
    fs/btrfs/tree-checker.c:1200:50: warning: format '%lu' expects argument of type 'long unsigned int', but argument 5 has type 'unsigned int' [-Wformat=]
    fs/btrfs/tree-checker.c:1216:10: warning: cast to pointer from integer of different size [-Wint-to-pointer-cast]
    include/linux/printk.h:309:2: warning: this statement may fall through [-Wimplicit-fallthrough=]
    <stdin>:1511:2: warning: #warning syscall clone3 not implemented [-Wcpp]

--------------------------------------------------------------------------------
nsim_hs_defconfig (arc, gcc-8) — PASS, 0 errors, 4 warnings, 0 section mismatches

Warnings:
    <stdin>:1511:2: warning: #warning syscall clone3 not implemented [-Wcpp]
    include/linux/compiler.h:328:5: warning: this statement may fall through [-Wimplicit-fallthrough=]
    drivers/of/platform.c:650:18: warning: ?: using integer constants in boolean context [-Wint-in-bool-context]
    <stdin>:1511:2: warning: #warning syscall clone3 not implemented [-Wcpp]

--------------------------------------------------------------------------------
nsim_hs_defconfig+kselftest (arc, gcc-8) — PASS, 0 errors, 12 warnings, 0 section mismatches

Warnings:
    <stdin>:1511:2: warning: #warning syscall clone3 not implemented [-Wcpp]
    include/linux/compiler.h:328:5: warning: this statement may fall through [-Wimplicit-fallthrough=]
    drivers/of/platform.c:650:18: warning: ?: using integer constants in boolean context [-Wint-in-bool-context]
    <stdin>:1511:2: warning: #warning syscall clone3 not implemented [-Wcpp]
    include/linux/kern_levels.h:5:18: warning: format '%lu' expects argument of type 'long unsigned int', but argument 8 has type 'unsigned int' [-Wformat=]
    fs/btrfs/tree-checker.c:1003:47: warning: format '%lu' expects argument of type 'long unsigned int', but argument 5 has type 'unsigned int' [-Wformat=]
    fs/btrfs/tree-checker.c:1051:8: warning: cast from pointer to integer of different size [-Wpointer-to-int-cast]
    fs/btrfs/tree-checker.c:1057:10: warning: cast to pointer from integer of different size [-Wint-to-pointer-cast]
    fs/btrfs/tree-checker.c:1065:9: warning: cast from pointer to integer of different size [-Wpointer-to-int-cast]
    fs/btrfs/tree-checker.c:1083:10: warning: cast to pointer from integer of different size [-Wint-to-pointer-cast]
    fs/btrfs/tree-checker.c:1200:50: warning: format '%lu' expects argument of type 'long unsigned int', but argument 5 has type 'unsigned int' [-Wformat=]
    fs/btrfs/tree-checker.c:1216:10: warning: cast to pointer from integer of different size [-Wint-to-pointer-cast]

--------------------------------------------------------------------------------
nsim_hs_smp_defconfig (arc, gcc-8) — PASS, 0 errors, 4 warnings, 0 section mismatches

Warnings:
    <stdin>:1511:2: warning: #warning syscall clone3 not implemented [-Wcpp]
    include/linux/compiler.h:328:5: warning: this statement may fall through [-Wimplicit-fallthrough=]
    drivers/of/platform.c:650:18: warning: ?: using integer constants in boolean context [-Wint-in-bool-context]
    <stdin>:1511:2: warning: #warning syscall clone3 not implemented [-Wcpp]

--------------------------------------------------------------------------------
nsimosci_hs_defconfig (arc, gcc-8) — PASS, 0 errors, 4 warnings, 0 section mismatches

Warnings:
    <stdin>:1511:2: warning: #warning syscall clone3 not implemented [-Wcpp]
    include/linux/compiler.h:328:5: warning: this statement may fall through [-Wimplicit-fallthrough=]
    drivers/of/platform.c:650:18: warning: ?: using integer constants in boolean context [-Wint-in-bool-context]
    <stdin>:1511:2: warning: #warning syscall clone3 not implemented [-Wcpp]

--------------------------------------------------------------------------------
nsimosci_hs_smp_defconfig (arc, gcc-8) — PASS, 0 errors, 4 warnings, 0 section mismatches

Warnings:
    <stdin>:1511:2: warning: #warning syscall clone3 not implemented [-Wcpp]
    include/linux/compiler.h:328:5: warning: this statement may fall through [-Wimplicit-fallthrough=]
    drivers/of/platform.c:650:18: warning: ?: using integer constants in boolean context [-Wint-in-bool-context]
    <stdin>:1511:2: warning: #warning syscall clone3 not implemented [-Wcpp]

--------------------------------------------------------------------------------
nuc910_defconfig (arm, gcc-8) — PASS, 0 errors, 0 warnings, 0 section mismatches

--------------------------------------------------------------------------------
nuc950_defconfig (arm, gcc-8) — PASS, 0 errors, 0 warnings, 0 section mismatches

--------------------------------------------------------------------------------
nuc960_defconfig (arm, gcc-8) — PASS, 0 errors, 0 warnings, 0 section mismatches

--------------------------------------------------------------------------------
omap1_defconfig (arm, gcc-8) — PASS, 0 errors, 0 warnings, 0 section mismatches

--------------------------------------------------------------------------------
omap2plus_defconfig (arm, gcc-8) — PASS, 0 errors, 1 warning, 0 section mismatches

Warnings:
    drivers/of/platform.c:650:18: warning: ?: using integer constants in boolean context [-Wint-in-bool-context]

--------------------------------------------------------------------------------
omega2p_defconfig (mips, gcc-8) — PASS, 0 errors, 2 warnings, 0 section mismatches

Warnings:
    <stdin>:1511:2: warning: #warning syscall clone3 not implemented [-Wcpp]
    drivers/of/platform.c:650:18: warning: ?: using integer constants in boolean context [-Wint-in-bool-context]

--------------------------------------------------------------------------------
orion5x_defconfig (arm, gcc-8) — PASS, 0 errors, 1 warning, 0 section mismatches

Warnings:
    drivers/of/platform.c:650:18: warning: ?: using integer constants in boolean context [-Wint-in-bool-context]

--------------------------------------------------------------------------------
oxnas_v6_defconfig (arm, gcc-8) — PASS, 0 errors, 1 warning, 0 section mismatches

Warnings:
    drivers/of/platform.c:650:18: warning: ?: using integer constants in boolean context [-Wint-in-bool-context]

--------------------------------------------------------------------------------
palmz72_defconfig (arm, gcc-8) — PASS, 0 errors, 0 warnings, 0 section mismatches

--------------------------------------------------------------------------------
pcm027_defconfig (arm, gcc-8) — PASS, 0 errors, 0 warnings, 0 section mismatches

--------------------------------------------------------------------------------
pic32mzda_defconfig (mips, gcc-8) — PASS, 0 errors, 3 warnings, 0 section mismatches

Warnings:
    <stdin>:1511:2: warning: #warning syscall clone3 not implemented [-Wcpp]
    drivers/of/platform.c:650:18: warning: ?: using integer constants in boolean context [-Wint-in-bool-context]
    <stdin>:1511:2: warning: #warning syscall clone3 not implemented [-Wcpp]

--------------------------------------------------------------------------------
pistachio_defconfig (mips, gcc-8) — PASS, 0 errors, 3 warnings, 0 section mismatches

Warnings:
    <stdin>:1511:2: warning: #warning syscall clone3 not implemented [-Wcpp]
    drivers/of/platform.c:650:18: warning: ?: using integer constants in boolean context [-Wint-in-bool-context]
    <stdin>:1511:2: warning: #warning syscall clone3 not implemented [-Wcpp]

--------------------------------------------------------------------------------
pleb_defconfig (arm, gcc-8) — PASS, 0 errors, 2 warnings, 0 section mismatches

Warnings:
    drivers/mtd/maps/sa1100-flash.c:82:3: warning: this statement may fall through [-Wimplicit-fallthrough=]
    printk(KERN_WARNING "SA1100 flash: unknown base address "

--------------------------------------------------------------------------------
pnx8335_stb225_defconfig (mips, gcc-8) — PASS, 0 errors, 2 warnings, 0 section mismatches

Warnings:
    <stdin>:1511:2: warning: #warning syscall clone3 not implemented [-Wcpp]
    <stdin>:1511:2: warning: #warning syscall clone3 not implemented [-Wcpp]

--------------------------------------------------------------------------------
prima2_defconfig (arm, gcc-8) — PASS, 0 errors, 1 warning, 0 section mismatches

Warnings:
    drivers/of/platform.c:650:18: warning: ?: using integer constants in boolean context [-Wint-in-bool-context]

--------------------------------------------------------------------------------
pxa168_defconfig (arm, gcc-8) — PASS, 0 errors, 1 warning, 0 section mismatches

Warnings:
    drivers/of/platform.c:650:18: warning: ?: using integer constants in boolean context [-Wint-in-bool-context]

--------------------------------------------------------------------------------
pxa255-idp_defconfig (arm, gcc-8) — PASS, 0 errors, 0 warnings, 0 section mismatches

--------------------------------------------------------------------------------
pxa3xx_defconfig (arm, gcc-8) — PASS, 0 errors, 0 warnings, 0 section mismatches

--------------------------------------------------------------------------------
pxa910_defconfig (arm, gcc-8) — PASS, 0 errors, 1 warning, 0 section mismatches

Warnings:
    drivers/of/platform.c:650:18: warning: ?: using integer constants in boolean context [-Wint-in-bool-context]

--------------------------------------------------------------------------------
pxa_defconfig (arm, gcc-8) — PASS, 0 errors, 0 warnings, 0 section mismatches

--------------------------------------------------------------------------------
qcom_defconfig (arm, gcc-8) — PASS, 0 errors, 1 warning, 0 section mismatches

Warnings:
    drivers/of/platform.c:650:18: warning: ?: using integer constants in boolean context [-Wint-in-bool-context]

--------------------------------------------------------------------------------
qi_lb60_defconfig (mips, gcc-8) — PASS, 0 errors, 4 warnings, 0 section mismatches

Warnings:
    <stdin>:1511:2: warning: #warning syscall clone3 not implemented [-Wcpp]
    drivers/of/platform.c:650:18: warning: ?: using integer constants in boolean context [-Wint-in-bool-context]
    drivers/watchdog/jz4740_wdt.c:165:6: warning: unused variable 'ret' [-Wunused-variable]
    <stdin>:1511:2: warning: #warning syscall clone3 not implemented [-Wcpp]

--------------------------------------------------------------------------------
rb532_defconfig (mips, gcc-8) — PASS, 0 errors, 3 warnings, 0 section mismatches

Warnings:
    <stdin>:1511:2: warning: #warning syscall clone3 not implemented [-Wcpp]
    drivers/ata/pata_rb532_cf.c:161:24: warning: unused variable 'info' [-Wunused-variable]
    <stdin>:1511:2: warning: #warning syscall clone3 not implemented [-Wcpp]

--------------------------------------------------------------------------------
rbtx49xx_defconfig (mips, gcc-8) — PASS, 0 errors, 2 warnings, 0 section mismatches

Warnings:
    <stdin>:1511:2: warning: #warning syscall clone3 not implemented [-Wcpp]
    <stdin>:1511:2: warning: #warning syscall clone3 not implemented [-Wcpp]

--------------------------------------------------------------------------------
realview_defconfig (arm, gcc-8) — PASS, 0 errors, 1 warning, 0 section mismatches

Warnings:
    drivers/of/platform.c:650:18: warning: ?: using integer constants in boolean context [-Wint-in-bool-context]

--------------------------------------------------------------------------------
rm200_defconfig (mips, gcc-8) — PASS, 0 errors, 3 warnings, 0 section mismatches

Warnings:
    <stdin>:1511:2: warning: #warning syscall clone3 not implemented [-Wcpp]
    include/linux/printk.h:309:2: warning: this statement may fall through [-Wimplicit-fallthrough=]
    <stdin>:1511:2: warning: #warning syscall clone3 not implemented [-Wcpp]

--------------------------------------------------------------------------------
rpc_defconfig (arm, gcc-8) — PASS, 0 errors, 2 warnings, 0 section mismatches

Warnings:
    arch/arm/mach-rpc/riscpc.c:48:13: warning: this statement may fall through [-Wimplicit-fallthrough=]
    drivers/video/fbdev/acornfb.c:860:9: warning: this statement may fall through [-Wimplicit-fallthrough=]

--------------------------------------------------------------------------------
rt305x_defconfig (mips, gcc-8) — PASS, 0 errors, 3 warnings, 0 section mismatches

Warnings:
    <stdin>:1511:2: warning: #warning syscall clone3 not implemented [-Wcpp]
    drivers/of/platform.c:650:18: warning: ?: using integer constants in boolean context [-Wint-in-bool-context]
    <stdin>:1511:2: warning: #warning syscall clone3 not implemented [-Wcpp]

--------------------------------------------------------------------------------
rv32_defconfig (riscv, gcc-8) — PASS, 0 errors, 7 warnings, 0 section mismatches

Warnings:
    <stdin>:830:2: warning: #warning syscall fstat64 not implemented [-Wcpp]
    <stdin>:1127:2: warning: #warning syscall fstatat64 not implemented [-Wcpp]
    <stdin>:1511:2: warning: #warning syscall clone3 not implemented [-Wcpp]
    drivers/of/platform.c:650:18: warning: ?: using integer constants in boolean context [-Wint-in-bool-context]
    <stdin>:830:2: warning: #warning syscall fstat64 not implemented [-Wcpp]
    <stdin>:1127:2: warning: #warning syscall fstatat64 not implemented [-Wcpp]
    <stdin>:1511:2: warning: #warning syscall clone3 not implemented [-Wcpp]

--------------------------------------------------------------------------------
s3c2410_defconfig (arm, gcc-8) — PASS, 0 errors, 1 warning, 0 section mismatches

Warnings:
    drivers/of/platform.c:650:18: warning: ?: using integer constants in boolean context [-Wint-in-bool-context]

--------------------------------------------------------------------------------
s3c6400_defconfig (arm, gcc-8) — PASS, 0 errors, 1 warning, 0 section mismatches

Warnings:
    drivers/of/platform.c:650:18: warning: ?: using integer constants in boolean context [-Wint-in-bool-context]

--------------------------------------------------------------------------------
s5pv210_defconfig (arm, gcc-8) — PASS, 0 errors, 1 warning, 0 section mismatches

Warnings:
    drivers/of/platform.c:650:18: warning: ?: using integer constants in boolean context [-Wint-in-bool-context]

--------------------------------------------------------------------------------
sama5_defconfig (arm, gcc-8) — PASS, 0 errors, 2 warnings, 0 section mismatches

Warnings:
    drivers/of/platform.c:650:18: warning: ?: using integer constants in boolean context [-Wint-in-bool-context]
    drivers/usb/gadget/udc/atmel_usba_udc.c:329:13: warning: this statement may fall through [-Wimplicit-fallthrough=]

--------------------------------------------------------------------------------
sb1250_swarm_defconfig (mips, gcc-8) — PASS, 0 errors, 4 warnings, 0 section mismatches

Warnings:
    <stdin>:1511:2: warning: #warning syscall clone3 not implemented [-Wcpp]
    <stdin>:1511:2: warning: #warning syscall clone3 not implemented [-Wcpp]
    <stdin>:1511:2: warning: #warning syscall clone3 not implemented [-Wcpp]
    <stdin>:1511:2: warning: #warning syscall clone3 not implemented [-Wcpp]

--------------------------------------------------------------------------------
shannon_defconfig (arm, gcc-8) — PASS, 0 errors, 2 warnings, 0 section mismatches

Warnings:
    drivers/mtd/maps/sa1100-flash.c:82:3: warning: this statement may fall through [-Wimplicit-fallthrough=]
    printk(KERN_WARNING "SA1100 flash: unknown base address "

--------------------------------------------------------------------------------
shmobile_defconfig (arm, gcc-8) — PASS, 0 errors, 3 warnings, 0 section mismatches

Warnings:
    drivers/of/platform.c:650:18: warning: ?: using integer constants in boolean context [-Wint-in-bool-context]
    drivers/video/fbdev/sh_mobile_lcdcfb.c:2086:22: warning: this statement may fall through [-Wimplicit-fallthrough=]
    drivers/video/fbdev/sh_mobile_lcdcfb.c:1596:22: warning: this statement may fall through [-Wimplicit-fallthrough=]

--------------------------------------------------------------------------------
simpad_defconfig (arm, gcc-8) — PASS, 0 errors, 2 warnings, 0 section mismatches

Warnings:
    drivers/mtd/maps/sa1100-flash.c:82:3: warning: this statement may fall through [-Wimplicit-fallthrough=]
    printk(KERN_WARNING "SA1100 flash: unknown base address "

--------------------------------------------------------------------------------
socfpga_defconfig (arm, gcc-8) — PASS, 0 errors, 1 warning, 0 section mismatches

Warnings:
    drivers/of/platform.c:650:18: warning: ?: using integer constants in boolean context [-Wint-in-bool-context]

--------------------------------------------------------------------------------
spear13xx_defconfig (arm, gcc-8) — PASS, 0 errors, 1 warning, 0 section mismatches

Warnings:
    drivers/of/platform.c:650:18: warning: ?: using integer constants in boolean context [-Wint-in-bool-context]

--------------------------------------------------------------------------------
spear3xx_defconfig (arm, gcc-8) — PASS, 0 errors, 1 warning, 0 section mismatches

Warnings:
    drivers/of/platform.c:650:18: warning: ?: using integer constants in boolean context [-Wint-in-bool-context]

--------------------------------------------------------------------------------
spear6xx_defconfig (arm, gcc-8) — PASS, 0 errors, 1 warning, 0 section mismatches

Warnings:
    drivers/of/platform.c:650:18: warning: ?: using integer constants in boolean context [-Wint-in-bool-context]

--------------------------------------------------------------------------------
spitz_defconfig (arm, gcc-8) — PASS, 0 errors, 0 warnings, 0 section mismatches

--------------------------------------------------------------------------------
stm32_defconfig (arm, gcc-8) — PASS, 0 errors, 1 warning, 0 section mismatches

Warnings:
    drivers/of/platform.c:650:18: warning: ?: using integer constants in boolean context [-Wint-in-bool-context]

--------------------------------------------------------------------------------
sunxi_defconfig (arm, gcc-8) — PASS, 0 errors, 3 warnings, 0 section mismatches

Warnings:
    drivers/gpu/drm/sun4i/sun4i_tcon.c:318:7: warning: this statement may fall through [-Wimplicit-fallthrough=]
    drivers/gpu/drm/sun4i/sun6i_mipi_dsi.c:993:6: warning: this statement may fall through [-Wimplicit-fallthrough=]
    drivers/of/platform.c:650:18: warning: ?: using integer constants in boolean context [-Wint-in-bool-context]

--------------------------------------------------------------------------------
tango4_defconfig (arm, gcc-8) — PASS, 0 errors, 1 warning, 0 section mismatches

Warnings:
    drivers/of/platform.c:650:18: warning: ?: using integer constants in boolean context [-Wint-in-bool-context]

--------------------------------------------------------------------------------
tb0219_defconfig (mips, gcc-8) — PASS, 0 errors, 2 warnings, 0 section mismatches

Warnings:
    <stdin>:1511:2: warning: #warning syscall clone3 not implemented [-Wcpp]
    <stdin>:1511:2: warning: #warning syscall clone3 not implemented [-Wcpp]

--------------------------------------------------------------------------------
tb0226_defconfig (mips, gcc-8) — PASS, 0 errors, 3 warnings, 0 section mismatches

Warnings:
    <stdin>:1511:2: warning: #warning syscall clone3 not implemented [-Wcpp]
    include/linux/printk.h:309:2: warning: this statement may fall through [-Wimplicit-fallthrough=]
    <stdin>:1511:2: warning: #warning syscall clone3 not implemented [-Wcpp]

--------------------------------------------------------------------------------
tb0287_defconfig (mips, gcc-8) — PASS, 0 errors, 2 warnings, 0 section mismatches

Warnings:
    <stdin>:1511:2: warning: #warning syscall clone3 not implemented [-Wcpp]
    <stdin>:1511:2: warning: #warning syscall clone3 not implemented [-Wcpp]

--------------------------------------------------------------------------------
tct_hammer_defconfig (arm, gcc-8) — PASS, 0 errors, 3 warnings, 0 section mismatches

Warnings:
    drivers/of/platform.c:650:18: warning: ?: using integer constants in boolean context [-Wint-in-bool-context]
    drivers/usb/gadget/udc/s3c2410_udc.c:314:7: warning: this statement may fall through [-Wimplicit-fallthrough=]
    drivers/usb/gadget/udc/s3c2410_udc.c:418:7: warning: this statement may fall through [-Wimplicit-fallthrough=]

--------------------------------------------------------------------------------
tegra_defconfig (arm, gcc-8) — PASS, 0 errors, 1 warning, 0 section mismatches

Warnings:
    drivers/of/platform.c:650:18: warning: ?: using integer constants in boolean context [-Wint-in-bool-context]

--------------------------------------------------------------------------------
tinyconfig (i386, gcc-8) — PASS, 0 errors, 1 warning, 0 section mismatches

Warnings:
    include/linux/build_bug.h:49: warning: "BUILD_BUG_ON" redefined

--------------------------------------------------------------------------------
tinyconfig (arm64, gcc-8) — PASS, 0 errors, 1 warning, 0 section mismatches

Warnings:
    drivers/of/platform.c:650:18: warning: ?: using integer constants in boolean context [-Wint-in-bool-context]

--------------------------------------------------------------------------------
tinyconfig (x86_64, gcc-8) — PASS, 0 errors, 2 warnings, 0 section mismatches

Warnings:
    .config:1177:warning: override: UNWINDER_GUESS changes choice state
    include/linux/build_bug.h:49: warning: "BUILD_BUG_ON" redefined

--------------------------------------------------------------------------------
tinyconfig (arm, gcc-8) — PASS, 0 errors, 1 warning, 0 section mismatches

Warnings:
    drivers/of/platform.c:650:18: warning: ?: using integer constants in boolean context [-Wint-in-bool-context]

--------------------------------------------------------------------------------
tinyconfig (riscv, gcc-8) — PASS, 0 errors, 1 warning, 0 section mismatches

Warnings:
    drivers/of/platform.c:650:18: warning: ?: using integer constants in boolean context [-Wint-in-bool-context]

--------------------------------------------------------------------------------
tinyconfig (mips, gcc-8) — PASS, 0 errors, 2 warnings, 0 section mismatches

Warnings:
    <stdin>:1511:2: warning: #warning syscall clone3 not implemented [-Wcpp]
    drivers/of/platform.c:650:18: warning: ?: using integer constants in boolean context [-Wint-in-bool-context]

--------------------------------------------------------------------------------
tinyconfig (arm64, clang-8) — PASS, 0 errors, 0 warnings, 0 section mismatches

--------------------------------------------------------------------------------
tinyconfig (arc, gcc-8) — PASS, 0 errors, 2 warnings, 0 section mismatches

Warnings:
    <stdin>:1511:2: warning: #warning syscall clone3 not implemented [-Wcpp]
    drivers/of/platform.c:650:18: warning: ?: using integer constants in boolean context [-Wint-in-bool-context]

--------------------------------------------------------------------------------
trizeps4_defconfig (arm, gcc-8) — PASS, 0 errors, 0 warnings, 0 section mismatches

--------------------------------------------------------------------------------
u300_defconfig (arm, gcc-8) — PASS, 0 errors, 1 warning, 0 section mismatches

Warnings:
    drivers/of/platform.c:650:18: warning: ?: using integer constants in boolean context [-Wint-in-bool-context]

--------------------------------------------------------------------------------
u8500_defconfig (arm, gcc-8) — PASS, 0 errors, 1 warning, 0 section mismatches

Warnings:
    drivers/of/platform.c:650:18: warning: ?: using integer constants in boolean context [-Wint-in-bool-context]

--------------------------------------------------------------------------------
vdk_hs38_defconfig (arc, gcc-8) — PASS, 0 errors, 3 warnings, 0 section mismatches

Warnings:
    <stdin>:1511:2: warning: #warning syscall clone3 not implemented [-Wcpp]
    include/linux/compiler.h:328:5: warning: this statement may fall through [-Wimplicit-fallthrough=]
    drivers/of/platform.c:650:18: warning: ?: using integer constants in boolean context [-Wint-in-bool-context]

--------------------------------------------------------------------------------
vdk_hs38_smp_defconfig (arc, gcc-8) — PASS, 0 errors, 3 warnings, 0 section mismatches

Warnings:
    <stdin>:1511:2: warning: #warning syscall clone3 not implemented [-Wcpp]
    include/linux/compiler.h:328:5: warning: this statement may fall through [-Wimplicit-fallthrough=]
    drivers/of/platform.c:650:18: warning: ?: using integer constants in boolean context [-Wint-in-bool-context]

--------------------------------------------------------------------------------
versatile_defconfig (arm, gcc-8) — PASS, 0 errors, 1 warning, 0 section mismatches

Warnings:
    drivers/of/platform.c:650:18: warning: ?: using integer constants in boolean context [-Wint-in-bool-context]

--------------------------------------------------------------------------------
vexpress_defconfig (arm, gcc-8) — PASS, 0 errors, 1 warning, 0 section mismatches

Warnings:
    drivers/of/platform.c:650:18: warning: ?: using integer constants in boolean context [-Wint-in-bool-context]

--------------------------------------------------------------------------------
vf610m4_defconfig (arm, gcc-8) — PASS, 0 errors, 1 warning, 0 section mismatches

Warnings:
    drivers/of/platform.c:650:18: warning: ?: using integer constants in boolean context [-Wint-in-bool-context]

--------------------------------------------------------------------------------
viper_defconfig (arm, gcc-8) — PASS, 0 errors, 0 warnings, 0 section mismatches

--------------------------------------------------------------------------------
vocore2_defconfig (mips, gcc-8) — PASS, 0 errors, 2 warnings, 0 section mismatches

Warnings:
    <stdin>:1511:2: warning: #warning syscall clone3 not implemented [-Wcpp]
    drivers/of/platform.c:650:18: warning: ?: using integer constants in boolean context [-Wint-in-bool-context]

--------------------------------------------------------------------------------
vt8500_v6_v7_defconfig (arm, gcc-8) — PASS, 0 errors, 1 warning, 0 section mismatches

Warnings:
    drivers/of/platform.c:650:18: warning: ?: using integer constants in boolean context [-Wint-in-bool-context]

--------------------------------------------------------------------------------
workpad_defconfig (mips, gcc-8) — PASS, 0 errors, 2 warnings, 0 section mismatches

Warnings:
    <stdin>:1511:2: warning: #warning syscall clone3 not implemented [-Wcpp]
    <stdin>:1511:2: warning: #warning syscall clone3 not implemented [-Wcpp]

--------------------------------------------------------------------------------
x86_64_defconfig (x86_64, gcc-8) — PASS, 0 errors, 2 warnings, 0 section mismatches

Warnings:
    drivers/gpu/drm/i915/gem/i915_gem_execbuffer.o: warning: objtool: .altinstr_replacement+0x34: redundant UACCESS disable
    include/linux/build_bug.h:49: warning: "BUILD_BUG_ON" redefined

--------------------------------------------------------------------------------
x86_64_defconfig+kselftest (x86_64, gcc-8) — PASS, 0 errors, 2 warnings, 0 section mismatches

Warnings:
    drivers/gpu/drm/i915/gem/i915_gem_execbuffer.o: warning: objtool: .altinstr_replacement+0x36: redundant UACCESS disable
    include/linux/build_bug.h:49: warning: "BUILD_BUG_ON" redefined

--------------------------------------------------------------------------------
xcep_defconfig (arm, gcc-8) — PASS, 0 errors, 0 warnings, 0 section mismatches

--------------------------------------------------------------------------------
xway_defconfig (mips, gcc-8) — PASS, 0 errors, 3 warnings, 0 section mismatches

Warnings:
    <stdin>:1511:2: warning: #warning syscall clone3 not implemented [-Wcpp]
    drivers/of/platform.c:650:18: warning: ?: using integer constants in boolean context [-Wint-in-bool-context]
    <stdin>:1511:2: warning: #warning syscall clone3 not implemented [-Wcpp]

--------------------------------------------------------------------------------
zeus_defconfig (arm, gcc-8) — PASS, 0 errors, 0 warnings, 0 section mismatches

--------------------------------------------------------------------------------
zx_defconfig (arm, gcc-8) — PASS, 0 errors, 1 warning, 0 section mismatches

Warnings:
    drivers/of/platform.c:650:18: warning: ?: using integer constants in boolean context [-Wint-in-bool-context]

---
For more info write to <info@kernelci.org>

^ permalink raw reply	[flat|nested] 2+ messages in thread

* Re: next/master build: 230 builds: 12 failed, 218 passed, 15 errors, 1179 warnings (next-20190807)
  2019-08-07 11:32 next/master build: 230 builds: 12 failed, 218 passed, 15 errors, 1179 warnings (next-20190807) kernelci.org bot
@ 2019-08-08  1:02 ` Stephen Rothwell
  0 siblings, 0 replies; 2+ messages in thread
From: Stephen Rothwell @ 2019-08-08  1:02 UTC (permalink / raw)
  To: kernelci.org bot; +Cc: linux-next

[-- Attachment #1: Type: text/plain, Size: 469 bytes --]

Hi all,

On Wed, 07 Aug 2019 04:32:43 -0700 (PDT) "kernelci.org bot" <bot@kernelci.org> wrote:
>
> Errors summary:
> 
>     5    include/linux/build_bug.h:16:45: error: negative width in bit-field '<anonymous>'
>     5    drivers/phy/rockchip/phy-rockchip-inno-hdmi.c:1046:26: error: anonymous bit-field has negative width (-1)

These should be gone when today's linux-next is released - the patch
has been removed for now.

-- 
Cheers,
Stephen Rothwell

[-- Attachment #2: OpenPGP digital signature --]
[-- Type: application/pgp-signature, Size: 488 bytes --]

^ permalink raw reply	[flat|nested] 2+ messages in thread

end of thread, back to index

Thread overview: 2+ messages (download: mbox.gz / follow: Atom feed)
-- links below jump to the message on this page --
2019-08-07 11:32 next/master build: 230 builds: 12 failed, 218 passed, 15 errors, 1179 warnings (next-20190807) kernelci.org bot
2019-08-08  1:02 ` Stephen Rothwell

Linux-Next Archive on lore.kernel.org

Archives are clonable:
	git clone --mirror https://lore.kernel.org/linux-next/0 linux-next/git/0.git

	# If you have public-inbox 1.1+ installed, you may
	# initialize and index your mirror using the following commands:
	public-inbox-init -V2 linux-next linux-next/ https://lore.kernel.org/linux-next \
		linux-next@vger.kernel.org linux-next@archiver.kernel.org
	public-inbox-index linux-next


Newsgroup available over NNTP:
	nntp://nntp.lore.kernel.org/org.kernel.vger.linux-next


AGPL code for this site: git clone https://public-inbox.org/ public-inbox