Linux-Next Archive on lore.kernel.org
 help / color / Atom feed
* next/master build: 147 builds: 21 failed, 126 passed, 102 errors, 149 warnings (next-20200626)
@ 2020-06-26 14:32 kernelci.org bot
  2020-06-26 16:08 ` Mark Brown
  0 siblings, 1 reply; 2+ messages in thread
From: kernelci.org bot @ 2020-06-26 14:32 UTC (permalink / raw)
  To: linux-next

next/master build: 147 builds: 21 failed, 126 passed, 102 errors, 149 warnings (next-20200626)

Full Build Summary: https://kernelci.org/build/next/branch/master/kernel/next-20200626/

Tree: next
Branch: master
Git Describe: next-20200626
Git Commit: 36e3135df4d426612fc77db26a312c2531108603
Git URL: https://git.kernel.org/pub/scm/linux/kernel/git/next/linux-next.git
Built: 7 unique architectures

Build Failures Detected:

arm64:
    defconfig: (clang-10) FAIL
    defconfig: (clang-9) FAIL
    defconfig: (gcc-8) FAIL
    defconfig+CONFIG_CPU_BIG_ENDIAN=y: (gcc-8) FAIL
    defconfig+CONFIG_RANDOMIZE_BASE=y: (gcc-8) FAIL
    defconfig+kselftest: (gcc-8) FAIL

arm:
    allmodconfig: (gcc-8) FAIL
    milbeaut_m10v_defconfig: (gcc-8) FAIL
    multi_v4t_defconfig: (gcc-8) FAIL
    prima2_defconfig: (gcc-8) FAIL
    s3c6400_defconfig: (gcc-8) FAIL
    spear3xx_defconfig: (gcc-8) FAIL
    spear6xx_defconfig: (gcc-8) FAIL
    stm32_defconfig: (gcc-8) FAIL
    u8500_defconfig: (gcc-8) FAIL
    vf610m4_defconfig: (gcc-8) FAIL

mips:
    32r2el_defconfig: (gcc-8) FAIL
    db1xxx_defconfig: (gcc-8) FAIL
    e55_defconfig: (gcc-8) FAIL
    ip22_defconfig: (gcc-8) FAIL
    malta_kvm_defconfig: (gcc-8) FAIL

Errors and Warnings Detected:

arc:

arm64:
    allmodconfig (gcc-8): 9 warnings
    defconfig (clang-9): 3 errors
    defconfig (clang-10): 3 errors, 4 warnings
    defconfig (gcc-8): 1 error, 1 warning
    defconfig+CONFIG_CPU_BIG_ENDIAN=y (gcc-8): 1 error, 1 warning
    defconfig+CONFIG_RANDOMIZE_BASE=y (gcc-8): 1 error, 1 warning
    defconfig+kselftest (gcc-8): 1 error, 1 warning

arm:
    allmodconfig (gcc-8): 1 error
    aspeed_g4_defconfig (gcc-8): 13 warnings
    milbeaut_m10v_defconfig (gcc-8): 6 errors
    multi_v4t_defconfig (gcc-8): 6 errors
    multi_v5_defconfig (clang-9): 12 warnings
    multi_v7_defconfig (gcc-8): 12 warnings
    multi_v7_defconfig (clang-10): 12 warnings
    multi_v7_defconfig (clang-9): 12 warnings
    multi_v7_defconfig+CONFIG_CPU_BIG_ENDIAN=y (gcc-8): 12 warnings
    multi_v7_defconfig+CONFIG_EFI=y+CONFIG_ARM_LPAE=y (gcc-8): 12 warnings
    multi_v7_defconfig+CONFIG_SMP=n (gcc-8): 12 warnings
    prima2_defconfig (gcc-8): 6 errors
    s3c6400_defconfig (gcc-8): 6 errors
    spear3xx_defconfig (gcc-8): 2 errors
    spear6xx_defconfig (gcc-8): 2 errors
    stm32_defconfig (gcc-8): 6 errors
    u8500_defconfig (gcc-8): 14 errors, 6 warnings
    vf610m4_defconfig (gcc-8): 6 errors

i386:

mips:
    32r2el_defconfig (gcc-8): 8 errors
    db1xxx_defconfig (gcc-8): 10 errors
    e55_defconfig (gcc-8): 6 errors
    ip22_defconfig (gcc-8): 5 errors
    loongson3_defconfig (gcc-8): 1 warning
    malta_defconfig (gcc-8): 2 warnings
    malta_kvm_defconfig (gcc-8): 8 errors, 1 warning
    malta_qemu_32r6_defconfig (gcc-8): 1 warning
    maltaup_defconfig (gcc-8): 2 warnings
    maltaup_xpa_defconfig (gcc-8): 2 warnings

riscv:
    rv32_defconfig (gcc-8): 6 warnings

x86_64:
    allmodconfig (clang-9): 13 warnings
    tinyconfig (gcc-8): 1 warning

Errors summary:

    10   mm/slab.c:3285:1: error: inlining failed in call to always_inline ‘slab_alloc.constprop’: recursive inlining
    8    mm/slub.c:2902:30: error: inlining failed in call to always_inline ‘slab_alloc.constprop’: recursive inlining
    7    fs/io_uring.c:5518:9: error: too many arguments to function ‘io_connect’
    7    fs/io_uring.c:5510:9: error: too many arguments to function ‘io_accept’
    7    fs/io_uring.c:5486:10: error: too many arguments to function ‘io_recv’
    7    fs/io_uring.c:5484:10: error: too many arguments to function ‘io_recvmsg’
    7    fs/io_uring.c:5474:10: error: too many arguments to function ‘io_send’
    7    fs/io_uring.c:5472:10: error: too many arguments to function ‘io_sendmsg’
    4    mm/memory-failure.c:1827:3: error: implicit declaration of function ‘page_handle_poison’; did you mean ‘page_init_poison’? [-Werror=implicit-function-declaration]
    4    include/linux/hashtable.h:52:30: error: void value not ignored as it ought to be
    4    include/linux/build_bug.h:16:51: error: negative width in bit-field ‘<anonymous>’
    2    mm/memory-failure.c:1870:7: error: implicit declaration of function 'page_handle_poison' [-Werror,-Wimplicit-function-declaration]
    2    mm/memory-failure.c:1837:9: error: implicit declaration of function 'page_handle_poison' [-Werror,-Wimplicit-function-declaration]
    2    mm/memory-failure.c:1827:3: error: implicit declaration of function 'page_handle_poison' [-Werror,-Wimplicit-function-declaration]
    1    include/linux/hashtable.h:27:25: error: expected declaration specifiers or ‘...’ before ‘(’ token
    1    drivers/video/console/newport_con.c:598:15: error: ‘struct vc_data’ has no member named ‘vc_color’; did you mean ‘vc_cols’?
    1    drivers/video/console/newport_con.c:594:15: error: ‘struct vc_data’ has no member named ‘vc_color’; did you mean ‘vc_cols’?
    1    drivers/video/console/newport_con.c:370:15: error: ‘struct vc_data’ has no member named ‘vc_color’; did you mean ‘vc_cols’?
    1    drivers/video/console/newport_con.c:368:15: error: ‘struct vc_data’ has no member named ‘vc_color’; did you mean ‘vc_cols’?
    1    drivers/video/console/newport_con.c:365:15: error: ‘struct vc_data’ has no member named ‘vc_color’; did you mean ‘vc_cols’?
    1    drivers/crypto/ux500/hash/hash_core.c:1518:12: error: ‘hash_init’ undeclared here (not in a function); did you mean ‘sha1_init’?
    1    drivers/crypto/ux500/hash/hash_core.c:1441:19: error: passing argument 1 of ‘__hash_init’ from incompatible pointer type [-Werror=incompatible-pointer-types]
    1    drivers/crypto/ux500/hash/hash_core.c:1428:19: error: passing argument 1 of ‘__hash_init’ from incompatible pointer type [-Werror=incompatible-pointer-types]
    1    drivers/crypto/ux500/hash/hash_core.c:1375:19: error: passing argument 1 of ‘__hash_init’ from incompatible pointer type [-Werror=incompatible-pointer-types]
    1    drivers/crypto/ux500/hash/hash_core.c:1362:19: error: passing argument 1 of ‘__hash_init’ from incompatible pointer type [-Werror=incompatible-pointer-types]
    1    arch/mips/kvm/emulate.c:1808:27: error: left shift count >= width of type [-Werror=shift-count-overflow]
    1    arch/mips/kvm/emulate.c:1804:27: error: left shift count >= width of type [-Werror=shift-count-overflow]
    1    arch/mips/kvm/emulate.c:1800:27: error: left shift count >= width of type [-Werror=shift-count-overflow]
    1    arch/mips/kvm/emulate.c:1796:27: error: left shift count >= width of type [-Werror=shift-count-overflow]
    1    arch/mips/kvm/emulate.c:1746:28: error: right shift count >= width of type [-Werror=shift-count-overflow]
    1    arch/mips/kvm/emulate.c:1742:28: error: right shift count >= width of type [-Werror=shift-count-overflow]
    1    arch/mips/kvm/emulate.c:1738:28: error: right shift count >= width of type [-Werror=shift-count-overflow]
    1    arch/mips/kvm/emulate.c:1734:28: error: right shift count >= width of type [-Werror=shift-count-overflow]
    1    ap-cpu-clk.c:(.text+0x648): undefined reference to `ap_cp_unique_name'
    1    /mnt/resource/workspace/workspace/kernel-build@2/linux/build/../net/core/filter.c:9351: undefined reference to `tcp_prot'
    1    /mnt/resource/workspace/workspace/kernel-build@2/linux/build/../net/core/filter.c:9329: undefined reference to `tcp_prot'
    1    /home/buildslave/workspace/kernel-build/linux/build/../net/core/filter.c:9351: undefined reference to `tcp_prot'
    1    /home/buildslave/workspace/kernel-build/linux/build/../net/core/filter.c:9329: undefined reference to `tcp_prot'

Warnings summary:

    8    arch/arm/boot/dts/aspeed-bmc-facebook-yosemitev2.dts:161.3-30: Warning (i2c_bus_reg): /ahb/apb/bus@1e78a000/i2c-bus@300/ipmb7@10:reg: I2C address must be less than 10-bits, got "0x40000010"
    8    arch/arm/boot/dts/aspeed-bmc-facebook-yosemitev2.dts:159.11-163.4: Warning (i2c_bus_reg): /ahb/apb/bus@1e78a000/i2c-bus@300/ipmb7@10: I2C bus unit address format error, expected "40000010"
    8    arch/arm/boot/dts/aspeed-bmc-facebook-yosemitev2.dts:150.3-30: Warning (i2c_bus_reg): /ahb/apb/bus@1e78a000/i2c-bus@180/ipmb5@10:reg: I2C address must be less than 10-bits, got "0x40000010"
    8    arch/arm/boot/dts/aspeed-bmc-facebook-yosemitev2.dts:148.11-152.4: Warning (i2c_bus_reg): /ahb/apb/bus@1e78a000/i2c-bus@180/ipmb5@10: I2C bus unit address format error, expected "40000010"
    8    arch/arm/boot/dts/aspeed-bmc-facebook-yosemitev2.dts:139.3-30: Warning (i2c_bus_reg): /ahb/apb/bus@1e78a000/i2c-bus@100/ipmb3@10:reg: I2C address must be less than 10-bits, got "0x40000010"
    8    arch/arm/boot/dts/aspeed-bmc-facebook-yosemitev2.dts:137.11-141.4: Warning (i2c_bus_reg): /ahb/apb/bus@1e78a000/i2c-bus@100/ipmb3@10: I2C bus unit address format error, expected "40000010"
    8    arch/arm/boot/dts/aspeed-bmc-facebook-yosemitev2.dts:128.3-30: Warning (i2c_bus_reg): /ahb/apb/bus@1e78a000/i2c-bus@80/ipmb1@10:reg: I2C address must be less than 10-bits, got "0x40000010"
    8    arch/arm/boot/dts/aspeed-bmc-facebook-yosemitev2.dts:126.11-130.4: Warning (i2c_bus_reg): /ahb/apb/bus@1e78a000/i2c-bus@80/ipmb1@10: I2C bus unit address format error, expected "40000010"
    8    arch/arm/boot/dts/aspeed-bmc-facebook-tiogapass.dts:523.3-30: Warning (i2c_bus_reg): /ahb/apb/bus@1e78a000/i2c-bus@380/ipmb0@10:reg: I2C address must be less than 10-bits, got "0x40000010"
    8    arch/arm/boot/dts/aspeed-bmc-facebook-tiogapass.dts:521.11-525.4: Warning (i2c_bus_reg): /ahb/apb/bus@1e78a000/i2c-bus@380/ipmb0@10: I2C bus unit address format error, expected "40000010"
    8    arch/arm/boot/dts/aspeed-bmc-facebook-tiogapass.dts:437.3-30: Warning (i2c_bus_reg): /ahb/apb/bus@1e78a000/i2c-bus@140/ipmb0@10:reg: I2C address must be less than 10-bits, got "0x40000010"
    8    arch/arm/boot/dts/aspeed-bmc-facebook-tiogapass.dts:435.11-439.4: Warning (i2c_bus_reg): /ahb/apb/bus@1e78a000/i2c-bus@140/ipmb0@10: I2C bus unit address format error, expected "40000010"
    5    cc1: some warnings being treated as errors
    4    include/linux/kernel.h:47:38: warning: division ‘sizeof (struct ahash_request *) / sizeof (struct ahash_request)’ does not compute the number of array elements [-Wsizeof-pointer-div]
    3    drivers/net/ethernet/amd/pcnet32.c:2928:12: warning: ‘pcnet32_pm_resume’ defined but not used [-Wunused-function]
    3    drivers/net/ethernet/amd/pcnet32.c:2916:12: warning: ‘pcnet32_pm_suspend’ defined but not used [-Wunused-function]
    3    arch/arm64/boot/dts/broadcom/stingray/stingray-usb.dtsi:7.3-14: Warning (dma_ranges_format): /usb:dma-ranges: empty "dma-ranges" property but its #size-cells (1) differs from / (2)
    3    arch/arm64/boot/dts/broadcom/stingray/stingray-usb.dtsi:7.3-14: Warning (dma_ranges_format): /usb:dma-ranges: empty "dma-ranges" property but its #address-cells (1) differs from / (2)
    2    WARNING: modpost: missing MODULE_LICENSE() in drivers/scsi/ufs/ufs-exynos.o
    2    <stdin>:830:2: warning: #warning syscall fstat64 not implemented [-Wcpp]
    2    <stdin>:1511:2: warning: #warning syscall clone3 not implemented [-Wcpp]
    2    <stdin>:1127:2: warning: #warning syscall fstatat64 not implemented [-Wcpp]
    2    1 warning generated.
    1    {standard input}:141: Warning: macro instruction expanded into multiple instructions
    1    sound/soc/intel/keembay/kmb_platform.h:9:9: warning: 'KMB_PLATFORM_H_' is used as a header guard here, followed by #define of a different macro [-Wheader-guard]
    1    kernel/rcu/tasks.h:593:13: warning: ‘show_rcu_tasks_classic_gp_kthread’ defined but not used [-Wunused-function]
    1    drivers/net/bonding/bond_main.c:4681:23: warning: equality comparison with extraneous parentheses [-Wparentheses-equality]
    1    drivers/net/bonding/bond_main.c:4681:23: note: remove extraneous parentheses around the comparison to silence this warning
    1    drivers/net/bonding/bond_main.c:4657:23: warning: equality comparison with extraneous parentheses [-Wparentheses-equality]
    1    drivers/net/bonding/bond_main.c:4657:23: note: remove extraneous parentheses around the comparison to silence this warning
    1    drivers/media/tuners/mxl5005s.c:3953:1: warning: the frame size of 1120 bytes is larger than 1024 bytes [-Wframe-larger-than=]
    1    drivers/infiniband/hw/hfi1/qp.c:198:9: warning: implicit conversion from enumeration type 'enum opa_mtu' to different enumeration type 'enum ib_mtu' [-Wenum-conversion]
    1    drivers/crypto/ux500/hash/hash_core.c:531:13: warning: ‘hash_dma_valid_data’ defined but not used [-Wunused-function]
    1    cc1: all warnings being treated as errors
    1    arch/x86/kernel/signal.o: warning: objtool: x32_setup_rt_frame()+0x1f2: call to memset() with UACCESS enabled
    1    arch/x86/kernel/signal.o: warning: objtool: __setup_rt_frame()+0x1cb: call to memset() with UACCESS enabled
    1    arch/x86/ia32/ia32_signal.o: warning: objtool: ia32_setup_rt_frame()+0x1fa: call to memset() with UACCESS enabled
    1    arch/arm64/boot/dts/qcom/ipq6018.dtsi:127.3-14: Warning (dma_ranges_format): /soc:dma-ranges: empty "dma-ranges" property but its #size-cells (1) differs from / (2)
    1    arch/arm64/boot/dts/qcom/ipq6018.dtsi:127.3-14: Warning (dma_ranges_format): /soc:dma-ranges: empty "dma-ranges" property but its #address-cells (1) differs from / (2)
    1    aarch64-linux-gnu-strip: warning: drivers/firmware/efi/libstub/lib-ctype.o: unsupported GNU_PROPERTY_TYPE (5) type: 0xc0000000
    1    aarch64-linux-gnu-objdump: warning: drivers/firmware/efi/libstub/lib-ctype.stub.o: unsupported GNU_PROPERTY_TYPE (5) type: 0xc0000000
    1    aarch64-linux-gnu-objcopy: warning: drivers/firmware/efi/libstub/lib-ctype.o: unsupported GNU_PROPERTY_TYPE (5) type: 0xc0000000
    1    aarch64-linux-gnu-ar: warning: drivers/firmware/efi/libstub/lib-ctype.stub.o: unsupported GNU_PROPERTY_TYPE (5) type: 0xc0000000
    1    2 warnings generated.
    1    .config:1173:warning: override: UNWINDER_GUESS changes choice state

Section mismatches summary:

    1    WARNING: modpost: vmlinux.o(.text.unlikely+0x2910): Section mismatch in reference from the function pmax_setup_memory_region() to the function .init.text:add_memory_region()

================================================================================

Detailed per-defconfig build reports:

--------------------------------------------------------------------------------
32r2el_defconfig (mips, gcc-8) — FAIL, 8 errors, 0 warnings, 0 section mismatches

Errors:
    mm/slub.c:2902:30: error: inlining failed in call to always_inline ‘slab_alloc.constprop’: recursive inlining
    mm/slub.c:2902:30: error: inlining failed in call to always_inline ‘slab_alloc.constprop’: recursive inlining
    mm/slub.c:2902:30: error: inlining failed in call to always_inline ‘slab_alloc.constprop’: recursive inlining
    mm/slub.c:2902:30: error: inlining failed in call to always_inline ‘slab_alloc.constprop’: recursive inlining
    mm/slub.c:2902:30: error: inlining failed in call to always_inline ‘slab_alloc.constprop’: recursive inlining
    mm/slub.c:2902:30: error: inlining failed in call to always_inline ‘slab_alloc.constprop’: recursive inlining
    mm/slub.c:2902:30: error: inlining failed in call to always_inline ‘slab_alloc.constprop’: recursive inlining
    mm/slub.c:2902:30: error: inlining failed in call to always_inline ‘slab_alloc.constprop’: recursive inlining

--------------------------------------------------------------------------------
32r2el_defconfig+kselftest (mips, gcc-8) — PASS, 0 errors, 0 warnings, 0 section mismatches

--------------------------------------------------------------------------------
allmodconfig (arm, gcc-8) — FAIL, 1 error, 0 warnings, 0 section mismatches

Errors:
    ap-cpu-clk.c:(.text+0x648): undefined reference to `ap_cp_unique_name'

--------------------------------------------------------------------------------
allmodconfig (x86_64, clang-9) — PASS, 0 errors, 13 warnings, 0 section mismatches

Warnings:
    arch/x86/ia32/ia32_signal.o: warning: objtool: ia32_setup_rt_frame()+0x1fa: call to memset() with UACCESS enabled
    arch/x86/kernel/signal.o: warning: objtool: x32_setup_rt_frame()+0x1f2: call to memset() with UACCESS enabled
    arch/x86/kernel/signal.o: warning: objtool: __setup_rt_frame()+0x1cb: call to memset() with UACCESS enabled
    sound/soc/intel/keembay/kmb_platform.h:9:9: warning: 'KMB_PLATFORM_H_' is used as a header guard here, followed by #define of a different macro [-Wheader-guard]
    1 warning generated.
    drivers/net/bonding/bond_main.c:4657:23: warning: equality comparison with extraneous parentheses [-Wparentheses-equality]
    drivers/net/bonding/bond_main.c:4657:23: note: remove extraneous parentheses around the comparison to silence this warning
    drivers/net/bonding/bond_main.c:4681:23: warning: equality comparison with extraneous parentheses [-Wparentheses-equality]
    drivers/net/bonding/bond_main.c:4681:23: note: remove extraneous parentheses around the comparison to silence this warning
    2 warnings generated.
    drivers/infiniband/hw/hfi1/qp.c:198:9: warning: implicit conversion from enumeration type 'enum opa_mtu' to different enumeration type 'enum ib_mtu' [-Wenum-conversion]
    1 warning generated.
    WARNING: modpost: missing MODULE_LICENSE() in drivers/scsi/ufs/ufs-exynos.o

--------------------------------------------------------------------------------
allmodconfig (arm64, gcc-8) — PASS, 0 errors, 9 warnings, 0 section mismatches

Warnings:
    WARNING: modpost: missing MODULE_LICENSE() in drivers/scsi/ufs/ufs-exynos.o
    arch/arm64/boot/dts/broadcom/stingray/stingray-usb.dtsi:7.3-14: Warning (dma_ranges_format): /usb:dma-ranges: empty "dma-ranges" property but its #address-cells (1) differs from / (2)
    arch/arm64/boot/dts/broadcom/stingray/stingray-usb.dtsi:7.3-14: Warning (dma_ranges_format): /usb:dma-ranges: empty "dma-ranges" property but its #size-cells (1) differs from / (2)
    arch/arm64/boot/dts/broadcom/stingray/stingray-usb.dtsi:7.3-14: Warning (dma_ranges_format): /usb:dma-ranges: empty "dma-ranges" property but its #address-cells (1) differs from / (2)
    arch/arm64/boot/dts/broadcom/stingray/stingray-usb.dtsi:7.3-14: Warning (dma_ranges_format): /usb:dma-ranges: empty "dma-ranges" property but its #size-cells (1) differs from / (2)
    arch/arm64/boot/dts/broadcom/stingray/stingray-usb.dtsi:7.3-14: Warning (dma_ranges_format): /usb:dma-ranges: empty "dma-ranges" property but its #address-cells (1) differs from / (2)
    arch/arm64/boot/dts/broadcom/stingray/stingray-usb.dtsi:7.3-14: Warning (dma_ranges_format): /usb:dma-ranges: empty "dma-ranges" property but its #size-cells (1) differs from / (2)
    arch/arm64/boot/dts/qcom/ipq6018.dtsi:127.3-14: Warning (dma_ranges_format): /soc:dma-ranges: empty "dma-ranges" property but its #address-cells (1) differs from / (2)
    arch/arm64/boot/dts/qcom/ipq6018.dtsi:127.3-14: Warning (dma_ranges_format): /soc:dma-ranges: empty "dma-ranges" property but its #size-cells (1) differs from / (2)

--------------------------------------------------------------------------------
allnoconfig (mips, gcc-8) — PASS, 0 errors, 0 warnings, 0 section mismatches

--------------------------------------------------------------------------------
allnoconfig (arm64, gcc-8) — PASS, 0 errors, 0 warnings, 0 section mismatches

--------------------------------------------------------------------------------
allnoconfig (arm, clang-9) — PASS, 0 errors, 0 warnings, 0 section mismatches

--------------------------------------------------------------------------------
allnoconfig (x86_64, gcc-8) — PASS, 0 errors, 0 warnings, 0 section mismatches

--------------------------------------------------------------------------------
allnoconfig (i386, gcc-8) — PASS, 0 errors, 0 warnings, 0 section mismatches

--------------------------------------------------------------------------------
ar7_defconfig (mips, gcc-8) — PASS, 0 errors, 0 warnings, 0 section mismatches

--------------------------------------------------------------------------------
aspeed_g4_defconfig (arm, gcc-8) — PASS, 0 errors, 13 warnings, 0 section mismatches

Warnings:
    kernel/rcu/tasks.h:593:13: warning: ‘show_rcu_tasks_classic_gp_kthread’ defined but not used [-Wunused-function]
    arch/arm/boot/dts/aspeed-bmc-facebook-tiogapass.dts:435.11-439.4: Warning (i2c_bus_reg): /ahb/apb/bus@1e78a000/i2c-bus@140/ipmb0@10: I2C bus unit address format error, expected "40000010"
    arch/arm/boot/dts/aspeed-bmc-facebook-tiogapass.dts:437.3-30: Warning (i2c_bus_reg): /ahb/apb/bus@1e78a000/i2c-bus@140/ipmb0@10:reg: I2C address must be less than 10-bits, got "0x40000010"
    arch/arm/boot/dts/aspeed-bmc-facebook-tiogapass.dts:521.11-525.4: Warning (i2c_bus_reg): /ahb/apb/bus@1e78a000/i2c-bus@380/ipmb0@10: I2C bus unit address format error, expected "40000010"
    arch/arm/boot/dts/aspeed-bmc-facebook-tiogapass.dts:523.3-30: Warning (i2c_bus_reg): /ahb/apb/bus@1e78a000/i2c-bus@380/ipmb0@10:reg: I2C address must be less than 10-bits, got "0x40000010"
    arch/arm/boot/dts/aspeed-bmc-facebook-yosemitev2.dts:126.11-130.4: Warning (i2c_bus_reg): /ahb/apb/bus@1e78a000/i2c-bus@80/ipmb1@10: I2C bus unit address format error, expected "40000010"
    arch/arm/boot/dts/aspeed-bmc-facebook-yosemitev2.dts:128.3-30: Warning (i2c_bus_reg): /ahb/apb/bus@1e78a000/i2c-bus@80/ipmb1@10:reg: I2C address must be less than 10-bits, got "0x40000010"
    arch/arm/boot/dts/aspeed-bmc-facebook-yosemitev2.dts:137.11-141.4: Warning (i2c_bus_reg): /ahb/apb/bus@1e78a000/i2c-bus@100/ipmb3@10: I2C bus unit address format error, expected "40000010"
    arch/arm/boot/dts/aspeed-bmc-facebook-yosemitev2.dts:139.3-30: Warning (i2c_bus_reg): /ahb/apb/bus@1e78a000/i2c-bus@100/ipmb3@10:reg: I2C address must be less than 10-bits, got "0x40000010"
    arch/arm/boot/dts/aspeed-bmc-facebook-yosemitev2.dts:148.11-152.4: Warning (i2c_bus_reg): /ahb/apb/bus@1e78a000/i2c-bus@180/ipmb5@10: I2C bus unit address format error, expected "40000010"
    arch/arm/boot/dts/aspeed-bmc-facebook-yosemitev2.dts:150.3-30: Warning (i2c_bus_reg): /ahb/apb/bus@1e78a000/i2c-bus@180/ipmb5@10:reg: I2C address must be less than 10-bits, got "0x40000010"
    arch/arm/boot/dts/aspeed-bmc-facebook-yosemitev2.dts:159.11-163.4: Warning (i2c_bus_reg): /ahb/apb/bus@1e78a000/i2c-bus@300/ipmb7@10: I2C bus unit address format error, expected "40000010"
    arch/arm/boot/dts/aspeed-bmc-facebook-yosemitev2.dts:161.3-30: Warning (i2c_bus_reg): /ahb/apb/bus@1e78a000/i2c-bus@300/ipmb7@10:reg: I2C address must be less than 10-bits, got "0x40000010"

--------------------------------------------------------------------------------
at91_dt_defconfig (arm, gcc-8) — PASS, 0 errors, 0 warnings, 0 section mismatches

--------------------------------------------------------------------------------
ath25_defconfig (mips, gcc-8) — PASS, 0 errors, 0 warnings, 0 section mismatches

--------------------------------------------------------------------------------
ath79_defconfig (mips, gcc-8) — PASS, 0 errors, 0 warnings, 0 section mismatches

--------------------------------------------------------------------------------
axm55xx_defconfig (arm, gcc-8) — PASS, 0 errors, 0 warnings, 0 section mismatches

--------------------------------------------------------------------------------
badge4_defconfig (arm, gcc-8) — PASS, 0 errors, 0 warnings, 0 section mismatches

--------------------------------------------------------------------------------
bcm63xx_defconfig (mips, gcc-8) — PASS, 0 errors, 0 warnings, 0 section mismatches

--------------------------------------------------------------------------------
bmips_be_defconfig (mips, gcc-8) — PASS, 0 errors, 0 warnings, 0 section mismatches

--------------------------------------------------------------------------------
bmips_stb_defconfig (mips, gcc-8) — PASS, 0 errors, 0 warnings, 0 section mismatches

--------------------------------------------------------------------------------
capcella_defconfig (mips, gcc-8) — PASS, 0 errors, 0 warnings, 0 section mismatches

--------------------------------------------------------------------------------
cavium_octeon_defconfig (mips, gcc-8) — PASS, 0 errors, 0 warnings, 0 section mismatches

--------------------------------------------------------------------------------
ci20_defconfig (mips, gcc-8) — PASS, 0 errors, 0 warnings, 0 section mismatches

--------------------------------------------------------------------------------
clps711x_defconfig (arm, gcc-8) — PASS, 0 errors, 0 warnings, 0 section mismatches

--------------------------------------------------------------------------------
colibri_pxa270_defconfig (arm, gcc-8) — PASS, 0 errors, 0 warnings, 0 section mismatches

--------------------------------------------------------------------------------
colibri_pxa300_defconfig (arm, gcc-8) — PASS, 0 errors, 0 warnings, 0 section mismatches

--------------------------------------------------------------------------------
collie_defconfig (arm, gcc-8) — PASS, 0 errors, 0 warnings, 0 section mismatches

--------------------------------------------------------------------------------
corgi_defconfig (arm, gcc-8) — PASS, 0 errors, 0 warnings, 0 section mismatches

--------------------------------------------------------------------------------
davinci_all_defconfig (arm, gcc-8) — PASS, 0 errors, 0 warnings, 0 section mismatches

--------------------------------------------------------------------------------
db1xxx_defconfig (mips, gcc-8) — FAIL, 10 errors, 0 warnings, 0 section mismatches

Errors:
    mm/slab.c:3285:1: error: inlining failed in call to always_inline ‘slab_alloc.constprop’: recursive inlining
    mm/slab.c:3285:1: error: inlining failed in call to always_inline ‘slab_alloc.constprop’: recursive inlining
    mm/slab.c:3285:1: error: inlining failed in call to always_inline ‘slab_alloc.constprop’: recursive inlining
    mm/slab.c:3285:1: error: inlining failed in call to always_inline ‘slab_alloc.constprop’: recursive inlining
    mm/slab.c:3285:1: error: inlining failed in call to always_inline ‘slab_alloc.constprop’: recursive inlining
    mm/slab.c:3285:1: error: inlining failed in call to always_inline ‘slab_alloc.constprop’: recursive inlining
    mm/slab.c:3285:1: error: inlining failed in call to always_inline ‘slab_alloc.constprop’: recursive inlining
    mm/slab.c:3285:1: error: inlining failed in call to always_inline ‘slab_alloc.constprop’: recursive inlining
    mm/slab.c:3285:1: error: inlining failed in call to always_inline ‘slab_alloc.constprop’: recursive inlining
    mm/slab.c:3285:1: error: inlining failed in call to always_inline ‘slab_alloc.constprop’: recursive inlining

--------------------------------------------------------------------------------
decstation_64_defconfig (mips, gcc-8) — PASS, 0 errors, 0 warnings, 0 section mismatches

--------------------------------------------------------------------------------
decstation_r4k_defconfig (mips, gcc-8) — PASS, 0 errors, 0 warnings, 0 section mismatches

Section mismatches:
    WARNING: modpost: vmlinux.o(.text.unlikely+0x2910): Section mismatch in reference from the function pmax_setup_memory_region() to the function .init.text:add_memory_region()

--------------------------------------------------------------------------------
defconfig (arm64, clang-9) — FAIL, 3 errors, 0 warnings, 0 section mismatches

Errors:
    mm/memory-failure.c:1827:3: error: implicit declaration of function 'page_handle_poison' [-Werror,-Wimplicit-function-declaration]
    mm/memory-failure.c:1837:9: error: implicit declaration of function 'page_handle_poison' [-Werror,-Wimplicit-function-declaration]
    mm/memory-failure.c:1870:7: error: implicit declaration of function 'page_handle_poison' [-Werror,-Wimplicit-function-declaration]

--------------------------------------------------------------------------------
defconfig (arm64, clang-10) — FAIL, 3 errors, 4 warnings, 0 section mismatches

Errors:
    mm/memory-failure.c:1827:3: error: implicit declaration of function 'page_handle_poison' [-Werror,-Wimplicit-function-declaration]
    mm/memory-failure.c:1837:9: error: implicit declaration of function 'page_handle_poison' [-Werror,-Wimplicit-function-declaration]
    mm/memory-failure.c:1870:7: error: implicit declaration of function 'page_handle_poison' [-Werror,-Wimplicit-function-declaration]

Warnings:
    aarch64-linux-gnu-strip: warning: drivers/firmware/efi/libstub/lib-ctype.o: unsupported GNU_PROPERTY_TYPE (5) type: 0xc0000000
    aarch64-linux-gnu-objdump: warning: drivers/firmware/efi/libstub/lib-ctype.stub.o: unsupported GNU_PROPERTY_TYPE (5) type: 0xc0000000
    aarch64-linux-gnu-objcopy: warning: drivers/firmware/efi/libstub/lib-ctype.o: unsupported GNU_PROPERTY_TYPE (5) type: 0xc0000000
    aarch64-linux-gnu-ar: warning: drivers/firmware/efi/libstub/lib-ctype.stub.o: unsupported GNU_PROPERTY_TYPE (5) type: 0xc0000000

--------------------------------------------------------------------------------
defconfig (riscv, gcc-8) — PASS, 0 errors, 0 warnings, 0 section mismatches

--------------------------------------------------------------------------------
defconfig (arm64, gcc-8) — FAIL, 1 error, 1 warning, 0 section mismatches

Errors:
    mm/memory-failure.c:1827:3: error: implicit declaration of function ‘page_handle_poison’; did you mean ‘page_init_poison’? [-Werror=implicit-function-declaration]

Warnings:
    cc1: some warnings being treated as errors

--------------------------------------------------------------------------------
defconfig+CONFIG_CPU_BIG_ENDIAN=y (arm64, gcc-8) — FAIL, 1 error, 1 warning, 0 section mismatches

Errors:
    mm/memory-failure.c:1827:3: error: implicit declaration of function ‘page_handle_poison’; did you mean ‘page_init_poison’? [-Werror=implicit-function-declaration]

Warnings:
    cc1: some warnings being treated as errors

--------------------------------------------------------------------------------
defconfig+CONFIG_RANDOMIZE_BASE=y (arm64, gcc-8) — FAIL, 1 error, 1 warning, 0 section mismatches

Errors:
    mm/memory-failure.c:1827:3: error: implicit declaration of function ‘page_handle_poison’; did you mean ‘page_init_poison’? [-Werror=implicit-function-declaration]

Warnings:
    cc1: some warnings being treated as errors

--------------------------------------------------------------------------------
defconfig+kselftest (arm64, gcc-8) — FAIL, 1 error, 1 warning, 0 section mismatches

Errors:
    mm/memory-failure.c:1827:3: error: implicit declaration of function ‘page_handle_poison’; did you mean ‘page_init_poison’? [-Werror=implicit-function-declaration]

Warnings:
    cc1: some warnings being treated as errors

--------------------------------------------------------------------------------
defconfig+kselftest (riscv, gcc-8) — PASS, 0 errors, 0 warnings, 0 section mismatches

--------------------------------------------------------------------------------
dove_defconfig (arm, gcc-8) — PASS, 0 errors, 0 warnings, 0 section mismatches

--------------------------------------------------------------------------------
e55_defconfig (mips, gcc-8) — FAIL, 6 errors, 0 warnings, 0 section mismatches

Errors:
    fs/io_uring.c:5472:10: error: too many arguments to function ‘io_sendmsg’
    fs/io_uring.c:5474:10: error: too many arguments to function ‘io_send’
    fs/io_uring.c:5484:10: error: too many arguments to function ‘io_recvmsg’
    fs/io_uring.c:5486:10: error: too many arguments to function ‘io_recv’
    fs/io_uring.c:5510:9: error: too many arguments to function ‘io_accept’
    fs/io_uring.c:5518:9: error: too many arguments to function ‘io_connect’

--------------------------------------------------------------------------------
ebsa110_defconfig (arm, gcc-8) — PASS, 0 errors, 0 warnings, 0 section mismatches

--------------------------------------------------------------------------------
efm32_defconfig (arm, gcc-8) — PASS, 0 errors, 0 warnings, 0 section mismatches

--------------------------------------------------------------------------------
ep93xx_defconfig (arm, gcc-8) — PASS, 0 errors, 0 warnings, 0 section mismatches

--------------------------------------------------------------------------------
eseries_pxa_defconfig (arm, gcc-8) — PASS, 0 errors, 0 warnings, 0 section mismatches

--------------------------------------------------------------------------------
ezx_defconfig (arm, gcc-8) — PASS, 0 errors, 0 warnings, 0 section mismatches

--------------------------------------------------------------------------------
gcw0_defconfig (mips, gcc-8) — PASS, 0 errors, 0 warnings, 0 section mismatches

--------------------------------------------------------------------------------
gemini_defconfig (arm, gcc-8) — PASS, 0 errors, 0 warnings, 0 section mismatches

--------------------------------------------------------------------------------
gpr_defconfig (mips, gcc-8) — PASS, 0 errors, 0 warnings, 0 section mismatches

--------------------------------------------------------------------------------
h3600_defconfig (arm, gcc-8) — PASS, 0 errors, 0 warnings, 0 section mismatches

--------------------------------------------------------------------------------
haps_hs_smp_defconfig (arc, gcc-8) — PASS, 0 errors, 0 warnings, 0 section mismatches

--------------------------------------------------------------------------------
haps_hs_smp_defconfig+kselftest (arc, gcc-8) — PASS, 0 errors, 0 warnings, 0 section mismatches

--------------------------------------------------------------------------------
i386_defconfig+kselftest (i386, gcc-8) — PASS, 0 errors, 0 warnings, 0 section mismatches

--------------------------------------------------------------------------------
imote2_defconfig (arm, gcc-8) — PASS, 0 errors, 0 warnings, 0 section mismatches

--------------------------------------------------------------------------------
imx_v4_v5_defconfig (arm, gcc-8) — PASS, 0 errors, 0 warnings, 0 section mismatches

--------------------------------------------------------------------------------
imx_v6_v7_defconfig (arm, gcc-8) — PASS, 0 errors, 0 warnings, 0 section mismatches

--------------------------------------------------------------------------------
integrator_defconfig (arm, gcc-8) — PASS, 0 errors, 0 warnings, 0 section mismatches

--------------------------------------------------------------------------------
iop32x_defconfig (arm, gcc-8) — PASS, 0 errors, 0 warnings, 0 section mismatches

--------------------------------------------------------------------------------
ip22_defconfig (mips, gcc-8) — FAIL, 5 errors, 0 warnings, 0 section mismatches

Errors:
    drivers/video/console/newport_con.c:365:15: error: ‘struct vc_data’ has no member named ‘vc_color’; did you mean ‘vc_cols’?
    drivers/video/console/newport_con.c:368:15: error: ‘struct vc_data’ has no member named ‘vc_color’; did you mean ‘vc_cols’?
    drivers/video/console/newport_con.c:370:15: error: ‘struct vc_data’ has no member named ‘vc_color’; did you mean ‘vc_cols’?
    drivers/video/console/newport_con.c:594:15: error: ‘struct vc_data’ has no member named ‘vc_color’; did you mean ‘vc_cols’?
    drivers/video/console/newport_con.c:598:15: error: ‘struct vc_data’ has no member named ‘vc_color’; did you mean ‘vc_cols’?

--------------------------------------------------------------------------------
ip28_defconfig (mips, gcc-8) — PASS, 0 errors, 0 warnings, 0 section mismatches

--------------------------------------------------------------------------------
ixp4xx_defconfig (arm, gcc-8) — PASS, 0 errors, 0 warnings, 0 section mismatches

--------------------------------------------------------------------------------
jazz_defconfig (mips, gcc-8) — PASS, 0 errors, 0 warnings, 0 section mismatches

--------------------------------------------------------------------------------
keystone_defconfig (arm, gcc-8) — PASS, 0 errors, 0 warnings, 0 section mismatches

--------------------------------------------------------------------------------
lart_defconfig (arm, gcc-8) — PASS, 0 errors, 0 warnings, 0 section mismatches

--------------------------------------------------------------------------------
lemote2f_defconfig (mips, gcc-8) — PASS, 0 errors, 0 warnings, 0 section mismatches

--------------------------------------------------------------------------------
loongson1b_defconfig (mips, gcc-8) — PASS, 0 errors, 0 warnings, 0 section mismatches

--------------------------------------------------------------------------------
loongson1c_defconfig (mips, gcc-8) — PASS, 0 errors, 0 warnings, 0 section mismatches

--------------------------------------------------------------------------------
loongson3_defconfig (mips, gcc-8) — PASS, 0 errors, 1 warning, 0 section mismatches

Warnings:
    drivers/media/tuners/mxl5005s.c:3953:1: warning: the frame size of 1120 bytes is larger than 1024 bytes [-Wframe-larger-than=]

--------------------------------------------------------------------------------
lpc18xx_defconfig (arm, gcc-8) — PASS, 0 errors, 0 warnings, 0 section mismatches

--------------------------------------------------------------------------------
lpd270_defconfig (arm, gcc-8) — PASS, 0 errors, 0 warnings, 0 section mismatches

--------------------------------------------------------------------------------
lubbock_defconfig (arm, gcc-8) — PASS, 0 errors, 0 warnings, 0 section mismatches

--------------------------------------------------------------------------------
mainstone_defconfig (arm, gcc-8) — PASS, 0 errors, 0 warnings, 0 section mismatches

--------------------------------------------------------------------------------
malta_defconfig (mips, gcc-8) — PASS, 0 errors, 2 warnings, 0 section mismatches

Warnings:
    drivers/net/ethernet/amd/pcnet32.c:2928:12: warning: ‘pcnet32_pm_resume’ defined but not used [-Wunused-function]
    drivers/net/ethernet/amd/pcnet32.c:2916:12: warning: ‘pcnet32_pm_suspend’ defined but not used [-Wunused-function]

--------------------------------------------------------------------------------
malta_kvm_defconfig (mips, gcc-8) — FAIL, 8 errors, 1 warning, 0 section mismatches

Errors:
    arch/mips/kvm/emulate.c:1734:28: error: right shift count >= width of type [-Werror=shift-count-overflow]
    arch/mips/kvm/emulate.c:1738:28: error: right shift count >= width of type [-Werror=shift-count-overflow]
    arch/mips/kvm/emulate.c:1742:28: error: right shift count >= width of type [-Werror=shift-count-overflow]
    arch/mips/kvm/emulate.c:1746:28: error: right shift count >= width of type [-Werror=shift-count-overflow]
    arch/mips/kvm/emulate.c:1796:27: error: left shift count >= width of type [-Werror=shift-count-overflow]
    arch/mips/kvm/emulate.c:1800:27: error: left shift count >= width of type [-Werror=shift-count-overflow]
    arch/mips/kvm/emulate.c:1804:27: error: left shift count >= width of type [-Werror=shift-count-overflow]
    arch/mips/kvm/emulate.c:1808:27: error: left shift count >= width of type [-Werror=shift-count-overflow]

Warnings:
    cc1: all warnings being treated as errors

--------------------------------------------------------------------------------
malta_qemu_32r6_defconfig (mips, gcc-8) — PASS, 0 errors, 1 warning, 0 section mismatches

Warnings:
    {standard input}:141: Warning: macro instruction expanded into multiple instructions

--------------------------------------------------------------------------------
maltasmvp_defconfig (mips, gcc-8) — PASS, 0 errors, 0 warnings, 0 section mismatches

--------------------------------------------------------------------------------
maltasmvp_eva_defconfig (mips, gcc-8) — PASS, 0 errors, 0 warnings, 0 section mismatches

--------------------------------------------------------------------------------
maltaup_defconfig (mips, gcc-8) — PASS, 0 errors, 2 warnings, 0 section mismatches

Warnings:
    drivers/net/ethernet/amd/pcnet32.c:2928:12: warning: ‘pcnet32_pm_resume’ defined but not used [-Wunused-function]
    drivers/net/ethernet/amd/pcnet32.c:2916:12: warning: ‘pcnet32_pm_suspend’ defined but not used [-Wunused-function]

--------------------------------------------------------------------------------
maltaup_xpa_defconfig (mips, gcc-8) — PASS, 0 errors, 2 warnings, 0 section mismatches

Warnings:
    drivers/net/ethernet/amd/pcnet32.c:2928:12: warning: ‘pcnet32_pm_resume’ defined but not used [-Wunused-function]
    drivers/net/ethernet/amd/pcnet32.c:2916:12: warning: ‘pcnet32_pm_suspend’ defined but not used [-Wunused-function]

--------------------------------------------------------------------------------
milbeaut_m10v_defconfig (arm, gcc-8) — FAIL, 6 errors, 0 warnings, 0 section mismatches

Errors:
    fs/io_uring.c:5472:10: error: too many arguments to function ‘io_sendmsg’
    fs/io_uring.c:5474:10: error: too many arguments to function ‘io_send’
    fs/io_uring.c:5484:10: error: too many arguments to function ‘io_recvmsg’
    fs/io_uring.c:5486:10: error: too many arguments to function ‘io_recv’
    fs/io_uring.c:5510:9: error: too many arguments to function ‘io_accept’
    fs/io_uring.c:5518:9: error: too many arguments to function ‘io_connect’

--------------------------------------------------------------------------------
mini2440_defconfig (arm, gcc-8) — PASS, 0 errors, 0 warnings, 0 section mismatches

--------------------------------------------------------------------------------
mmp2_defconfig (arm, gcc-8) — PASS, 0 errors, 0 warnings, 0 section mismatches

--------------------------------------------------------------------------------
moxart_defconfig (arm, gcc-8) — PASS, 0 errors, 0 warnings, 0 section mismatches

--------------------------------------------------------------------------------
mps2_defconfig (arm, gcc-8) — PASS, 0 errors, 0 warnings, 0 section mismatches

--------------------------------------------------------------------------------
multi_v4t_defconfig (arm, gcc-8) — FAIL, 6 errors, 0 warnings, 0 section mismatches

Errors:
    fs/io_uring.c:5472:10: error: too many arguments to function ‘io_sendmsg’
    fs/io_uring.c:5474:10: error: too many arguments to function ‘io_send’
    fs/io_uring.c:5484:10: error: too many arguments to function ‘io_recvmsg’
    fs/io_uring.c:5486:10: error: too many arguments to function ‘io_recv’
    fs/io_uring.c:5510:9: error: too many arguments to function ‘io_accept’
    fs/io_uring.c:5518:9: error: too many arguments to function ‘io_connect’

--------------------------------------------------------------------------------
multi_v5_defconfig (arm, clang-9) — PASS, 0 errors, 12 warnings, 0 section mismatches

Warnings:
    arch/arm/boot/dts/aspeed-bmc-facebook-tiogapass.dts:435.11-439.4: Warning (i2c_bus_reg): /ahb/apb/bus@1e78a000/i2c-bus@140/ipmb0@10: I2C bus unit address format error, expected "40000010"
    arch/arm/boot/dts/aspeed-bmc-facebook-tiogapass.dts:437.3-30: Warning (i2c_bus_reg): /ahb/apb/bus@1e78a000/i2c-bus@140/ipmb0@10:reg: I2C address must be less than 10-bits, got "0x40000010"
    arch/arm/boot/dts/aspeed-bmc-facebook-tiogapass.dts:521.11-525.4: Warning (i2c_bus_reg): /ahb/apb/bus@1e78a000/i2c-bus@380/ipmb0@10: I2C bus unit address format error, expected "40000010"
    arch/arm/boot/dts/aspeed-bmc-facebook-tiogapass.dts:523.3-30: Warning (i2c_bus_reg): /ahb/apb/bus@1e78a000/i2c-bus@380/ipmb0@10:reg: I2C address must be less than 10-bits, got "0x40000010"
    arch/arm/boot/dts/aspeed-bmc-facebook-yosemitev2.dts:126.11-130.4: Warning (i2c_bus_reg): /ahb/apb/bus@1e78a000/i2c-bus@80/ipmb1@10: I2C bus unit address format error, expected "40000010"
    arch/arm/boot/dts/aspeed-bmc-facebook-yosemitev2.dts:128.3-30: Warning (i2c_bus_reg): /ahb/apb/bus@1e78a000/i2c-bus@80/ipmb1@10:reg: I2C address must be less than 10-bits, got "0x40000010"
    arch/arm/boot/dts/aspeed-bmc-facebook-yosemitev2.dts:137.11-141.4: Warning (i2c_bus_reg): /ahb/apb/bus@1e78a000/i2c-bus@100/ipmb3@10: I2C bus unit address format error, expected "40000010"
    arch/arm/boot/dts/aspeed-bmc-facebook-yosemitev2.dts:139.3-30: Warning (i2c_bus_reg): /ahb/apb/bus@1e78a000/i2c-bus@100/ipmb3@10:reg: I2C address must be less than 10-bits, got "0x40000010"
    arch/arm/boot/dts/aspeed-bmc-facebook-yosemitev2.dts:148.11-152.4: Warning (i2c_bus_reg): /ahb/apb/bus@1e78a000/i2c-bus@180/ipmb5@10: I2C bus unit address format error, expected "40000010"
    arch/arm/boot/dts/aspeed-bmc-facebook-yosemitev2.dts:150.3-30: Warning (i2c_bus_reg): /ahb/apb/bus@1e78a000/i2c-bus@180/ipmb5@10:reg: I2C address must be less than 10-bits, got "0x40000010"
    arch/arm/boot/dts/aspeed-bmc-facebook-yosemitev2.dts:159.11-163.4: Warning (i2c_bus_reg): /ahb/apb/bus@1e78a000/i2c-bus@300/ipmb7@10: I2C bus unit address format error, expected "40000010"
    arch/arm/boot/dts/aspeed-bmc-facebook-yosemitev2.dts:161.3-30: Warning (i2c_bus_reg): /ahb/apb/bus@1e78a000/i2c-bus@300/ipmb7@10:reg: I2C address must be less than 10-bits, got "0x40000010"

--------------------------------------------------------------------------------
multi_v7_defconfig (arm, gcc-8) — PASS, 0 errors, 12 warnings, 0 section mismatches

Warnings:
    arch/arm/boot/dts/aspeed-bmc-facebook-tiogapass.dts:435.11-439.4: Warning (i2c_bus_reg): /ahb/apb/bus@1e78a000/i2c-bus@140/ipmb0@10: I2C bus unit address format error, expected "40000010"
    arch/arm/boot/dts/aspeed-bmc-facebook-tiogapass.dts:437.3-30: Warning (i2c_bus_reg): /ahb/apb/bus@1e78a000/i2c-bus@140/ipmb0@10:reg: I2C address must be less than 10-bits, got "0x40000010"
    arch/arm/boot/dts/aspeed-bmc-facebook-tiogapass.dts:521.11-525.4: Warning (i2c_bus_reg): /ahb/apb/bus@1e78a000/i2c-bus@380/ipmb0@10: I2C bus unit address format error, expected "40000010"
    arch/arm/boot/dts/aspeed-bmc-facebook-tiogapass.dts:523.3-30: Warning (i2c_bus_reg): /ahb/apb/bus@1e78a000/i2c-bus@380/ipmb0@10:reg: I2C address must be less than 10-bits, got "0x40000010"
    arch/arm/boot/dts/aspeed-bmc-facebook-yosemitev2.dts:126.11-130.4: Warning (i2c_bus_reg): /ahb/apb/bus@1e78a000/i2c-bus@80/ipmb1@10: I2C bus unit address format error, expected "40000010"
    arch/arm/boot/dts/aspeed-bmc-facebook-yosemitev2.dts:128.3-30: Warning (i2c_bus_reg): /ahb/apb/bus@1e78a000/i2c-bus@80/ipmb1@10:reg: I2C address must be less than 10-bits, got "0x40000010"
    arch/arm/boot/dts/aspeed-bmc-facebook-yosemitev2.dts:137.11-141.4: Warning (i2c_bus_reg): /ahb/apb/bus@1e78a000/i2c-bus@100/ipmb3@10: I2C bus unit address format error, expected "40000010"
    arch/arm/boot/dts/aspeed-bmc-facebook-yosemitev2.dts:139.3-30: Warning (i2c_bus_reg): /ahb/apb/bus@1e78a000/i2c-bus@100/ipmb3@10:reg: I2C address must be less than 10-bits, got "0x40000010"
    arch/arm/boot/dts/aspeed-bmc-facebook-yosemitev2.dts:148.11-152.4: Warning (i2c_bus_reg): /ahb/apb/bus@1e78a000/i2c-bus@180/ipmb5@10: I2C bus unit address format error, expected "40000010"
    arch/arm/boot/dts/aspeed-bmc-facebook-yosemitev2.dts:150.3-30: Warning (i2c_bus_reg): /ahb/apb/bus@1e78a000/i2c-bus@180/ipmb5@10:reg: I2C address must be less than 10-bits, got "0x40000010"
    arch/arm/boot/dts/aspeed-bmc-facebook-yosemitev2.dts:159.11-163.4: Warning (i2c_bus_reg): /ahb/apb/bus@1e78a000/i2c-bus@300/ipmb7@10: I2C bus unit address format error, expected "40000010"
    arch/arm/boot/dts/aspeed-bmc-facebook-yosemitev2.dts:161.3-30: Warning (i2c_bus_reg): /ahb/apb/bus@1e78a000/i2c-bus@300/ipmb7@10:reg: I2C address must be less than 10-bits, got "0x40000010"

--------------------------------------------------------------------------------
multi_v7_defconfig (arm, clang-10) — PASS, 0 errors, 12 warnings, 0 section mismatches

Warnings:
    arch/arm/boot/dts/aspeed-bmc-facebook-tiogapass.dts:435.11-439.4: Warning (i2c_bus_reg): /ahb/apb/bus@1e78a000/i2c-bus@140/ipmb0@10: I2C bus unit address format error, expected "40000010"
    arch/arm/boot/dts/aspeed-bmc-facebook-tiogapass.dts:437.3-30: Warning (i2c_bus_reg): /ahb/apb/bus@1e78a000/i2c-bus@140/ipmb0@10:reg: I2C address must be less than 10-bits, got "0x40000010"
    arch/arm/boot/dts/aspeed-bmc-facebook-tiogapass.dts:521.11-525.4: Warning (i2c_bus_reg): /ahb/apb/bus@1e78a000/i2c-bus@380/ipmb0@10: I2C bus unit address format error, expected "40000010"
    arch/arm/boot/dts/aspeed-bmc-facebook-tiogapass.dts:523.3-30: Warning (i2c_bus_reg): /ahb/apb/bus@1e78a000/i2c-bus@380/ipmb0@10:reg: I2C address must be less than 10-bits, got "0x40000010"
    arch/arm/boot/dts/aspeed-bmc-facebook-yosemitev2.dts:126.11-130.4: Warning (i2c_bus_reg): /ahb/apb/bus@1e78a000/i2c-bus@80/ipmb1@10: I2C bus unit address format error, expected "40000010"
    arch/arm/boot/dts/aspeed-bmc-facebook-yosemitev2.dts:128.3-30: Warning (i2c_bus_reg): /ahb/apb/bus@1e78a000/i2c-bus@80/ipmb1@10:reg: I2C address must be less than 10-bits, got "0x40000010"
    arch/arm/boot/dts/aspeed-bmc-facebook-yosemitev2.dts:137.11-141.4: Warning (i2c_bus_reg): /ahb/apb/bus@1e78a000/i2c-bus@100/ipmb3@10: I2C bus unit address format error, expected "40000010"
    arch/arm/boot/dts/aspeed-bmc-facebook-yosemitev2.dts:139.3-30: Warning (i2c_bus_reg): /ahb/apb/bus@1e78a000/i2c-bus@100/ipmb3@10:reg: I2C address must be less than 10-bits, got "0x40000010"
    arch/arm/boot/dts/aspeed-bmc-facebook-yosemitev2.dts:148.11-152.4: Warning (i2c_bus_reg): /ahb/apb/bus@1e78a000/i2c-bus@180/ipmb5@10: I2C bus unit address format error, expected "40000010"
    arch/arm/boot/dts/aspeed-bmc-facebook-yosemitev2.dts:150.3-30: Warning (i2c_bus_reg): /ahb/apb/bus@1e78a000/i2c-bus@180/ipmb5@10:reg: I2C address must be less than 10-bits, got "0x40000010"
    arch/arm/boot/dts/aspeed-bmc-facebook-yosemitev2.dts:159.11-163.4: Warning (i2c_bus_reg): /ahb/apb/bus@1e78a000/i2c-bus@300/ipmb7@10: I2C bus unit address format error, expected "40000010"
    arch/arm/boot/dts/aspeed-bmc-facebook-yosemitev2.dts:161.3-30: Warning (i2c_bus_reg): /ahb/apb/bus@1e78a000/i2c-bus@300/ipmb7@10:reg: I2C address must be less than 10-bits, got "0x40000010"

--------------------------------------------------------------------------------
multi_v7_defconfig (arm, clang-9) — PASS, 0 errors, 12 warnings, 0 section mismatches

Warnings:
    arch/arm/boot/dts/aspeed-bmc-facebook-tiogapass.dts:435.11-439.4: Warning (i2c_bus_reg): /ahb/apb/bus@1e78a000/i2c-bus@140/ipmb0@10: I2C bus unit address format error, expected "40000010"
    arch/arm/boot/dts/aspeed-bmc-facebook-tiogapass.dts:437.3-30: Warning (i2c_bus_reg): /ahb/apb/bus@1e78a000/i2c-bus@140/ipmb0@10:reg: I2C address must be less than 10-bits, got "0x40000010"
    arch/arm/boot/dts/aspeed-bmc-facebook-tiogapass.dts:521.11-525.4: Warning (i2c_bus_reg): /ahb/apb/bus@1e78a000/i2c-bus@380/ipmb0@10: I2C bus unit address format error, expected "40000010"
    arch/arm/boot/dts/aspeed-bmc-facebook-tiogapass.dts:523.3-30: Warning (i2c_bus_reg): /ahb/apb/bus@1e78a000/i2c-bus@380/ipmb0@10:reg: I2C address must be less than 10-bits, got "0x40000010"
    arch/arm/boot/dts/aspeed-bmc-facebook-yosemitev2.dts:126.11-130.4: Warning (i2c_bus_reg): /ahb/apb/bus@1e78a000/i2c-bus@80/ipmb1@10: I2C bus unit address format error, expected "40000010"
    arch/arm/boot/dts/aspeed-bmc-facebook-yosemitev2.dts:128.3-30: Warning (i2c_bus_reg): /ahb/apb/bus@1e78a000/i2c-bus@80/ipmb1@10:reg: I2C address must be less than 10-bits, got "0x40000010"
    arch/arm/boot/dts/aspeed-bmc-facebook-yosemitev2.dts:137.11-141.4: Warning (i2c_bus_reg): /ahb/apb/bus@1e78a000/i2c-bus@100/ipmb3@10: I2C bus unit address format error, expected "40000010"
    arch/arm/boot/dts/aspeed-bmc-facebook-yosemitev2.dts:139.3-30: Warning (i2c_bus_reg): /ahb/apb/bus@1e78a000/i2c-bus@100/ipmb3@10:reg: I2C address must be less than 10-bits, got "0x40000010"
    arch/arm/boot/dts/aspeed-bmc-facebook-yosemitev2.dts:148.11-152.4: Warning (i2c_bus_reg): /ahb/apb/bus@1e78a000/i2c-bus@180/ipmb5@10: I2C bus unit address format error, expected "40000010"
    arch/arm/boot/dts/aspeed-bmc-facebook-yosemitev2.dts:150.3-30: Warning (i2c_bus_reg): /ahb/apb/bus@1e78a000/i2c-bus@180/ipmb5@10:reg: I2C address must be less than 10-bits, got "0x40000010"
    arch/arm/boot/dts/aspeed-bmc-facebook-yosemitev2.dts:159.11-163.4: Warning (i2c_bus_reg): /ahb/apb/bus@1e78a000/i2c-bus@300/ipmb7@10: I2C bus unit address format error, expected "40000010"
    arch/arm/boot/dts/aspeed-bmc-facebook-yosemitev2.dts:161.3-30: Warning (i2c_bus_reg): /ahb/apb/bus@1e78a000/i2c-bus@300/ipmb7@10:reg: I2C address must be less than 10-bits, got "0x40000010"

--------------------------------------------------------------------------------
multi_v7_defconfig+CONFIG_CPU_BIG_ENDIAN=y (arm, gcc-8) — PASS, 0 errors, 12 warnings, 0 section mismatches

Warnings:
    arch/arm/boot/dts/aspeed-bmc-facebook-tiogapass.dts:435.11-439.4: Warning (i2c_bus_reg): /ahb/apb/bus@1e78a000/i2c-bus@140/ipmb0@10: I2C bus unit address format error, expected "40000010"
    arch/arm/boot/dts/aspeed-bmc-facebook-tiogapass.dts:437.3-30: Warning (i2c_bus_reg): /ahb/apb/bus@1e78a000/i2c-bus@140/ipmb0@10:reg: I2C address must be less than 10-bits, got "0x40000010"
    arch/arm/boot/dts/aspeed-bmc-facebook-tiogapass.dts:521.11-525.4: Warning (i2c_bus_reg): /ahb/apb/bus@1e78a000/i2c-bus@380/ipmb0@10: I2C bus unit address format error, expected "40000010"
    arch/arm/boot/dts/aspeed-bmc-facebook-tiogapass.dts:523.3-30: Warning (i2c_bus_reg): /ahb/apb/bus@1e78a000/i2c-bus@380/ipmb0@10:reg: I2C address must be less than 10-bits, got "0x40000010"
    arch/arm/boot/dts/aspeed-bmc-facebook-yosemitev2.dts:126.11-130.4: Warning (i2c_bus_reg): /ahb/apb/bus@1e78a000/i2c-bus@80/ipmb1@10: I2C bus unit address format error, expected "40000010"
    arch/arm/boot/dts/aspeed-bmc-facebook-yosemitev2.dts:128.3-30: Warning (i2c_bus_reg): /ahb/apb/bus@1e78a000/i2c-bus@80/ipmb1@10:reg: I2C address must be less than 10-bits, got "0x40000010"
    arch/arm/boot/dts/aspeed-bmc-facebook-yosemitev2.dts:137.11-141.4: Warning (i2c_bus_reg): /ahb/apb/bus@1e78a000/i2c-bus@100/ipmb3@10: I2C bus unit address format error, expected "40000010"
    arch/arm/boot/dts/aspeed-bmc-facebook-yosemitev2.dts:139.3-30: Warning (i2c_bus_reg): /ahb/apb/bus@1e78a000/i2c-bus@100/ipmb3@10:reg: I2C address must be less than 10-bits, got "0x40000010"
    arch/arm/boot/dts/aspeed-bmc-facebook-yosemitev2.dts:148.11-152.4: Warning (i2c_bus_reg): /ahb/apb/bus@1e78a000/i2c-bus@180/ipmb5@10: I2C bus unit address format error, expected "40000010"
    arch/arm/boot/dts/aspeed-bmc-facebook-yosemitev2.dts:150.3-30: Warning (i2c_bus_reg): /ahb/apb/bus@1e78a000/i2c-bus@180/ipmb5@10:reg: I2C address must be less than 10-bits, got "0x40000010"
    arch/arm/boot/dts/aspeed-bmc-facebook-yosemitev2.dts:159.11-163.4: Warning (i2c_bus_reg): /ahb/apb/bus@1e78a000/i2c-bus@300/ipmb7@10: I2C bus unit address format error, expected "40000010"
    arch/arm/boot/dts/aspeed-bmc-facebook-yosemitev2.dts:161.3-30: Warning (i2c_bus_reg): /ahb/apb/bus@1e78a000/i2c-bus@300/ipmb7@10:reg: I2C address must be less than 10-bits, got "0x40000010"

--------------------------------------------------------------------------------
multi_v7_defconfig+CONFIG_EFI=y+CONFIG_ARM_LPAE=y (arm, gcc-8) — PASS, 0 errors, 12 warnings, 0 section mismatches

Warnings:
    arch/arm/boot/dts/aspeed-bmc-facebook-tiogapass.dts:435.11-439.4: Warning (i2c_bus_reg): /ahb/apb/bus@1e78a000/i2c-bus@140/ipmb0@10: I2C bus unit address format error, expected "40000010"
    arch/arm/boot/dts/aspeed-bmc-facebook-tiogapass.dts:437.3-30: Warning (i2c_bus_reg): /ahb/apb/bus@1e78a000/i2c-bus@140/ipmb0@10:reg: I2C address must be less than 10-bits, got "0x40000010"
    arch/arm/boot/dts/aspeed-bmc-facebook-tiogapass.dts:521.11-525.4: Warning (i2c_bus_reg): /ahb/apb/bus@1e78a000/i2c-bus@380/ipmb0@10: I2C bus unit address format error, expected "40000010"
    arch/arm/boot/dts/aspeed-bmc-facebook-tiogapass.dts:523.3-30: Warning (i2c_bus_reg): /ahb/apb/bus@1e78a000/i2c-bus@380/ipmb0@10:reg: I2C address must be less than 10-bits, got "0x40000010"
    arch/arm/boot/dts/aspeed-bmc-facebook-yosemitev2.dts:126.11-130.4: Warning (i2c_bus_reg): /ahb/apb/bus@1e78a000/i2c-bus@80/ipmb1@10: I2C bus unit address format error, expected "40000010"
    arch/arm/boot/dts/aspeed-bmc-facebook-yosemitev2.dts:128.3-30: Warning (i2c_bus_reg): /ahb/apb/bus@1e78a000/i2c-bus@80/ipmb1@10:reg: I2C address must be less than 10-bits, got "0x40000010"
    arch/arm/boot/dts/aspeed-bmc-facebook-yosemitev2.dts:137.11-141.4: Warning (i2c_bus_reg): /ahb/apb/bus@1e78a000/i2c-bus@100/ipmb3@10: I2C bus unit address format error, expected "40000010"
    arch/arm/boot/dts/aspeed-bmc-facebook-yosemitev2.dts:139.3-30: Warning (i2c_bus_reg): /ahb/apb/bus@1e78a000/i2c-bus@100/ipmb3@10:reg: I2C address must be less than 10-bits, got "0x40000010"
    arch/arm/boot/dts/aspeed-bmc-facebook-yosemitev2.dts:148.11-152.4: Warning (i2c_bus_reg): /ahb/apb/bus@1e78a000/i2c-bus@180/ipmb5@10: I2C bus unit address format error, expected "40000010"
    arch/arm/boot/dts/aspeed-bmc-facebook-yosemitev2.dts:150.3-30: Warning (i2c_bus_reg): /ahb/apb/bus@1e78a000/i2c-bus@180/ipmb5@10:reg: I2C address must be less than 10-bits, got "0x40000010"
    arch/arm/boot/dts/aspeed-bmc-facebook-yosemitev2.dts:159.11-163.4: Warning (i2c_bus_reg): /ahb/apb/bus@1e78a000/i2c-bus@300/ipmb7@10: I2C bus unit address format error, expected "40000010"
    arch/arm/boot/dts/aspeed-bmc-facebook-yosemitev2.dts:161.3-30: Warning (i2c_bus_reg): /ahb/apb/bus@1e78a000/i2c-bus@300/ipmb7@10:reg: I2C address must be less than 10-bits, got "0x40000010"

--------------------------------------------------------------------------------
multi_v7_defconfig+CONFIG_SMP=n (arm, gcc-8) — PASS, 0 errors, 12 warnings, 0 section mismatches

Warnings:
    arch/arm/boot/dts/aspeed-bmc-facebook-tiogapass.dts:435.11-439.4: Warning (i2c_bus_reg): /ahb/apb/bus@1e78a000/i2c-bus@140/ipmb0@10: I2C bus unit address format error, expected "40000010"
    arch/arm/boot/dts/aspeed-bmc-facebook-tiogapass.dts:437.3-30: Warning (i2c_bus_reg): /ahb/apb/bus@1e78a000/i2c-bus@140/ipmb0@10:reg: I2C address must be less than 10-bits, got "0x40000010"
    arch/arm/boot/dts/aspeed-bmc-facebook-tiogapass.dts:521.11-525.4: Warning (i2c_bus_reg): /ahb/apb/bus@1e78a000/i2c-bus@380/ipmb0@10: I2C bus unit address format error, expected "40000010"
    arch/arm/boot/dts/aspeed-bmc-facebook-tiogapass.dts:523.3-30: Warning (i2c_bus_reg): /ahb/apb/bus@1e78a000/i2c-bus@380/ipmb0@10:reg: I2C address must be less than 10-bits, got "0x40000010"
    arch/arm/boot/dts/aspeed-bmc-facebook-yosemitev2.dts:126.11-130.4: Warning (i2c_bus_reg): /ahb/apb/bus@1e78a000/i2c-bus@80/ipmb1@10: I2C bus unit address format error, expected "40000010"
    arch/arm/boot/dts/aspeed-bmc-facebook-yosemitev2.dts:128.3-30: Warning (i2c_bus_reg): /ahb/apb/bus@1e78a000/i2c-bus@80/ipmb1@10:reg: I2C address must be less than 10-bits, got "0x40000010"
    arch/arm/boot/dts/aspeed-bmc-facebook-yosemitev2.dts:137.11-141.4: Warning (i2c_bus_reg): /ahb/apb/bus@1e78a000/i2c-bus@100/ipmb3@10: I2C bus unit address format error, expected "40000010"
    arch/arm/boot/dts/aspeed-bmc-facebook-yosemitev2.dts:139.3-30: Warning (i2c_bus_reg): /ahb/apb/bus@1e78a000/i2c-bus@100/ipmb3@10:reg: I2C address must be less than 10-bits, got "0x40000010"
    arch/arm/boot/dts/aspeed-bmc-facebook-yosemitev2.dts:148.11-152.4: Warning (i2c_bus_reg): /ahb/apb/bus@1e78a000/i2c-bus@180/ipmb5@10: I2C bus unit address format error, expected "40000010"
    arch/arm/boot/dts/aspeed-bmc-facebook-yosemitev2.dts:150.3-30: Warning (i2c_bus_reg): /ahb/apb/bus@1e78a000/i2c-bus@180/ipmb5@10:reg: I2C address must be less than 10-bits, got "0x40000010"
    arch/arm/boot/dts/aspeed-bmc-facebook-yosemitev2.dts:159.11-163.4: Warning (i2c_bus_reg): /ahb/apb/bus@1e78a000/i2c-bus@300/ipmb7@10: I2C bus unit address format error, expected "40000010"
    arch/arm/boot/dts/aspeed-bmc-facebook-yosemitev2.dts:161.3-30: Warning (i2c_bus_reg): /ahb/apb/bus@1e78a000/i2c-bus@300/ipmb7@10:reg: I2C address must be less than 10-bits, got "0x40000010"

--------------------------------------------------------------------------------
mvebu_v7_defconfig (arm, gcc-8) — PASS, 0 errors, 0 warnings, 0 section mismatches

--------------------------------------------------------------------------------
mxs_defconfig (arm, gcc-8) — PASS, 0 errors, 0 warnings, 0 section mismatches

--------------------------------------------------------------------------------
nlm_xlp_defconfig (mips, gcc-8) — PASS, 0 errors, 0 warnings, 0 section mismatches

--------------------------------------------------------------------------------
nommu_virt_defconfig (riscv, gcc-8) — PASS, 0 errors, 0 warnings, 0 section mismatches

--------------------------------------------------------------------------------
nsimosci_hs_smp_defconfig (arc, gcc-8) — PASS, 0 errors, 0 warnings, 0 section mismatches

--------------------------------------------------------------------------------
omega2p_defconfig (mips, gcc-8) — PASS, 0 errors, 0 warnings, 0 section mismatches

--------------------------------------------------------------------------------
orion5x_defconfig (arm, gcc-8) — PASS, 0 errors, 0 warnings, 0 section mismatches

--------------------------------------------------------------------------------
palmz72_defconfig (arm, gcc-8) — PASS, 0 errors, 0 warnings, 0 section mismatches

--------------------------------------------------------------------------------
pcm027_defconfig (arm, gcc-8) — PASS, 0 errors, 0 warnings, 0 section mismatches

--------------------------------------------------------------------------------
pistachio_defconfig (mips, gcc-8) — PASS, 0 errors, 0 warnings, 0 section mismatches

--------------------------------------------------------------------------------
pnx8335_stb225_defconfig (mips, gcc-8) — PASS, 0 errors, 0 warnings, 0 section mismatches

--------------------------------------------------------------------------------
prima2_defconfig (arm, gcc-8) — FAIL, 6 errors, 0 warnings, 0 section mismatches

Errors:
    fs/io_uring.c:5472:10: error: too many arguments to function ‘io_sendmsg’
    fs/io_uring.c:5474:10: error: too many arguments to function ‘io_send’
    fs/io_uring.c:5484:10: error: too many arguments to function ‘io_recvmsg’
    fs/io_uring.c:5486:10: error: too many arguments to function ‘io_recv’
    fs/io_uring.c:5510:9: error: too many arguments to function ‘io_accept’
    fs/io_uring.c:5518:9: error: too many arguments to function ‘io_connect’

--------------------------------------------------------------------------------
pxa168_defconfig (arm, gcc-8) — PASS, 0 errors, 0 warnings, 0 section mismatches

--------------------------------------------------------------------------------
pxa255-idp_defconfig (arm, gcc-8) — PASS, 0 errors, 0 warnings, 0 section mismatches

--------------------------------------------------------------------------------
pxa3xx_defconfig (arm, gcc-8) — PASS, 0 errors, 0 warnings, 0 section mismatches

--------------------------------------------------------------------------------
pxa910_defconfig (arm, gcc-8) — PASS, 0 errors, 0 warnings, 0 section mismatches

--------------------------------------------------------------------------------
pxa_defconfig (arm, gcc-8) — PASS, 0 errors, 0 warnings, 0 section mismatches

--------------------------------------------------------------------------------
qcom_defconfig (arm, gcc-8) — PASS, 0 errors, 0 warnings, 0 section mismatches

--------------------------------------------------------------------------------
rb532_defconfig (mips, gcc-8) — PASS, 0 errors, 0 warnings, 0 section mismatches

--------------------------------------------------------------------------------
rbtx49xx_defconfig (mips, gcc-8) — PASS, 0 errors, 0 warnings, 0 section mismatches

--------------------------------------------------------------------------------
rpc_defconfig (arm, gcc-8) — PASS, 0 errors, 0 warnings, 0 section mismatches

--------------------------------------------------------------------------------
rt305x_defconfig (mips, gcc-8) — PASS, 0 errors, 0 warnings, 0 section mismatches

--------------------------------------------------------------------------------
rv32_defconfig (riscv, gcc-8) — PASS, 0 errors, 6 warnings, 0 section mismatches

Warnings:
    <stdin>:830:2: warning: #warning syscall fstat64 not implemented [-Wcpp]
    <stdin>:1127:2: warning: #warning syscall fstatat64 not implemented [-Wcpp]
    <stdin>:1511:2: warning: #warning syscall clone3 not implemented [-Wcpp]
    <stdin>:830:2: warning: #warning syscall fstat64 not implemented [-Wcpp]
    <stdin>:1127:2: warning: #warning syscall fstatat64 not implemented [-Wcpp]
    <stdin>:1511:2: warning: #warning syscall clone3 not implemented [-Wcpp]

--------------------------------------------------------------------------------
s3c2410_defconfig (arm, gcc-8) — PASS, 0 errors, 0 warnings, 0 section mismatches

--------------------------------------------------------------------------------
s3c6400_defconfig (arm, gcc-8) — FAIL, 6 errors, 0 warnings, 0 section mismatches

Errors:
    fs/io_uring.c:5472:10: error: too many arguments to function ‘io_sendmsg’
    fs/io_uring.c:5474:10: error: too many arguments to function ‘io_send’
    fs/io_uring.c:5484:10: error: too many arguments to function ‘io_recvmsg’
    fs/io_uring.c:5486:10: error: too many arguments to function ‘io_recv’
    fs/io_uring.c:5510:9: error: too many arguments to function ‘io_accept’
    fs/io_uring.c:5518:9: error: too many arguments to function ‘io_connect’

--------------------------------------------------------------------------------
s5pv210_defconfig (arm, gcc-8) — PASS, 0 errors, 0 warnings, 0 section mismatches

--------------------------------------------------------------------------------
sama5_defconfig (arm, gcc-8) — PASS, 0 errors, 0 warnings, 0 section mismatches

--------------------------------------------------------------------------------
sb1250_swarm_defconfig (mips, gcc-8) — PASS, 0 errors, 0 warnings, 0 section mismatches

--------------------------------------------------------------------------------
shmobile_defconfig (arm, gcc-8) — PASS, 0 errors, 0 warnings, 0 section mismatches

--------------------------------------------------------------------------------
spear13xx_defconfig (arm, gcc-8) — PASS, 0 errors, 0 warnings, 0 section mismatches

--------------------------------------------------------------------------------
spear3xx_defconfig (arm, gcc-8) — FAIL, 2 errors, 0 warnings, 0 section mismatches

Errors:
    /home/buildslave/workspace/kernel-build/linux/build/../net/core/filter.c:9329: undefined reference to `tcp_prot'
    /home/buildslave/workspace/kernel-build/linux/build/../net/core/filter.c:9351: undefined reference to `tcp_prot'

--------------------------------------------------------------------------------
spear6xx_defconfig (arm, gcc-8) — FAIL, 2 errors, 0 warnings, 0 section mismatches

Errors:
    /mnt/resource/workspace/workspace/kernel-build@2/linux/build/../net/core/filter.c:9329: undefined reference to `tcp_prot'
    /mnt/resource/workspace/workspace/kernel-build@2/linux/build/../net/core/filter.c:9351: undefined reference to `tcp_prot'

--------------------------------------------------------------------------------
spitz_defconfig (arm, gcc-8) — PASS, 0 errors, 0 warnings, 0 section mismatches

--------------------------------------------------------------------------------
stm32_defconfig (arm, gcc-8) — FAIL, 6 errors, 0 warnings, 0 section mismatches

Errors:
    fs/io_uring.c:5472:10: error: too many arguments to function ‘io_sendmsg’
    fs/io_uring.c:5474:10: error: too many arguments to function ‘io_send’
    fs/io_uring.c:5484:10: error: too many arguments to function ‘io_recvmsg’
    fs/io_uring.c:5486:10: error: too many arguments to function ‘io_recv’
    fs/io_uring.c:5510:9: error: too many arguments to function ‘io_accept’
    fs/io_uring.c:5518:9: error: too many arguments to function ‘io_connect’

--------------------------------------------------------------------------------
sunxi_defconfig (arm, gcc-8) — PASS, 0 errors, 0 warnings, 0 section mismatches

--------------------------------------------------------------------------------
tango4_defconfig (arm, gcc-8) — PASS, 0 errors, 0 warnings, 0 section mismatches

--------------------------------------------------------------------------------
tb0287_defconfig (mips, gcc-8) — PASS, 0 errors, 0 warnings, 0 section mismatches

--------------------------------------------------------------------------------
tinyconfig (arm64, gcc-8) — PASS, 0 errors, 0 warnings, 0 section mismatches

--------------------------------------------------------------------------------
tinyconfig (mips, gcc-8) — PASS, 0 errors, 0 warnings, 0 section mismatches

--------------------------------------------------------------------------------
tinyconfig (i386, gcc-8) — PASS, 0 errors, 0 warnings, 0 section mismatches

--------------------------------------------------------------------------------
tinyconfig (arm, gcc-8) — PASS, 0 errors, 0 warnings, 0 section mismatches

--------------------------------------------------------------------------------
tinyconfig (arc, gcc-8) — PASS, 0 errors, 0 warnings, 0 section mismatches

--------------------------------------------------------------------------------
tinyconfig (riscv, gcc-8) — PASS, 0 errors, 0 warnings, 0 section mismatches

--------------------------------------------------------------------------------
tinyconfig (x86_64, gcc-8) — PASS, 0 errors, 1 warning, 0 section mismatches

Warnings:
    .config:1173:warning: override: UNWINDER_GUESS changes choice state

--------------------------------------------------------------------------------
trizeps4_defconfig (arm, gcc-8) — PASS, 0 errors, 0 warnings, 0 section mismatches

--------------------------------------------------------------------------------
u8500_defconfig (arm, gcc-8) — FAIL, 14 errors, 6 warnings, 0 section mismatches

Errors:
    include/linux/hashtable.h:27:25: error: expected declaration specifiers or ‘...’ before ‘(’ token
    include/linux/build_bug.h:16:51: error: negative width in bit-field ‘<anonymous>’
    drivers/crypto/ux500/hash/hash_core.c:1362:19: error: passing argument 1 of ‘__hash_init’ from incompatible pointer type [-Werror=incompatible-pointer-types]
    include/linux/hashtable.h:52:30: error: void value not ignored as it ought to be
    include/linux/build_bug.h:16:51: error: negative width in bit-field ‘<anonymous>’
    drivers/crypto/ux500/hash/hash_core.c:1375:19: error: passing argument 1 of ‘__hash_init’ from incompatible pointer type [-Werror=incompatible-pointer-types]
    include/linux/hashtable.h:52:30: error: void value not ignored as it ought to be
    include/linux/build_bug.h:16:51: error: negative width in bit-field ‘<anonymous>’
    drivers/crypto/ux500/hash/hash_core.c:1428:19: error: passing argument 1 of ‘__hash_init’ from incompatible pointer type [-Werror=incompatible-pointer-types]
    include/linux/hashtable.h:52:30: error: void value not ignored as it ought to be
    include/linux/build_bug.h:16:51: error: negative width in bit-field ‘<anonymous>’
    drivers/crypto/ux500/hash/hash_core.c:1441:19: error: passing argument 1 of ‘__hash_init’ from incompatible pointer type [-Werror=incompatible-pointer-types]
    include/linux/hashtable.h:52:30: error: void value not ignored as it ought to be
    drivers/crypto/ux500/hash/hash_core.c:1518:12: error: ‘hash_init’ undeclared here (not in a function); did you mean ‘sha1_init’?

Warnings:
    include/linux/kernel.h:47:38: warning: division ‘sizeof (struct ahash_request *) / sizeof (struct ahash_request)’ does not compute the number of array elements [-Wsizeof-pointer-div]
    include/linux/kernel.h:47:38: warning: division ‘sizeof (struct ahash_request *) / sizeof (struct ahash_request)’ does not compute the number of array elements [-Wsizeof-pointer-div]
    include/linux/kernel.h:47:38: warning: division ‘sizeof (struct ahash_request *) / sizeof (struct ahash_request)’ does not compute the number of array elements [-Wsizeof-pointer-div]
    include/linux/kernel.h:47:38: warning: division ‘sizeof (struct ahash_request *) / sizeof (struct ahash_request)’ does not compute the number of array elements [-Wsizeof-pointer-div]
    drivers/crypto/ux500/hash/hash_core.c:531:13: warning: ‘hash_dma_valid_data’ defined but not used [-Wunused-function]
    cc1: some warnings being treated as errors

--------------------------------------------------------------------------------
versatile_defconfig (arm, gcc-8) — PASS, 0 errors, 0 warnings, 0 section mismatches

--------------------------------------------------------------------------------
vexpress_defconfig (arm, gcc-8) — PASS, 0 errors, 0 warnings, 0 section mismatches

--------------------------------------------------------------------------------
vf610m4_defconfig (arm, gcc-8) — FAIL, 6 errors, 0 warnings, 0 section mismatches

Errors:
    fs/io_uring.c:5472:10: error: too many arguments to function ‘io_sendmsg’
    fs/io_uring.c:5474:10: error: too many arguments to function ‘io_send’
    fs/io_uring.c:5484:10: error: too many arguments to function ‘io_recvmsg’
    fs/io_uring.c:5486:10: error: too many arguments to function ‘io_recv’
    fs/io_uring.c:5510:9: error: too many arguments to function ‘io_accept’
    fs/io_uring.c:5518:9: error: too many arguments to function ‘io_connect’

--------------------------------------------------------------------------------
viper_defconfig (arm, gcc-8) — PASS, 0 errors, 0 warnings, 0 section mismatches

--------------------------------------------------------------------------------
workpad_defconfig (mips, gcc-8) — PASS, 0 errors, 0 warnings, 0 section mismatches

--------------------------------------------------------------------------------
x86_64_defconfig (x86_64, gcc-8) — PASS, 0 errors, 0 warnings, 0 section mismatches

--------------------------------------------------------------------------------
x86_64_defconfig+kvm_guest (x86_64, gcc-8) — PASS, 0 errors, 0 warnings, 0 section mismatches

--------------------------------------------------------------------------------
xcep_defconfig (arm, gcc-8) — PASS, 0 errors, 0 warnings, 0 section mismatches

---
For more info write to <info@kernelci.org>

^ permalink raw reply	[flat|nested] 2+ messages in thread

* Re: next/master build: 147 builds: 21 failed, 126 passed, 102 errors, 149 warnings (next-20200626)
  2020-06-26 14:32 next/master build: 147 builds: 21 failed, 126 passed, 102 errors, 149 warnings (next-20200626) kernelci.org bot
@ 2020-06-26 16:08 ` Mark Brown
  0 siblings, 0 replies; 2+ messages in thread
From: Mark Brown @ 2020-06-26 16:08 UTC (permalink / raw)
  To: Oscar Salvador, Naoya Horiguchi, Andrew Morton, Stephen Rothwell
  Cc: linux-next, linux-arm-kernel


[-- Attachment #1: Type: text/plain, Size: 1133 bytes --]

On Fri, Jun 26, 2020 at 07:32:14AM -0700, kernelci.org bot wrote:

Today's -next fails to build on arm64 in a number of configurations:

> arm64:
>     defconfig: (clang-10) FAIL
>     defconfig: (clang-9) FAIL
>     defconfig: (gcc-8) FAIL
>     defconfig+CONFIG_CPU_BIG_ENDIAN=y: (gcc-8) FAIL
>     defconfig+CONFIG_RANDOMIZE_BASE=y: (gcc-8) FAIL
>     defconfig+kselftest: (gcc-8) FAIL

Due to:

> defconfig (arm64, clang-9) — FAIL, 3 errors, 0 warnings, 0 section mismatches
> 
> Errors:
>     mm/memory-failure.c:1827:3: error: implicit declaration of function 'page_handle_poison' [-Werror,-Wimplicit-function-declaration]
>     mm/memory-failure.c:1837:9: error: implicit declaration of function 'page_handle_poison' [-Werror,-Wimplicit-function-declaration]
>     mm/memory-failure.c:1870:7: error: implicit declaration of function 'page_handle_poison' [-Werror,-Wimplicit-function-declaration]

which looks like it was introduced by baed01e5fe3096f29e (mm,hwpoison:
rework soft offline for free pages), reverting that (and some of the
subsequent commits in the same series) fixes the build for me.

[-- Attachment #2: signature.asc --]
[-- Type: application/pgp-signature, Size: 488 bytes --]

^ permalink raw reply	[flat|nested] 2+ messages in thread

end of thread, back to index

Thread overview: 2+ messages (download: mbox.gz / follow: Atom feed)
-- links below jump to the message on this page --
2020-06-26 14:32 next/master build: 147 builds: 21 failed, 126 passed, 102 errors, 149 warnings (next-20200626) kernelci.org bot
2020-06-26 16:08 ` Mark Brown

Linux-Next Archive on lore.kernel.org

Archives are clonable:
	git clone --mirror https://lore.kernel.org/linux-next/0 linux-next/git/0.git

	# If you have public-inbox 1.1+ installed, you may
	# initialize and index your mirror using the following commands:
	public-inbox-init -V2 linux-next linux-next/ https://lore.kernel.org/linux-next \
		linux-next@vger.kernel.org
	public-inbox-index linux-next

Example config snippet for mirrors

Newsgroup available over NNTP:
	nntp://nntp.lore.kernel.org/org.kernel.vger.linux-next


AGPL code for this site: git clone https://public-inbox.org/public-inbox.git