Linux-Next Archive on lore.kernel.org
 help / color / Atom feed
* next/master build: 218 builds: 17 failed, 201 passed, 10 errors, 351 warnings (next-20190902)
@ 2019-09-02 15:53 kernelci.org bot
  0 siblings, 0 replies; only message in thread
From: kernelci.org bot @ 2019-09-02 15:53 UTC (permalink / raw)
  To: linux-next

next/master build: 218 builds: 17 failed, 201 passed, 10 errors, 351 warnings (next-20190902)

Full Build Summary: https://kernelci.org/build/next/branch/master/kernel/next-20190902/

Tree: next
Branch: master
Git Describe: next-20190902
Git Commit: b5f466091e130caaf0735976648f72bd5e09aa84
Git URL: git://git.kernel.org/pub/scm/linux/kernel/git/next/linux-next.git
Built: 7 unique architectures

Build Failures Detected:

arc:
    nsim_hs_defconfig+kselftest: (gcc-8) FAIL

arm64:
    allmodconfig: (clang-8) FAIL
    allmodconfig: (gcc-8) FAIL
    defconfig+CONFIG_CPU_BIG_ENDIAN=y: (gcc-8) FAIL
    defconfig+kselftest: (gcc-8) FAIL

arm:
    allmodconfig: (gcc-8) FAIL
    multi_v7_defconfig+CONFIG_CPU_BIG_ENDIAN=y: (gcc-8) FAIL
    multi_v7_defconfig+CONFIG_EFI=y+CONFIG_ARM_LPAE=y: (gcc-8) FAIL
    multi_v7_defconfig+CONFIG_SMP=n: (gcc-8) FAIL
    multi_v7_defconfig+kselftest: (gcc-8) FAIL

i386:
    i386_defconfig+kselftest: (gcc-8) FAIL

mips:
    32r2el_defconfig+kselftest: (gcc-8) FAIL
    cavium_octeon_defconfig: (gcc-8) FAIL
    msp71xx_defconfig: (gcc-8) FAIL

riscv:
    defconfig+kselftest: (gcc-8) FAIL

x86_64:
    allmodconfig: (gcc-8) FAIL
    x86_64_defconfig+kselftest: (gcc-8) FAIL

Errors and Warnings Detected:

arc:
    allnoconfig (gcc-8): 1 warning
    axs103_defconfig (gcc-8): 2 warnings
    axs103_smp_defconfig (gcc-8): 2 warnings
    haps_hs_defconfig (gcc-8): 2 warnings
    haps_hs_smp_defconfig (gcc-8): 2 warnings
    hsdk_defconfig (gcc-8): 2 warnings
    nsim_hs_defconfig (gcc-8): 2 warnings
    nsim_hs_smp_defconfig (gcc-8): 2 warnings
    nsimosci_hs_defconfig (gcc-8): 2 warnings
    nsimosci_hs_smp_defconfig (gcc-8): 2 warnings
    tinyconfig (gcc-8): 1 warning
    vdk_hs38_defconfig (gcc-8): 1 warning
    vdk_hs38_smp_defconfig (gcc-8): 1 warning

arm64:
    allmodconfig (clang-8): 1 error, 9 warnings
    allmodconfig (gcc-8): 1 error
    defconfig (gcc-8): 2 warnings
    defconfig (clang-8): 2 warnings
    defconfig (gcc-8): 2 warnings

arm:
    allmodconfig (gcc-8): 1 error
    am200epdkit_defconfig (gcc-8): 2 warnings
    assabet_defconfig (gcc-8): 1 warning
    at91_dt_defconfig (gcc-8): 2 warnings
    axm55xx_defconfig (gcc-8): 2 warnings
    cm_x2xx_defconfig (gcc-8): 2 warnings
    cm_x300_defconfig (gcc-8): 2 warnings
    cns3420vb_defconfig (gcc-8): 2 warnings
    colibri_pxa270_defconfig (gcc-8): 2 warnings
    colibri_pxa300_defconfig (gcc-8): 2 warnings
    collie_defconfig (gcc-8): 1 warning
    davinci_all_defconfig (gcc-8): 2 warnings
    dove_defconfig (gcc-8): 2 warnings
    em_x270_defconfig (gcc-8): 2 warnings
    ep93xx_defconfig (gcc-8): 2 warnings
    eseries_pxa_defconfig (gcc-8): 2 warnings
    exynos_defconfig (gcc-8): 2 warnings
    ezx_defconfig (gcc-8): 2 warnings
    h3600_defconfig (gcc-8): 1 warning
    h5000_defconfig (gcc-8): 2 warnings
    imote2_defconfig (gcc-8): 2 warnings
    imx_v4_v5_defconfig (gcc-8): 2 warnings
    imx_v6_v7_defconfig (gcc-8): 2 warnings
    integrator_defconfig (gcc-8): 2 warnings
    ixp4xx_defconfig (gcc-8): 2 warnings
    keystone_defconfig (gcc-8): 2 warnings
    lpc32xx_defconfig (gcc-8): 2 warnings
    magician_defconfig (gcc-8): 2 warnings
    milbeaut_m10v_defconfig (gcc-8): 2 warnings
    mini2440_defconfig (gcc-8): 2 warnings
    mmp2_defconfig (gcc-8): 2 warnings
    multi_v5_defconfig (gcc-8): 2 warnings
    multi_v7_defconfig (gcc-8): 2 warnings
    mv78xx0_defconfig (gcc-8): 2 warnings
    mvebu_v5_defconfig (gcc-8): 2 warnings
    mvebu_v7_defconfig (gcc-8): 2 warnings
    mxs_defconfig (gcc-8): 2 warnings
    neponset_defconfig (gcc-8): 1 warning
    nhk8815_defconfig (gcc-8): 2 warnings
    omap1_defconfig (gcc-8): 2 warnings
    omap2plus_defconfig (gcc-8): 2 warnings
    orion5x_defconfig (gcc-8): 2 warnings
    oxnas_v6_defconfig (gcc-8): 2 warnings
    palmz72_defconfig (gcc-8): 2 warnings
    pcm027_defconfig (gcc-8): 2 warnings
    prima2_defconfig (gcc-8): 2 warnings
    pxa168_defconfig (gcc-8): 2 warnings
    pxa3xx_defconfig (gcc-8): 2 warnings
    pxa910_defconfig (gcc-8): 2 warnings
    qcom_defconfig (gcc-8): 2 warnings
    realview_defconfig (gcc-8): 2 warnings
    s3c6400_defconfig (gcc-8): 2 warnings
    s5pv210_defconfig (gcc-8): 2 warnings
    sama5_defconfig (gcc-8): 2 warnings
    shannon_defconfig (gcc-8): 1 warning
    spear13xx_defconfig (gcc-8): 2 warnings
    sunxi_defconfig (gcc-8): 2 warnings
    tango4_defconfig (gcc-8): 2 warnings
    tegra_defconfig (gcc-8): 2 warnings
    trizeps4_defconfig (gcc-8): 2 warnings
    u300_defconfig (gcc-8): 2 warnings
    u8500_defconfig (gcc-8): 2 warnings
    versatile_defconfig (gcc-8): 2 warnings
    vexpress_defconfig (gcc-8): 2 warnings
    viper_defconfig (gcc-8): 2 warnings
    xcep_defconfig (gcc-8): 2 warnings
    zeus_defconfig (gcc-8): 2 warnings

i386:

mips:
    32r2el_defconfig (gcc-8): 3 warnings
    allnoconfig (gcc-8): 1 warning
    ar7_defconfig (gcc-8): 2 warnings
    ath25_defconfig (gcc-8): 2 warnings
    ath79_defconfig (gcc-8): 2 warnings
    bcm47xx_defconfig (gcc-8): 2 warnings
    bcm63xx_defconfig (gcc-8): 1 warning
    bigsur_defconfig (gcc-8): 6 warnings
    bmips_be_defconfig (gcc-8): 1 warning
    bmips_stb_defconfig (gcc-8): 1 warning
    capcella_defconfig (gcc-8): 2 warnings
    cavium_octeon_defconfig (gcc-8): 2 errors, 4 warnings
    ci20_defconfig (gcc-8): 1 warning
    cobalt_defconfig (gcc-8): 2 warnings
    db1xxx_defconfig (gcc-8): 2 warnings
    decstation_64_defconfig (gcc-8): 8 warnings
    decstation_defconfig (gcc-8): 4 warnings
    decstation_r4k_defconfig (gcc-8): 4 warnings
    e55_defconfig (gcc-8): 2 warnings
    fuloong2e_defconfig (gcc-8): 6 warnings
    gcw0_defconfig (gcc-8): 1 warning
    gpr_defconfig (gcc-8): 2 warnings
    ip22_defconfig (gcc-8): 2 warnings
    ip27_defconfig (gcc-8): 6 warnings
    ip28_defconfig (gcc-8): 6 warnings
    ip32_defconfig (gcc-8): 7 warnings
    jazz_defconfig (gcc-8): 3 warnings
    jmr3927_defconfig (gcc-8): 1 warning
    lasat_defconfig (gcc-8): 1 warning
    lemote2f_defconfig (gcc-8): 6 warnings
    loongson1b_defconfig (gcc-8): 2 warnings
    loongson1c_defconfig (gcc-8): 2 warnings
    loongson3_defconfig (gcc-8): 6 warnings
    malta_defconfig (gcc-8): 2 warnings
    malta_kvm_defconfig (gcc-8): 2 warnings
    malta_kvm_guest_defconfig (gcc-8): 2 warnings
    malta_qemu_32r6_defconfig (gcc-8): 3 warnings
    maltaaprp_defconfig (gcc-8): 2 warnings
    maltasmvp_defconfig (gcc-8): 2 warnings
    maltasmvp_eva_defconfig (gcc-8): 2 warnings
    maltaup_defconfig (gcc-8): 2 warnings
    maltaup_xpa_defconfig (gcc-8): 2 warnings
    markeins_defconfig (gcc-8): 2 warnings
    mips_paravirt_defconfig (gcc-8): 6 warnings
    mpc30x_defconfig (gcc-8): 2 warnings
    msp71xx_defconfig (gcc-8): 4 errors, 2 warnings
    mtx1_defconfig (gcc-8): 2 warnings
    nlm_xlp_defconfig (gcc-8): 6 warnings
    nlm_xlr_defconfig (gcc-8): 3 warnings
    omega2p_defconfig (gcc-8): 1 warning
    pic32mzda_defconfig (gcc-8): 2 warnings
    pistachio_defconfig (gcc-8): 2 warnings
    pnx8335_stb225_defconfig (gcc-8): 2 warnings
    qi_lb60_defconfig (gcc-8): 2 warnings
    rb532_defconfig (gcc-8): 2 warnings
    rbtx49xx_defconfig (gcc-8): 2 warnings
    rm200_defconfig (gcc-8): 3 warnings
    rt305x_defconfig (gcc-8): 2 warnings
    sb1250_swarm_defconfig (gcc-8): 4 warnings
    tb0219_defconfig (gcc-8): 2 warnings
    tb0226_defconfig (gcc-8): 2 warnings
    tb0287_defconfig (gcc-8): 2 warnings
    tinyconfig (gcc-8): 1 warning
    vocore2_defconfig (gcc-8): 1 warning
    workpad_defconfig (gcc-8): 2 warnings
    xway_defconfig (gcc-8): 2 warnings

riscv:
    rv32_defconfig (gcc-8): 6 warnings

x86_64:
    allmodconfig (gcc-8): 1 error, 3 warnings
    tinyconfig (gcc-8): 1 warning

Errors summary:

    3    collect2: error: ld returned 1 exit status
    1    clang: error: linker command failed with exit code 1 (use -v to see invocation)
    1    arch/mips/pmcs-msp71xx/msp_prom.c:65:20: error: 'prom_mem_size' defined but not used [-Werror=unused-variable]
    1    arch/mips/pmcs-msp71xx/msp_prom.c:64:34: error: 'MAX_PROM_MEM' undeclared here (not in a function); did you mean 'DEV_PROP_MAX'?
    1    arch/mips/pmcs-msp71xx/msp_prom.c:64:20: error: 'prom_mem_base' defined but not used [-Werror=unused-variable]
    1    arch/mips/pmcs-msp71xx/msp_prom.c:380:16: error: unused variable 'addr' [-Werror=unused-variable]
    1    arch/mips/include/asm/octeon/cvmx-ipd.h:331:36: error: 'CVMX_PIP_SFT_RST' undeclared (first use in this function); did you mean 'CVMX_CIU_SOFT_RST'?
    1    arch/mips/include/asm/octeon/cvmx-ipd.h:330:27: error: storage size of 'pip_sft_rst' isn't known

Warnings summary:

    187  <stdin>:1511:2: warning: #warning syscall clone3 not implemented [-Wcpp]
    122  WARNING: "return_address" [vmlinux] is a static EXPORT_SYMBOL_GPL
    6    WARNING: "LZ4HC_setExternalDict" [lib/lz4/lz4hc_compress] is a static EXPORT_SYMBOL
    6    WARNING: "HYPERVISOR_platform_op" [vmlinux] is a static EXPORT_SYMBOL_GPL
    5    drivers/video/fbdev/sa1100fb.c:975:21: warning: 'sa1100fb_min_dma_period' defined but not used [-Wunused-function]
    3    arch/mips/fw/arc/memory.c:163:16: warning: unused variable 'addr' [-Wunused-variable]
    3    1 warning generated.
    2    <stdin>:830:2: warning: #warning syscall fstat64 not implemented [-Wcpp]
    2    <stdin>:1127:2: warning: #warning syscall fstatat64 not implemented [-Wcpp]
    1    {standard input}:134: Warning: macro instruction expanded into multiple instructions
    1    mm/shmem.c:2734:35: warning: variable 'shmem_falloc_waitq' is uninitialized when used within its own initialization [-Wuninitialized]
    1    include/linux/kern_levels.h:5:18: warning: format '%lu' expects argument of type 'long unsigned int', but argument 8 has type 'unsigned int' [-Wformat=]
    1    fs/proc/proc_sysctl.c:705:35: warning: variable 'wq' is uninitialized when used within its own initialization [-Wuninitialized]
    1    fs/proc/base.c:1894:35: warning: variable 'wq' is uninitialized when used within its own initialization [-Wuninitialized]
    1    fs/namei.c:3130:34: warning: variable 'wq' is uninitialized when used within its own initialization [-Wuninitialized]
    1    fs/namei.c:1642:34: warning: variable 'wq' is uninitialized when used within its own initialization [-Wuninitialized]
    1    drivers/usb/gadget/udc/lpc32xx_udc.c:1255:11: warning: cast from pointer to integer of different size [-Wpointer-to-int-cast]
    1    drivers/usb/gadget/udc/lpc32xx_udc.c:1154:11: warning: cast from pointer to integer of different size [-Wpointer-to-int-cast]
    1    drivers/mtd/nand/raw/au1550nd.c:443:57: warning: pointer type mismatch in conditional expression
    1    drivers/dma/iop-adma.c:118:12: warning: format '%x' expects argument of type 'unsigned int', but argument 6 has type 'dma_addr_t' {aka 'long long unsigned int'} [-Wformat=]
    1    cc1: all warnings being treated as errors
    1    arch/mips/include/asm/octeon/cvmx-ipd.h:330:27: warning: unused variable 'pip_sft_rst' [-Wunused-variable]
    1    2 warnings generated.
    1    .config:1178:warning: override: UNWINDER_GUESS changes choice state

================================================================================

Detailed per-defconfig build reports:

--------------------------------------------------------------------------------
32r2el_defconfig (mips, gcc-8) — PASS, 0 errors, 3 warnings, 0 section mismatches

Warnings:
    <stdin>:1511:2: warning: #warning syscall clone3 not implemented [-Wcpp]
    <stdin>:1511:2: warning: #warning syscall clone3 not implemented [-Wcpp]
    <stdin>:1511:2: warning: #warning syscall clone3 not implemented [-Wcpp]

--------------------------------------------------------------------------------
32r2el_defconfig+kselftest (mips, gcc-8) — FAIL, 0 errors, 0 warnings, 0 section mismatches

--------------------------------------------------------------------------------
allmodconfig (arm64, clang-8) — FAIL, 1 error, 9 warnings, 0 section mismatches

Errors:
    clang: error: linker command failed with exit code 1 (use -v to see invocation)

Warnings:
    mm/shmem.c:2734:35: warning: variable 'shmem_falloc_waitq' is uninitialized when used within its own initialization [-Wuninitialized]
    1 warning generated.
    fs/proc/base.c:1894:35: warning: variable 'wq' is uninitialized when used within its own initialization [-Wuninitialized]
    1 warning generated.
    fs/proc/proc_sysctl.c:705:35: warning: variable 'wq' is uninitialized when used within its own initialization [-Wuninitialized]
    1 warning generated.
    fs/namei.c:1642:34: warning: variable 'wq' is uninitialized when used within its own initialization [-Wuninitialized]
    fs/namei.c:3130:34: warning: variable 'wq' is uninitialized when used within its own initialization [-Wuninitialized]
    2 warnings generated.

--------------------------------------------------------------------------------
allmodconfig (arm64, gcc-8) — FAIL, 1 error, 0 warnings, 0 section mismatches

Errors:
    collect2: error: ld returned 1 exit status

--------------------------------------------------------------------------------
allmodconfig (arm, gcc-8) — FAIL, 1 error, 0 warnings, 0 section mismatches

Errors:
    collect2: error: ld returned 1 exit status

--------------------------------------------------------------------------------
allmodconfig (x86_64, gcc-8) — FAIL, 1 error, 3 warnings, 0 section mismatches

Errors:
    collect2: error: ld returned 1 exit status

Warnings:
    drivers/dma/iop-adma.c:118:12: warning: format '%x' expects argument of type 'unsigned int', but argument 6 has type 'dma_addr_t' {aka 'long long unsigned int'} [-Wformat=]
    drivers/usb/gadget/udc/lpc32xx_udc.c:1154:11: warning: cast from pointer to integer of different size [-Wpointer-to-int-cast]
    drivers/usb/gadget/udc/lpc32xx_udc.c:1255:11: warning: cast from pointer to integer of different size [-Wpointer-to-int-cast]

--------------------------------------------------------------------------------
allnoconfig (arc, gcc-8) — PASS, 0 errors, 1 warning, 0 section mismatches

Warnings:
    <stdin>:1511:2: warning: #warning syscall clone3 not implemented [-Wcpp]

--------------------------------------------------------------------------------
allnoconfig (arm64, gcc-8) — PASS, 0 errors, 0 warnings, 0 section mismatches

--------------------------------------------------------------------------------
allnoconfig (arm, gcc-8) — PASS, 0 errors, 0 warnings, 0 section mismatches

--------------------------------------------------------------------------------
allnoconfig (riscv, gcc-8) — PASS, 0 errors, 0 warnings, 0 section mismatches

--------------------------------------------------------------------------------
allnoconfig (mips, gcc-8) — PASS, 0 errors, 1 warning, 0 section mismatches

Warnings:
    <stdin>:1511:2: warning: #warning syscall clone3 not implemented [-Wcpp]

--------------------------------------------------------------------------------
allnoconfig (arm64, clang-8) — PASS, 0 errors, 0 warnings, 0 section mismatches

--------------------------------------------------------------------------------
allnoconfig (i386, gcc-8) — PASS, 0 errors, 0 warnings, 0 section mismatches

--------------------------------------------------------------------------------
allnoconfig (x86_64, gcc-8) — PASS, 0 errors, 0 warnings, 0 section mismatches

--------------------------------------------------------------------------------
am200epdkit_defconfig (arm, gcc-8) — PASS, 0 errors, 2 warnings, 0 section mismatches

Warnings:
    WARNING: "return_address" [vmlinux] is a static EXPORT_SYMBOL_GPL
    WARNING: "return_address" [vmlinux] is a static EXPORT_SYMBOL_GPL

--------------------------------------------------------------------------------
ar7_defconfig (mips, gcc-8) — PASS, 0 errors, 2 warnings, 0 section mismatches

Warnings:
    <stdin>:1511:2: warning: #warning syscall clone3 not implemented [-Wcpp]
    <stdin>:1511:2: warning: #warning syscall clone3 not implemented [-Wcpp]

--------------------------------------------------------------------------------
aspeed_g4_defconfig (arm, gcc-8) — PASS, 0 errors, 0 warnings, 0 section mismatches

--------------------------------------------------------------------------------
aspeed_g5_defconfig (arm, gcc-8) — PASS, 0 errors, 0 warnings, 0 section mismatches

--------------------------------------------------------------------------------
assabet_defconfig (arm, gcc-8) — PASS, 0 errors, 1 warning, 0 section mismatches

Warnings:
    drivers/video/fbdev/sa1100fb.c:975:21: warning: 'sa1100fb_min_dma_period' defined but not used [-Wunused-function]

--------------------------------------------------------------------------------
at91_dt_defconfig (arm, gcc-8) — PASS, 0 errors, 2 warnings, 0 section mismatches

Warnings:
    WARNING: "return_address" [vmlinux] is a static EXPORT_SYMBOL_GPL
    WARNING: "return_address" [vmlinux] is a static EXPORT_SYMBOL_GPL

--------------------------------------------------------------------------------
ath25_defconfig (mips, gcc-8) — PASS, 0 errors, 2 warnings, 0 section mismatches

Warnings:
    <stdin>:1511:2: warning: #warning syscall clone3 not implemented [-Wcpp]
    <stdin>:1511:2: warning: #warning syscall clone3 not implemented [-Wcpp]

--------------------------------------------------------------------------------
ath79_defconfig (mips, gcc-8) — PASS, 0 errors, 2 warnings, 0 section mismatches

Warnings:
    <stdin>:1511:2: warning: #warning syscall clone3 not implemented [-Wcpp]
    <stdin>:1511:2: warning: #warning syscall clone3 not implemented [-Wcpp]

--------------------------------------------------------------------------------
axm55xx_defconfig (arm, gcc-8) — PASS, 0 errors, 2 warnings, 0 section mismatches

Warnings:
    WARNING: "return_address" [vmlinux] is a static EXPORT_SYMBOL_GPL
    WARNING: "return_address" [vmlinux] is a static EXPORT_SYMBOL_GPL

--------------------------------------------------------------------------------
axs103_defconfig (arc, gcc-8) — PASS, 0 errors, 2 warnings, 0 section mismatches

Warnings:
    <stdin>:1511:2: warning: #warning syscall clone3 not implemented [-Wcpp]
    <stdin>:1511:2: warning: #warning syscall clone3 not implemented [-Wcpp]

--------------------------------------------------------------------------------
axs103_smp_defconfig (arc, gcc-8) — PASS, 0 errors, 2 warnings, 0 section mismatches

Warnings:
    <stdin>:1511:2: warning: #warning syscall clone3 not implemented [-Wcpp]
    <stdin>:1511:2: warning: #warning syscall clone3 not implemented [-Wcpp]

--------------------------------------------------------------------------------
badge4_defconfig (arm, gcc-8) — PASS, 0 errors, 0 warnings, 0 section mismatches

--------------------------------------------------------------------------------
bcm2835_defconfig (arm, gcc-8) — PASS, 0 errors, 0 warnings, 0 section mismatches

--------------------------------------------------------------------------------
bcm47xx_defconfig (mips, gcc-8) — PASS, 0 errors, 2 warnings, 0 section mismatches

Warnings:
    <stdin>:1511:2: warning: #warning syscall clone3 not implemented [-Wcpp]
    <stdin>:1511:2: warning: #warning syscall clone3 not implemented [-Wcpp]

--------------------------------------------------------------------------------
bcm63xx_defconfig (mips, gcc-8) — PASS, 0 errors, 1 warning, 0 section mismatches

Warnings:
    <stdin>:1511:2: warning: #warning syscall clone3 not implemented [-Wcpp]

--------------------------------------------------------------------------------
bigsur_defconfig (mips, gcc-8) — PASS, 0 errors, 6 warnings, 0 section mismatches

Warnings:
    <stdin>:1511:2: warning: #warning syscall clone3 not implemented [-Wcpp]
    <stdin>:1511:2: warning: #warning syscall clone3 not implemented [-Wcpp]
    <stdin>:1511:2: warning: #warning syscall clone3 not implemented [-Wcpp]
    <stdin>:1511:2: warning: #warning syscall clone3 not implemented [-Wcpp]
    <stdin>:1511:2: warning: #warning syscall clone3 not implemented [-Wcpp]
    <stdin>:1511:2: warning: #warning syscall clone3 not implemented [-Wcpp]

--------------------------------------------------------------------------------
bmips_be_defconfig (mips, gcc-8) — PASS, 0 errors, 1 warning, 0 section mismatches

Warnings:
    <stdin>:1511:2: warning: #warning syscall clone3 not implemented [-Wcpp]

--------------------------------------------------------------------------------
bmips_stb_defconfig (mips, gcc-8) — PASS, 0 errors, 1 warning, 0 section mismatches

Warnings:
    <stdin>:1511:2: warning: #warning syscall clone3 not implemented [-Wcpp]

--------------------------------------------------------------------------------
capcella_defconfig (mips, gcc-8) — PASS, 0 errors, 2 warnings, 0 section mismatches

Warnings:
    <stdin>:1511:2: warning: #warning syscall clone3 not implemented [-Wcpp]
    <stdin>:1511:2: warning: #warning syscall clone3 not implemented [-Wcpp]

--------------------------------------------------------------------------------
cavium_octeon_defconfig (mips, gcc-8) — FAIL, 2 errors, 4 warnings, 0 section mismatches

Errors:
    arch/mips/include/asm/octeon/cvmx-ipd.h:330:27: error: storage size of 'pip_sft_rst' isn't known
    arch/mips/include/asm/octeon/cvmx-ipd.h:331:36: error: 'CVMX_PIP_SFT_RST' undeclared (first use in this function); did you mean 'CVMX_CIU_SOFT_RST'?

Warnings:
    <stdin>:1511:2: warning: #warning syscall clone3 not implemented [-Wcpp]
    <stdin>:1511:2: warning: #warning syscall clone3 not implemented [-Wcpp]
    <stdin>:1511:2: warning: #warning syscall clone3 not implemented [-Wcpp]
    arch/mips/include/asm/octeon/cvmx-ipd.h:330:27: warning: unused variable 'pip_sft_rst' [-Wunused-variable]

--------------------------------------------------------------------------------
cerfcube_defconfig (arm, gcc-8) — PASS, 0 errors, 0 warnings, 0 section mismatches

--------------------------------------------------------------------------------
ci20_defconfig (mips, gcc-8) — PASS, 0 errors, 1 warning, 0 section mismatches

Warnings:
    <stdin>:1511:2: warning: #warning syscall clone3 not implemented [-Wcpp]

--------------------------------------------------------------------------------
clps711x_defconfig (arm, gcc-8) — PASS, 0 errors, 0 warnings, 0 section mismatches

--------------------------------------------------------------------------------
cm_x2xx_defconfig (arm, gcc-8) — PASS, 0 errors, 2 warnings, 0 section mismatches

Warnings:
    WARNING: "return_address" [vmlinux] is a static EXPORT_SYMBOL_GPL
    WARNING: "return_address" [vmlinux] is a static EXPORT_SYMBOL_GPL

--------------------------------------------------------------------------------
cm_x300_defconfig (arm, gcc-8) — PASS, 0 errors, 2 warnings, 0 section mismatches

Warnings:
    WARNING: "return_address" [vmlinux] is a static EXPORT_SYMBOL_GPL
    WARNING: "return_address" [vmlinux] is a static EXPORT_SYMBOL_GPL

--------------------------------------------------------------------------------
cns3420vb_defconfig (arm, gcc-8) — PASS, 0 errors, 2 warnings, 0 section mismatches

Warnings:
    WARNING: "return_address" [vmlinux] is a static EXPORT_SYMBOL_GPL
    WARNING: "return_address" [vmlinux] is a static EXPORT_SYMBOL_GPL

--------------------------------------------------------------------------------
cobalt_defconfig (mips, gcc-8) — PASS, 0 errors, 2 warnings, 0 section mismatches

Warnings:
    <stdin>:1511:2: warning: #warning syscall clone3 not implemented [-Wcpp]
    <stdin>:1511:2: warning: #warning syscall clone3 not implemented [-Wcpp]

--------------------------------------------------------------------------------
colibri_pxa270_defconfig (arm, gcc-8) — PASS, 0 errors, 2 warnings, 0 section mismatches

Warnings:
    WARNING: "return_address" [vmlinux] is a static EXPORT_SYMBOL_GPL
    WARNING: "return_address" [vmlinux] is a static EXPORT_SYMBOL_GPL

--------------------------------------------------------------------------------
colibri_pxa300_defconfig (arm, gcc-8) — PASS, 0 errors, 2 warnings, 0 section mismatches

Warnings:
    WARNING: "return_address" [vmlinux] is a static EXPORT_SYMBOL_GPL
    WARNING: "return_address" [vmlinux] is a static EXPORT_SYMBOL_GPL

--------------------------------------------------------------------------------
collie_defconfig (arm, gcc-8) — PASS, 0 errors, 1 warning, 0 section mismatches

Warnings:
    drivers/video/fbdev/sa1100fb.c:975:21: warning: 'sa1100fb_min_dma_period' defined but not used [-Wunused-function]

--------------------------------------------------------------------------------
corgi_defconfig (arm, gcc-8) — PASS, 0 errors, 0 warnings, 0 section mismatches

--------------------------------------------------------------------------------
davinci_all_defconfig (arm, gcc-8) — PASS, 0 errors, 2 warnings, 0 section mismatches

Warnings:
    WARNING: "return_address" [vmlinux] is a static EXPORT_SYMBOL_GPL
    WARNING: "return_address" [vmlinux] is a static EXPORT_SYMBOL_GPL

--------------------------------------------------------------------------------
db1xxx_defconfig (mips, gcc-8) — PASS, 0 errors, 2 warnings, 0 section mismatches

Warnings:
    <stdin>:1511:2: warning: #warning syscall clone3 not implemented [-Wcpp]
    drivers/mtd/nand/raw/au1550nd.c:443:57: warning: pointer type mismatch in conditional expression

--------------------------------------------------------------------------------
decstation_64_defconfig (mips, gcc-8) — PASS, 0 errors, 8 warnings, 0 section mismatches

Warnings:
    <stdin>:1511:2: warning: #warning syscall clone3 not implemented [-Wcpp]
    <stdin>:1511:2: warning: #warning syscall clone3 not implemented [-Wcpp]
    <stdin>:1511:2: warning: #warning syscall clone3 not implemented [-Wcpp]
    WARNING: "LZ4HC_setExternalDict" [lib/lz4/lz4hc_compress] is a static EXPORT_SYMBOL
    <stdin>:1511:2: warning: #warning syscall clone3 not implemented [-Wcpp]
    <stdin>:1511:2: warning: #warning syscall clone3 not implemented [-Wcpp]
    <stdin>:1511:2: warning: #warning syscall clone3 not implemented [-Wcpp]
    WARNING: "LZ4HC_setExternalDict" [lib/lz4/lz4hc_compress] is a static EXPORT_SYMBOL

--------------------------------------------------------------------------------
decstation_defconfig (mips, gcc-8) — PASS, 0 errors, 4 warnings, 0 section mismatches

Warnings:
    <stdin>:1511:2: warning: #warning syscall clone3 not implemented [-Wcpp]
    WARNING: "LZ4HC_setExternalDict" [lib/lz4/lz4hc_compress] is a static EXPORT_SYMBOL
    <stdin>:1511:2: warning: #warning syscall clone3 not implemented [-Wcpp]
    WARNING: "LZ4HC_setExternalDict" [lib/lz4/lz4hc_compress] is a static EXPORT_SYMBOL

--------------------------------------------------------------------------------
decstation_r4k_defconfig (mips, gcc-8) — PASS, 0 errors, 4 warnings, 0 section mismatches

Warnings:
    <stdin>:1511:2: warning: #warning syscall clone3 not implemented [-Wcpp]
    WARNING: "LZ4HC_setExternalDict" [lib/lz4/lz4hc_compress] is a static EXPORT_SYMBOL
    <stdin>:1511:2: warning: #warning syscall clone3 not implemented [-Wcpp]
    WARNING: "LZ4HC_setExternalDict" [lib/lz4/lz4hc_compress] is a static EXPORT_SYMBOL

--------------------------------------------------------------------------------
defconfig (riscv, gcc-8) — PASS, 0 errors, 0 warnings, 0 section mismatches

--------------------------------------------------------------------------------
defconfig (arm64, gcc-8) — PASS, 0 errors, 2 warnings, 0 section mismatches

Warnings:
    WARNING: "HYPERVISOR_platform_op" [vmlinux] is a static EXPORT_SYMBOL_GPL
    WARNING: "HYPERVISOR_platform_op" [vmlinux] is a static EXPORT_SYMBOL_GPL

--------------------------------------------------------------------------------
defconfig (arm64, clang-8) — PASS, 0 errors, 2 warnings, 0 section mismatches

Warnings:
    WARNING: "HYPERVISOR_platform_op" [vmlinux] is a static EXPORT_SYMBOL_GPL
    WARNING: "HYPERVISOR_platform_op" [vmlinux] is a static EXPORT_SYMBOL_GPL

--------------------------------------------------------------------------------
defconfig+CONFIG_CPU_BIG_ENDIAN=y (arm64, gcc-8) — FAIL, 0 errors, 0 warnings, 0 section mismatches

--------------------------------------------------------------------------------
defconfig+CONFIG_RANDOMIZE_BASE=y (arm64, gcc-8) — PASS, 0 errors, 2 warnings, 0 section mismatches

Warnings:
    WARNING: "HYPERVISOR_platform_op" [vmlinux] is a static EXPORT_SYMBOL_GPL
    WARNING: "HYPERVISOR_platform_op" [vmlinux] is a static EXPORT_SYMBOL_GPL

--------------------------------------------------------------------------------
defconfig+kselftest (arm64, gcc-8) — FAIL, 0 errors, 0 warnings, 0 section mismatches

--------------------------------------------------------------------------------
defconfig+kselftest (riscv, gcc-8) — FAIL, 0 errors, 0 warnings, 0 section mismatches

--------------------------------------------------------------------------------
dove_defconfig (arm, gcc-8) — PASS, 0 errors, 2 warnings, 0 section mismatches

Warnings:
    WARNING: "return_address" [vmlinux] is a static EXPORT_SYMBOL_GPL
    WARNING: "return_address" [vmlinux] is a static EXPORT_SYMBOL_GPL

--------------------------------------------------------------------------------
e55_defconfig (mips, gcc-8) — PASS, 0 errors, 2 warnings, 0 section mismatches

Warnings:
    <stdin>:1511:2: warning: #warning syscall clone3 not implemented [-Wcpp]
    <stdin>:1511:2: warning: #warning syscall clone3 not implemented [-Wcpp]

--------------------------------------------------------------------------------
ebsa110_defconfig (arm, gcc-8) — PASS, 0 errors, 0 warnings, 0 section mismatches

--------------------------------------------------------------------------------
efm32_defconfig (arm, gcc-8) — PASS, 0 errors, 0 warnings, 0 section mismatches

--------------------------------------------------------------------------------
em_x270_defconfig (arm, gcc-8) — PASS, 0 errors, 2 warnings, 0 section mismatches

Warnings:
    WARNING: "return_address" [vmlinux] is a static EXPORT_SYMBOL_GPL
    WARNING: "return_address" [vmlinux] is a static EXPORT_SYMBOL_GPL

--------------------------------------------------------------------------------
ep93xx_defconfig (arm, gcc-8) — PASS, 0 errors, 2 warnings, 0 section mismatches

Warnings:
    WARNING: "return_address" [vmlinux] is a static EXPORT_SYMBOL_GPL
    WARNING: "return_address" [vmlinux] is a static EXPORT_SYMBOL_GPL

--------------------------------------------------------------------------------
eseries_pxa_defconfig (arm, gcc-8) — PASS, 0 errors, 2 warnings, 0 section mismatches

Warnings:
    WARNING: "return_address" [vmlinux] is a static EXPORT_SYMBOL_GPL
    WARNING: "return_address" [vmlinux] is a static EXPORT_SYMBOL_GPL

--------------------------------------------------------------------------------
exynos_defconfig (arm, gcc-8) — PASS, 0 errors, 2 warnings, 0 section mismatches

Warnings:
    WARNING: "return_address" [vmlinux] is a static EXPORT_SYMBOL_GPL
    WARNING: "return_address" [vmlinux] is a static EXPORT_SYMBOL_GPL

--------------------------------------------------------------------------------
ezx_defconfig (arm, gcc-8) — PASS, 0 errors, 2 warnings, 0 section mismatches

Warnings:
    WARNING: "return_address" [vmlinux] is a static EXPORT_SYMBOL_GPL
    WARNING: "return_address" [vmlinux] is a static EXPORT_SYMBOL_GPL

--------------------------------------------------------------------------------
footbridge_defconfig (arm, gcc-8) — PASS, 0 errors, 0 warnings, 0 section mismatches

--------------------------------------------------------------------------------
fuloong2e_defconfig (mips, gcc-8) — PASS, 0 errors, 6 warnings, 0 section mismatches

Warnings:
    <stdin>:1511:2: warning: #warning syscall clone3 not implemented [-Wcpp]
    <stdin>:1511:2: warning: #warning syscall clone3 not implemented [-Wcpp]
    <stdin>:1511:2: warning: #warning syscall clone3 not implemented [-Wcpp]
    <stdin>:1511:2: warning: #warning syscall clone3 not implemented [-Wcpp]
    <stdin>:1511:2: warning: #warning syscall clone3 not implemented [-Wcpp]
    <stdin>:1511:2: warning: #warning syscall clone3 not implemented [-Wcpp]

--------------------------------------------------------------------------------
gcw0_defconfig (mips, gcc-8) — PASS, 0 errors, 1 warning, 0 section mismatches

Warnings:
    <stdin>:1511:2: warning: #warning syscall clone3 not implemented [-Wcpp]

--------------------------------------------------------------------------------
gemini_defconfig (arm, gcc-8) — PASS, 0 errors, 0 warnings, 0 section mismatches

--------------------------------------------------------------------------------
gpr_defconfig (mips, gcc-8) — PASS, 0 errors, 2 warnings, 0 section mismatches

Warnings:
    <stdin>:1511:2: warning: #warning syscall clone3 not implemented [-Wcpp]
    <stdin>:1511:2: warning: #warning syscall clone3 not implemented [-Wcpp]

--------------------------------------------------------------------------------
h3600_defconfig (arm, gcc-8) — PASS, 0 errors, 1 warning, 0 section mismatches

Warnings:
    drivers/video/fbdev/sa1100fb.c:975:21: warning: 'sa1100fb_min_dma_period' defined but not used [-Wunused-function]

--------------------------------------------------------------------------------
h5000_defconfig (arm, gcc-8) — PASS, 0 errors, 2 warnings, 0 section mismatches

Warnings:
    WARNING: "return_address" [vmlinux] is a static EXPORT_SYMBOL_GPL
    WARNING: "return_address" [vmlinux] is a static EXPORT_SYMBOL_GPL

--------------------------------------------------------------------------------
hackkit_defconfig (arm, gcc-8) — PASS, 0 errors, 0 warnings, 0 section mismatches

--------------------------------------------------------------------------------
haps_hs_defconfig (arc, gcc-8) — PASS, 0 errors, 2 warnings, 0 section mismatches

Warnings:
    <stdin>:1511:2: warning: #warning syscall clone3 not implemented [-Wcpp]
    <stdin>:1511:2: warning: #warning syscall clone3 not implemented [-Wcpp]

--------------------------------------------------------------------------------
haps_hs_smp_defconfig (arc, gcc-8) — PASS, 0 errors, 2 warnings, 0 section mismatches

Warnings:
    <stdin>:1511:2: warning: #warning syscall clone3 not implemented [-Wcpp]
    <stdin>:1511:2: warning: #warning syscall clone3 not implemented [-Wcpp]

--------------------------------------------------------------------------------
hisi_defconfig (arm, gcc-8) — PASS, 0 errors, 0 warnings, 0 section mismatches

--------------------------------------------------------------------------------
hsdk_defconfig (arc, gcc-8) — PASS, 0 errors, 2 warnings, 0 section mismatches

Warnings:
    <stdin>:1511:2: warning: #warning syscall clone3 not implemented [-Wcpp]
    <stdin>:1511:2: warning: #warning syscall clone3 not implemented [-Wcpp]

--------------------------------------------------------------------------------
i386_defconfig (i386, gcc-8) — PASS, 0 errors, 0 warnings, 0 section mismatches

--------------------------------------------------------------------------------
i386_defconfig+kselftest (i386, gcc-8) — FAIL, 0 errors, 0 warnings, 0 section mismatches

--------------------------------------------------------------------------------
imote2_defconfig (arm, gcc-8) — PASS, 0 errors, 2 warnings, 0 section mismatches

Warnings:
    WARNING: "return_address" [vmlinux] is a static EXPORT_SYMBOL_GPL
    WARNING: "return_address" [vmlinux] is a static EXPORT_SYMBOL_GPL

--------------------------------------------------------------------------------
imx_v4_v5_defconfig (arm, gcc-8) — PASS, 0 errors, 2 warnings, 0 section mismatches

Warnings:
    WARNING: "return_address" [vmlinux] is a static EXPORT_SYMBOL_GPL
    WARNING: "return_address" [vmlinux] is a static EXPORT_SYMBOL_GPL

--------------------------------------------------------------------------------
imx_v6_v7_defconfig (arm, gcc-8) — PASS, 0 errors, 2 warnings, 0 section mismatches

Warnings:
    WARNING: "return_address" [vmlinux] is a static EXPORT_SYMBOL_GPL
    WARNING: "return_address" [vmlinux] is a static EXPORT_SYMBOL_GPL

--------------------------------------------------------------------------------
integrator_defconfig (arm, gcc-8) — PASS, 0 errors, 2 warnings, 0 section mismatches

Warnings:
    WARNING: "return_address" [vmlinux] is a static EXPORT_SYMBOL_GPL
    WARNING: "return_address" [vmlinux] is a static EXPORT_SYMBOL_GPL

--------------------------------------------------------------------------------
iop32x_defconfig (arm, gcc-8) — PASS, 0 errors, 0 warnings, 0 section mismatches

--------------------------------------------------------------------------------
ip22_defconfig (mips, gcc-8) — PASS, 0 errors, 2 warnings, 0 section mismatches

Warnings:
    <stdin>:1511:2: warning: #warning syscall clone3 not implemented [-Wcpp]
    <stdin>:1511:2: warning: #warning syscall clone3 not implemented [-Wcpp]

--------------------------------------------------------------------------------
ip27_defconfig (mips, gcc-8) — PASS, 0 errors, 6 warnings, 0 section mismatches

Warnings:
    <stdin>:1511:2: warning: #warning syscall clone3 not implemented [-Wcpp]
    <stdin>:1511:2: warning: #warning syscall clone3 not implemented [-Wcpp]
    <stdin>:1511:2: warning: #warning syscall clone3 not implemented [-Wcpp]
    <stdin>:1511:2: warning: #warning syscall clone3 not implemented [-Wcpp]
    <stdin>:1511:2: warning: #warning syscall clone3 not implemented [-Wcpp]
    <stdin>:1511:2: warning: #warning syscall clone3 not implemented [-Wcpp]

--------------------------------------------------------------------------------
ip28_defconfig (mips, gcc-8) — PASS, 0 errors, 6 warnings, 0 section mismatches

Warnings:
    <stdin>:1511:2: warning: #warning syscall clone3 not implemented [-Wcpp]
    <stdin>:1511:2: warning: #warning syscall clone3 not implemented [-Wcpp]
    <stdin>:1511:2: warning: #warning syscall clone3 not implemented [-Wcpp]
    <stdin>:1511:2: warning: #warning syscall clone3 not implemented [-Wcpp]
    <stdin>:1511:2: warning: #warning syscall clone3 not implemented [-Wcpp]
    <stdin>:1511:2: warning: #warning syscall clone3 not implemented [-Wcpp]

--------------------------------------------------------------------------------
ip32_defconfig (mips, gcc-8) — PASS, 0 errors, 7 warnings, 0 section mismatches

Warnings:
    <stdin>:1511:2: warning: #warning syscall clone3 not implemented [-Wcpp]
    <stdin>:1511:2: warning: #warning syscall clone3 not implemented [-Wcpp]
    <stdin>:1511:2: warning: #warning syscall clone3 not implemented [-Wcpp]
    arch/mips/fw/arc/memory.c:163:16: warning: unused variable 'addr' [-Wunused-variable]
    <stdin>:1511:2: warning: #warning syscall clone3 not implemented [-Wcpp]
    <stdin>:1511:2: warning: #warning syscall clone3 not implemented [-Wcpp]
    <stdin>:1511:2: warning: #warning syscall clone3 not implemented [-Wcpp]

--------------------------------------------------------------------------------
ixp4xx_defconfig (arm, gcc-8) — PASS, 0 errors, 2 warnings, 0 section mismatches

Warnings:
    WARNING: "return_address" [vmlinux] is a static EXPORT_SYMBOL_GPL
    WARNING: "return_address" [vmlinux] is a static EXPORT_SYMBOL_GPL

--------------------------------------------------------------------------------
jazz_defconfig (mips, gcc-8) — PASS, 0 errors, 3 warnings, 0 section mismatches

Warnings:
    <stdin>:1511:2: warning: #warning syscall clone3 not implemented [-Wcpp]
    arch/mips/fw/arc/memory.c:163:16: warning: unused variable 'addr' [-Wunused-variable]
    <stdin>:1511:2: warning: #warning syscall clone3 not implemented [-Wcpp]

--------------------------------------------------------------------------------
jmr3927_defconfig (mips, gcc-8) — PASS, 0 errors, 1 warning, 0 section mismatches

Warnings:
    <stdin>:1511:2: warning: #warning syscall clone3 not implemented [-Wcpp]

--------------------------------------------------------------------------------
jornada720_defconfig (arm, gcc-8) — PASS, 0 errors, 0 warnings, 0 section mismatches

--------------------------------------------------------------------------------
keystone_defconfig (arm, gcc-8) — PASS, 0 errors, 2 warnings, 0 section mismatches

Warnings:
    WARNING: "return_address" [vmlinux] is a static EXPORT_SYMBOL_GPL
    WARNING: "return_address" [vmlinux] is a static EXPORT_SYMBOL_GPL

--------------------------------------------------------------------------------
lart_defconfig (arm, gcc-8) — PASS, 0 errors, 0 warnings, 0 section mismatches

--------------------------------------------------------------------------------
lasat_defconfig (mips, gcc-8) — PASS, 0 errors, 1 warning, 0 section mismatches

Warnings:
    <stdin>:1511:2: warning: #warning syscall clone3 not implemented [-Wcpp]

--------------------------------------------------------------------------------
lemote2f_defconfig (mips, gcc-8) — PASS, 0 errors, 6 warnings, 0 section mismatches

Warnings:
    <stdin>:1511:2: warning: #warning syscall clone3 not implemented [-Wcpp]
    <stdin>:1511:2: warning: #warning syscall clone3 not implemented [-Wcpp]
    <stdin>:1511:2: warning: #warning syscall clone3 not implemented [-Wcpp]
    <stdin>:1511:2: warning: #warning syscall clone3 not implemented [-Wcpp]
    <stdin>:1511:2: warning: #warning syscall clone3 not implemented [-Wcpp]
    <stdin>:1511:2: warning: #warning syscall clone3 not implemented [-Wcpp]

--------------------------------------------------------------------------------
loongson1b_defconfig (mips, gcc-8) — PASS, 0 errors, 2 warnings, 0 section mismatches

Warnings:
    <stdin>:1511:2: warning: #warning syscall clone3 not implemented [-Wcpp]
    <stdin>:1511:2: warning: #warning syscall clone3 not implemented [-Wcpp]

--------------------------------------------------------------------------------
loongson1c_defconfig (mips, gcc-8) — PASS, 0 errors, 2 warnings, 0 section mismatches

Warnings:
    <stdin>:1511:2: warning: #warning syscall clone3 not implemented [-Wcpp]
    <stdin>:1511:2: warning: #warning syscall clone3 not implemented [-Wcpp]

--------------------------------------------------------------------------------
loongson3_defconfig (mips, gcc-8) — PASS, 0 errors, 6 warnings, 0 section mismatches

Warnings:
    <stdin>:1511:2: warning: #warning syscall clone3 not implemented [-Wcpp]
    <stdin>:1511:2: warning: #warning syscall clone3 not implemented [-Wcpp]
    <stdin>:1511:2: warning: #warning syscall clone3 not implemented [-Wcpp]
    <stdin>:1511:2: warning: #warning syscall clone3 not implemented [-Wcpp]
    <stdin>:1511:2: warning: #warning syscall clone3 not implemented [-Wcpp]
    <stdin>:1511:2: warning: #warning syscall clone3 not implemented [-Wcpp]

--------------------------------------------------------------------------------
lpc18xx_defconfig (arm, gcc-8) — PASS, 0 errors, 0 warnings, 0 section mismatches

--------------------------------------------------------------------------------
lpc32xx_defconfig (arm, gcc-8) — PASS, 0 errors, 2 warnings, 0 section mismatches

Warnings:
    WARNING: "return_address" [vmlinux] is a static EXPORT_SYMBOL_GPL
    WARNING: "return_address" [vmlinux] is a static EXPORT_SYMBOL_GPL

--------------------------------------------------------------------------------
lpd270_defconfig (arm, gcc-8) — PASS, 0 errors, 0 warnings, 0 section mismatches

--------------------------------------------------------------------------------
lubbock_defconfig (arm, gcc-8) — PASS, 0 errors, 0 warnings, 0 section mismatches

--------------------------------------------------------------------------------
magician_defconfig (arm, gcc-8) — PASS, 0 errors, 2 warnings, 0 section mismatches

Warnings:
    WARNING: "return_address" [vmlinux] is a static EXPORT_SYMBOL_GPL
    WARNING: "return_address" [vmlinux] is a static EXPORT_SYMBOL_GPL

--------------------------------------------------------------------------------
mainstone_defconfig (arm, gcc-8) — PASS, 0 errors, 0 warnings, 0 section mismatches

--------------------------------------------------------------------------------
malta_defconfig (mips, gcc-8) — PASS, 0 errors, 2 warnings, 0 section mismatches

Warnings:
    <stdin>:1511:2: warning: #warning syscall clone3 not implemented [-Wcpp]
    <stdin>:1511:2: warning: #warning syscall clone3 not implemented [-Wcpp]

--------------------------------------------------------------------------------
malta_kvm_defconfig (mips, gcc-8) — PASS, 0 errors, 2 warnings, 0 section mismatches

Warnings:
    <stdin>:1511:2: warning: #warning syscall clone3 not implemented [-Wcpp]
    <stdin>:1511:2: warning: #warning syscall clone3 not implemented [-Wcpp]

--------------------------------------------------------------------------------
malta_kvm_guest_defconfig (mips, gcc-8) — PASS, 0 errors, 2 warnings, 0 section mismatches

Warnings:
    <stdin>:1511:2: warning: #warning syscall clone3 not implemented [-Wcpp]
    <stdin>:1511:2: warning: #warning syscall clone3 not implemented [-Wcpp]

--------------------------------------------------------------------------------
malta_qemu_32r6_defconfig (mips, gcc-8) — PASS, 0 errors, 3 warnings, 0 section mismatches

Warnings:
    <stdin>:1511:2: warning: #warning syscall clone3 not implemented [-Wcpp]
    {standard input}:134: Warning: macro instruction expanded into multiple instructions
    <stdin>:1511:2: warning: #warning syscall clone3 not implemented [-Wcpp]

--------------------------------------------------------------------------------
maltaaprp_defconfig (mips, gcc-8) — PASS, 0 errors, 2 warnings, 0 section mismatches

Warnings:
    <stdin>:1511:2: warning: #warning syscall clone3 not implemented [-Wcpp]
    <stdin>:1511:2: warning: #warning syscall clone3 not implemented [-Wcpp]

--------------------------------------------------------------------------------
maltasmvp_defconfig (mips, gcc-8) — PASS, 0 errors, 2 warnings, 0 section mismatches

Warnings:
    <stdin>:1511:2: warning: #warning syscall clone3 not implemented [-Wcpp]
    <stdin>:1511:2: warning: #warning syscall clone3 not implemented [-Wcpp]

--------------------------------------------------------------------------------
maltasmvp_eva_defconfig (mips, gcc-8) — PASS, 0 errors, 2 warnings, 0 section mismatches

Warnings:
    <stdin>:1511:2: warning: #warning syscall clone3 not implemented [-Wcpp]
    <stdin>:1511:2: warning: #warning syscall clone3 not implemented [-Wcpp]

--------------------------------------------------------------------------------
maltaup_defconfig (mips, gcc-8) — PASS, 0 errors, 2 warnings, 0 section mismatches

Warnings:
    <stdin>:1511:2: warning: #warning syscall clone3 not implemented [-Wcpp]
    <stdin>:1511:2: warning: #warning syscall clone3 not implemented [-Wcpp]

--------------------------------------------------------------------------------
maltaup_xpa_defconfig (mips, gcc-8) — PASS, 0 errors, 2 warnings, 0 section mismatches

Warnings:
    <stdin>:1511:2: warning: #warning syscall clone3 not implemented [-Wcpp]
    <stdin>:1511:2: warning: #warning syscall clone3 not implemented [-Wcpp]

--------------------------------------------------------------------------------
markeins_defconfig (mips, gcc-8) — PASS, 0 errors, 2 warnings, 0 section mismatches

Warnings:
    <stdin>:1511:2: warning: #warning syscall clone3 not implemented [-Wcpp]
    <stdin>:1511:2: warning: #warning syscall clone3 not implemented [-Wcpp]

--------------------------------------------------------------------------------
milbeaut_m10v_defconfig (arm, gcc-8) — PASS, 0 errors, 2 warnings, 0 section mismatches

Warnings:
    WARNING: "return_address" [vmlinux] is a static EXPORT_SYMBOL_GPL
    WARNING: "return_address" [vmlinux] is a static EXPORT_SYMBOL_GPL

--------------------------------------------------------------------------------
mini2440_defconfig (arm, gcc-8) — PASS, 0 errors, 2 warnings, 0 section mismatches

Warnings:
    WARNING: "return_address" [vmlinux] is a static EXPORT_SYMBOL_GPL
    WARNING: "return_address" [vmlinux] is a static EXPORT_SYMBOL_GPL

--------------------------------------------------------------------------------
mips_paravirt_defconfig (mips, gcc-8) — PASS, 0 errors, 6 warnings, 0 section mismatches

Warnings:
    <stdin>:1511:2: warning: #warning syscall clone3 not implemented [-Wcpp]
    <stdin>:1511:2: warning: #warning syscall clone3 not implemented [-Wcpp]
    <stdin>:1511:2: warning: #warning syscall clone3 not implemented [-Wcpp]
    <stdin>:1511:2: warning: #warning syscall clone3 not implemented [-Wcpp]
    <stdin>:1511:2: warning: #warning syscall clone3 not implemented [-Wcpp]
    <stdin>:1511:2: warning: #warning syscall clone3 not implemented [-Wcpp]

--------------------------------------------------------------------------------
mmp2_defconfig (arm, gcc-8) — PASS, 0 errors, 2 warnings, 0 section mismatches

Warnings:
    WARNING: "return_address" [vmlinux] is a static EXPORT_SYMBOL_GPL
    WARNING: "return_address" [vmlinux] is a static EXPORT_SYMBOL_GPL

--------------------------------------------------------------------------------
moxart_defconfig (arm, gcc-8) — PASS, 0 errors, 0 warnings, 0 section mismatches

--------------------------------------------------------------------------------
mpc30x_defconfig (mips, gcc-8) — PASS, 0 errors, 2 warnings, 0 section mismatches

Warnings:
    <stdin>:1511:2: warning: #warning syscall clone3 not implemented [-Wcpp]
    <stdin>:1511:2: warning: #warning syscall clone3 not implemented [-Wcpp]

--------------------------------------------------------------------------------
mps2_defconfig (arm, gcc-8) — PASS, 0 errors, 0 warnings, 0 section mismatches

--------------------------------------------------------------------------------
msp71xx_defconfig (mips, gcc-8) — FAIL, 4 errors, 2 warnings, 0 section mismatches

Errors:
    arch/mips/pmcs-msp71xx/msp_prom.c:64:34: error: 'MAX_PROM_MEM' undeclared here (not in a function); did you mean 'DEV_PROP_MAX'?
    arch/mips/pmcs-msp71xx/msp_prom.c:380:16: error: unused variable 'addr' [-Werror=unused-variable]
    arch/mips/pmcs-msp71xx/msp_prom.c:65:20: error: 'prom_mem_size' defined but not used [-Werror=unused-variable]
    arch/mips/pmcs-msp71xx/msp_prom.c:64:20: error: 'prom_mem_base' defined but not used [-Werror=unused-variable]

Warnings:
    <stdin>:1511:2: warning: #warning syscall clone3 not implemented [-Wcpp]
    cc1: all warnings being treated as errors

--------------------------------------------------------------------------------
mtx1_defconfig (mips, gcc-8) — PASS, 0 errors, 2 warnings, 0 section mismatches

Warnings:
    <stdin>:1511:2: warning: #warning syscall clone3 not implemented [-Wcpp]
    <stdin>:1511:2: warning: #warning syscall clone3 not implemented [-Wcpp]

--------------------------------------------------------------------------------
multi_v4t_defconfig (arm, gcc-8) — PASS, 0 errors, 0 warnings, 0 section mismatches

--------------------------------------------------------------------------------
multi_v5_defconfig (arm, gcc-8) — PASS, 0 errors, 2 warnings, 0 section mismatches

Warnings:
    WARNING: "return_address" [vmlinux] is a static EXPORT_SYMBOL_GPL
    WARNING: "return_address" [vmlinux] is a static EXPORT_SYMBOL_GPL

--------------------------------------------------------------------------------
multi_v7_defconfig (arm, gcc-8) — PASS, 0 errors, 2 warnings, 0 section mismatches

Warnings:
    WARNING: "return_address" [vmlinux] is a static EXPORT_SYMBOL_GPL
    WARNING: "return_address" [vmlinux] is a static EXPORT_SYMBOL_GPL

--------------------------------------------------------------------------------
multi_v7_defconfig+CONFIG_CPU_BIG_ENDIAN=y (arm, gcc-8) — FAIL, 0 errors, 0 warnings, 0 section mismatches

--------------------------------------------------------------------------------
multi_v7_defconfig+CONFIG_EFI=y+CONFIG_ARM_LPAE=y (arm, gcc-8) — FAIL, 0 errors, 0 warnings, 0 section mismatches

--------------------------------------------------------------------------------
multi_v7_defconfig+CONFIG_SMP=n (arm, gcc-8) — FAIL, 0 errors, 0 warnings, 0 section mismatches

--------------------------------------------------------------------------------
multi_v7_defconfig+kselftest (arm, gcc-8) — FAIL, 0 errors, 0 warnings, 0 section mismatches

--------------------------------------------------------------------------------
mv78xx0_defconfig (arm, gcc-8) — PASS, 0 errors, 2 warnings, 0 section mismatches

Warnings:
    WARNING: "return_address" [vmlinux] is a static EXPORT_SYMBOL_GPL
    WARNING: "return_address" [vmlinux] is a static EXPORT_SYMBOL_GPL

--------------------------------------------------------------------------------
mvebu_v5_defconfig (arm, gcc-8) — PASS, 0 errors, 2 warnings, 0 section mismatches

Warnings:
    WARNING: "return_address" [vmlinux] is a static EXPORT_SYMBOL_GPL
    WARNING: "return_address" [vmlinux] is a static EXPORT_SYMBOL_GPL

--------------------------------------------------------------------------------
mvebu_v7_defconfig (arm, gcc-8) — PASS, 0 errors, 2 warnings, 0 section mismatches

Warnings:
    WARNING: "return_address" [vmlinux] is a static EXPORT_SYMBOL_GPL
    WARNING: "return_address" [vmlinux] is a static EXPORT_SYMBOL_GPL

--------------------------------------------------------------------------------
mxs_defconfig (arm, gcc-8) — PASS, 0 errors, 2 warnings, 0 section mismatches

Warnings:
    WARNING: "return_address" [vmlinux] is a static EXPORT_SYMBOL_GPL
    WARNING: "return_address" [vmlinux] is a static EXPORT_SYMBOL_GPL

--------------------------------------------------------------------------------
neponset_defconfig (arm, gcc-8) — PASS, 0 errors, 1 warning, 0 section mismatches

Warnings:
    drivers/video/fbdev/sa1100fb.c:975:21: warning: 'sa1100fb_min_dma_period' defined but not used [-Wunused-function]

--------------------------------------------------------------------------------
netwinder_defconfig (arm, gcc-8) — PASS, 0 errors, 0 warnings, 0 section mismatches

--------------------------------------------------------------------------------
nhk8815_defconfig (arm, gcc-8) — PASS, 0 errors, 2 warnings, 0 section mismatches

Warnings:
    WARNING: "return_address" [vmlinux] is a static EXPORT_SYMBOL_GPL
    WARNING: "return_address" [vmlinux] is a static EXPORT_SYMBOL_GPL

--------------------------------------------------------------------------------
nlm_xlp_defconfig (mips, gcc-8) — PASS, 0 errors, 6 warnings, 0 section mismatches

Warnings:
    <stdin>:1511:2: warning: #warning syscall clone3 not implemented [-Wcpp]
    <stdin>:1511:2: warning: #warning syscall clone3 not implemented [-Wcpp]
    <stdin>:1511:2: warning: #warning syscall clone3 not implemented [-Wcpp]
    <stdin>:1511:2: warning: #warning syscall clone3 not implemented [-Wcpp]
    <stdin>:1511:2: warning: #warning syscall clone3 not implemented [-Wcpp]
    <stdin>:1511:2: warning: #warning syscall clone3 not implemented [-Wcpp]

--------------------------------------------------------------------------------
nlm_xlr_defconfig (mips, gcc-8) — PASS, 0 errors, 3 warnings, 0 section mismatches

Warnings:
    <stdin>:1511:2: warning: #warning syscall clone3 not implemented [-Wcpp]
    include/linux/kern_levels.h:5:18: warning: format '%lu' expects argument of type 'long unsigned int', but argument 8 has type 'unsigned int' [-Wformat=]
    <stdin>:1511:2: warning: #warning syscall clone3 not implemented [-Wcpp]

--------------------------------------------------------------------------------
nsim_hs_defconfig (arc, gcc-8) — PASS, 0 errors, 2 warnings, 0 section mismatches

Warnings:
    <stdin>:1511:2: warning: #warning syscall clone3 not implemented [-Wcpp]
    <stdin>:1511:2: warning: #warning syscall clone3 not implemented [-Wcpp]

--------------------------------------------------------------------------------
nsim_hs_defconfig+kselftest (arc, gcc-8) — FAIL, 0 errors, 0 warnings, 0 section mismatches

--------------------------------------------------------------------------------
nsim_hs_smp_defconfig (arc, gcc-8) — PASS, 0 errors, 2 warnings, 0 section mismatches

Warnings:
    <stdin>:1511:2: warning: #warning syscall clone3 not implemented [-Wcpp]
    <stdin>:1511:2: warning: #warning syscall clone3 not implemented [-Wcpp]

--------------------------------------------------------------------------------
nsimosci_hs_defconfig (arc, gcc-8) — PASS, 0 errors, 2 warnings, 0 section mismatches

Warnings:
    <stdin>:1511:2: warning: #warning syscall clone3 not implemented [-Wcpp]
    <stdin>:1511:2: warning: #warning syscall clone3 not implemented [-Wcpp]

--------------------------------------------------------------------------------
nsimosci_hs_smp_defconfig (arc, gcc-8) — PASS, 0 errors, 2 warnings, 0 section mismatches

Warnings:
    <stdin>:1511:2: warning: #warning syscall clone3 not implemented [-Wcpp]
    <stdin>:1511:2: warning: #warning syscall clone3 not implemented [-Wcpp]

--------------------------------------------------------------------------------
omap1_defconfig (arm, gcc-8) — PASS, 0 errors, 2 warnings, 0 section mismatches

Warnings:
    WARNING: "return_address" [vmlinux] is a static EXPORT_SYMBOL_GPL
    WARNING: "return_address" [vmlinux] is a static EXPORT_SYMBOL_GPL

--------------------------------------------------------------------------------
omap2plus_defconfig (arm, gcc-8) — PASS, 0 errors, 2 warnings, 0 section mismatches

Warnings:
    WARNING: "return_address" [vmlinux] is a static EXPORT_SYMBOL_GPL
    WARNING: "return_address" [vmlinux] is a static EXPORT_SYMBOL_GPL

--------------------------------------------------------------------------------
omega2p_defconfig (mips, gcc-8) — PASS, 0 errors, 1 warning, 0 section mismatches

Warnings:
    <stdin>:1511:2: warning: #warning syscall clone3 not implemented [-Wcpp]

--------------------------------------------------------------------------------
orion5x_defconfig (arm, gcc-8) — PASS, 0 errors, 2 warnings, 0 section mismatches

Warnings:
    WARNING: "return_address" [vmlinux] is a static EXPORT_SYMBOL_GPL
    WARNING: "return_address" [vmlinux] is a static EXPORT_SYMBOL_GPL

--------------------------------------------------------------------------------
oxnas_v6_defconfig (arm, gcc-8) — PASS, 0 errors, 2 warnings, 0 section mismatches

Warnings:
    WARNING: "return_address" [vmlinux] is a static EXPORT_SYMBOL_GPL
    WARNING: "return_address" [vmlinux] is a static EXPORT_SYMBOL_GPL

--------------------------------------------------------------------------------
palmz72_defconfig (arm, gcc-8) — PASS, 0 errors, 2 warnings, 0 section mismatches

Warnings:
    WARNING: "return_address" [vmlinux] is a static EXPORT_SYMBOL_GPL
    WARNING: "return_address" [vmlinux] is a static EXPORT_SYMBOL_GPL

--------------------------------------------------------------------------------
pcm027_defconfig (arm, gcc-8) — PASS, 0 errors, 2 warnings, 0 section mismatches

Warnings:
    WARNING: "return_address" [vmlinux] is a static EXPORT_SYMBOL_GPL
    WARNING: "return_address" [vmlinux] is a static EXPORT_SYMBOL_GPL

--------------------------------------------------------------------------------
pic32mzda_defconfig (mips, gcc-8) — PASS, 0 errors, 2 warnings, 0 section mismatches

Warnings:
    <stdin>:1511:2: warning: #warning syscall clone3 not implemented [-Wcpp]
    <stdin>:1511:2: warning: #warning syscall clone3 not implemented [-Wcpp]

--------------------------------------------------------------------------------
pistachio_defconfig (mips, gcc-8) — PASS, 0 errors, 2 warnings, 0 section mismatches

Warnings:
    <stdin>:1511:2: warning: #warning syscall clone3 not implemented [-Wcpp]
    <stdin>:1511:2: warning: #warning syscall clone3 not implemented [-Wcpp]

--------------------------------------------------------------------------------
pleb_defconfig (arm, gcc-8) — PASS, 0 errors, 0 warnings, 0 section mismatches

--------------------------------------------------------------------------------
pnx8335_stb225_defconfig (mips, gcc-8) — PASS, 0 errors, 2 warnings, 0 section mismatches

Warnings:
    <stdin>:1511:2: warning: #warning syscall clone3 not implemented [-Wcpp]
    <stdin>:1511:2: warning: #warning syscall clone3 not implemented [-Wcpp]

--------------------------------------------------------------------------------
prima2_defconfig (arm, gcc-8) — PASS, 0 errors, 2 warnings, 0 section mismatches

Warnings:
    WARNING: "return_address" [vmlinux] is a static EXPORT_SYMBOL_GPL
    WARNING: "return_address" [vmlinux] is a static EXPORT_SYMBOL_GPL

--------------------------------------------------------------------------------
pxa168_defconfig (arm, gcc-8) — PASS, 0 errors, 2 warnings, 0 section mismatches

Warnings:
    WARNING: "return_address" [vmlinux] is a static EXPORT_SYMBOL_GPL
    WARNING: "return_address" [vmlinux] is a static EXPORT_SYMBOL_GPL

--------------------------------------------------------------------------------
pxa255-idp_defconfig (arm, gcc-8) — PASS, 0 errors, 0 warnings, 0 section mismatches

--------------------------------------------------------------------------------
pxa3xx_defconfig (arm, gcc-8) — PASS, 0 errors, 2 warnings, 0 section mismatches

Warnings:
    WARNING: "return_address" [vmlinux] is a static EXPORT_SYMBOL_GPL
    WARNING: "return_address" [vmlinux] is a static EXPORT_SYMBOL_GPL

--------------------------------------------------------------------------------
pxa910_defconfig (arm, gcc-8) — PASS, 0 errors, 2 warnings, 0 section mismatches

Warnings:
    WARNING: "return_address" [vmlinux] is a static EXPORT_SYMBOL_GPL
    WARNING: "return_address" [vmlinux] is a static EXPORT_SYMBOL_GPL

--------------------------------------------------------------------------------
pxa_defconfig (arm, gcc-8) — PASS, 0 errors, 0 warnings, 0 section mismatches

--------------------------------------------------------------------------------
qcom_defconfig (arm, gcc-8) — PASS, 0 errors, 2 warnings, 0 section mismatches

Warnings:
    WARNING: "return_address" [vmlinux] is a static EXPORT_SYMBOL_GPL
    WARNING: "return_address" [vmlinux] is a static EXPORT_SYMBOL_GPL

--------------------------------------------------------------------------------
qi_lb60_defconfig (mips, gcc-8) — PASS, 0 errors, 2 warnings, 0 section mismatches

Warnings:
    <stdin>:1511:2: warning: #warning syscall clone3 not implemented [-Wcpp]
    <stdin>:1511:2: warning: #warning syscall clone3 not implemented [-Wcpp]

--------------------------------------------------------------------------------
rb532_defconfig (mips, gcc-8) — PASS, 0 errors, 2 warnings, 0 section mismatches

Warnings:
    <stdin>:1511:2: warning: #warning syscall clone3 not implemented [-Wcpp]
    <stdin>:1511:2: warning: #warning syscall clone3 not implemented [-Wcpp]

--------------------------------------------------------------------------------
rbtx49xx_defconfig (mips, gcc-8) — PASS, 0 errors, 2 warnings, 0 section mismatches

Warnings:
    <stdin>:1511:2: warning: #warning syscall clone3 not implemented [-Wcpp]
    <stdin>:1511:2: warning: #warning syscall clone3 not implemented [-Wcpp]

--------------------------------------------------------------------------------
realview_defconfig (arm, gcc-8) — PASS, 0 errors, 2 warnings, 0 section mismatches

Warnings:
    WARNING: "return_address" [vmlinux] is a static EXPORT_SYMBOL_GPL
    WARNING: "return_address" [vmlinux] is a static EXPORT_SYMBOL_GPL

--------------------------------------------------------------------------------
rm200_defconfig (mips, gcc-8) — PASS, 0 errors, 3 warnings, 0 section mismatches

Warnings:
    <stdin>:1511:2: warning: #warning syscall clone3 not implemented [-Wcpp]
    arch/mips/fw/arc/memory.c:163:16: warning: unused variable 'addr' [-Wunused-variable]
    <stdin>:1511:2: warning: #warning syscall clone3 not implemented [-Wcpp]

--------------------------------------------------------------------------------
rpc_defconfig (arm, gcc-8) — PASS, 0 errors, 0 warnings, 0 section mismatches

--------------------------------------------------------------------------------
rt305x_defconfig (mips, gcc-8) — PASS, 0 errors, 2 warnings, 0 section mismatches

Warnings:
    <stdin>:1511:2: warning: #warning syscall clone3 not implemented [-Wcpp]
    <stdin>:1511:2: warning: #warning syscall clone3 not implemented [-Wcpp]

--------------------------------------------------------------------------------
rv32_defconfig (riscv, gcc-8) — PASS, 0 errors, 6 warnings, 0 section mismatches

Warnings:
    <stdin>:830:2: warning: #warning syscall fstat64 not implemented [-Wcpp]
    <stdin>:1127:2: warning: #warning syscall fstatat64 not implemented [-Wcpp]
    <stdin>:1511:2: warning: #warning syscall clone3 not implemented [-Wcpp]
    <stdin>:830:2: warning: #warning syscall fstat64 not implemented [-Wcpp]
    <stdin>:1127:2: warning: #warning syscall fstatat64 not implemented [-Wcpp]
    <stdin>:1511:2: warning: #warning syscall clone3 not implemented [-Wcpp]

--------------------------------------------------------------------------------
s3c2410_defconfig (arm, gcc-8) — PASS, 0 errors, 0 warnings, 0 section mismatches

--------------------------------------------------------------------------------
s3c6400_defconfig (arm, gcc-8) — PASS, 0 errors, 2 warnings, 0 section mismatches

Warnings:
    WARNING: "return_address" [vmlinux] is a static EXPORT_SYMBOL_GPL
    WARNING: "return_address" [vmlinux] is a static EXPORT_SYMBOL_GPL

--------------------------------------------------------------------------------
s5pv210_defconfig (arm, gcc-8) — PASS, 0 errors, 2 warnings, 0 section mismatches

Warnings:
    WARNING: "return_address" [vmlinux] is a static EXPORT_SYMBOL_GPL
    WARNING: "return_address" [vmlinux] is a static EXPORT_SYMBOL_GPL

--------------------------------------------------------------------------------
sama5_defconfig (arm, gcc-8) — PASS, 0 errors, 2 warnings, 0 section mismatches

Warnings:
    WARNING: "return_address" [vmlinux] is a static EXPORT_SYMBOL_GPL
    WARNING: "return_address" [vmlinux] is a static EXPORT_SYMBOL_GPL

--------------------------------------------------------------------------------
sb1250_swarm_defconfig (mips, gcc-8) — PASS, 0 errors, 4 warnings, 0 section mismatches

Warnings:
    <stdin>:1511:2: warning: #warning syscall clone3 not implemented [-Wcpp]
    <stdin>:1511:2: warning: #warning syscall clone3 not implemented [-Wcpp]
    <stdin>:1511:2: warning: #warning syscall clone3 not implemented [-Wcpp]
    <stdin>:1511:2: warning: #warning syscall clone3 not implemented [-Wcpp]

--------------------------------------------------------------------------------
shannon_defconfig (arm, gcc-8) — PASS, 0 errors, 1 warning, 0 section mismatches

Warnings:
    drivers/video/fbdev/sa1100fb.c:975:21: warning: 'sa1100fb_min_dma_period' defined but not used [-Wunused-function]

--------------------------------------------------------------------------------
shmobile_defconfig (arm, gcc-8) — PASS, 0 errors, 0 warnings, 0 section mismatches

--------------------------------------------------------------------------------
simpad_defconfig (arm, gcc-8) — PASS, 0 errors, 0 warnings, 0 section mismatches

--------------------------------------------------------------------------------
socfpga_defconfig (arm, gcc-8) — PASS, 0 errors, 0 warnings, 0 section mismatches

--------------------------------------------------------------------------------
spear13xx_defconfig (arm, gcc-8) — PASS, 0 errors, 2 warnings, 0 section mismatches

Warnings:
    WARNING: "return_address" [vmlinux] is a static EXPORT_SYMBOL_GPL
    WARNING: "return_address" [vmlinux] is a static EXPORT_SYMBOL_GPL

--------------------------------------------------------------------------------
spear3xx_defconfig (arm, gcc-8) — PASS, 0 errors, 0 warnings, 0 section mismatches

--------------------------------------------------------------------------------
spear6xx_defconfig (arm, gcc-8) — PASS, 0 errors, 0 warnings, 0 section mismatches

--------------------------------------------------------------------------------
spitz_defconfig (arm, gcc-8) — PASS, 0 errors, 0 warnings, 0 section mismatches

--------------------------------------------------------------------------------
stm32_defconfig (arm, gcc-8) — PASS, 0 errors, 0 warnings, 0 section mismatches

--------------------------------------------------------------------------------
sunxi_defconfig (arm, gcc-8) — PASS, 0 errors, 2 warnings, 0 section mismatches

Warnings:
    WARNING: "return_address" [vmlinux] is a static EXPORT_SYMBOL_GPL
    WARNING: "return_address" [vmlinux] is a static EXPORT_SYMBOL_GPL

--------------------------------------------------------------------------------
tango4_defconfig (arm, gcc-8) — PASS, 0 errors, 2 warnings, 0 section mismatches

Warnings:
    WARNING: "return_address" [vmlinux] is a static EXPORT_SYMBOL_GPL
    WARNING: "return_address" [vmlinux] is a static EXPORT_SYMBOL_GPL

--------------------------------------------------------------------------------
tb0219_defconfig (mips, gcc-8) — PASS, 0 errors, 2 warnings, 0 section mismatches

Warnings:
    <stdin>:1511:2: warning: #warning syscall clone3 not implemented [-Wcpp]
    <stdin>:1511:2: warning: #warning syscall clone3 not implemented [-Wcpp]

--------------------------------------------------------------------------------
tb0226_defconfig (mips, gcc-8) — PASS, 0 errors, 2 warnings, 0 section mismatches

Warnings:
    <stdin>:1511:2: warning: #warning syscall clone3 not implemented [-Wcpp]
    <stdin>:1511:2: warning: #warning syscall clone3 not implemented [-Wcpp]

--------------------------------------------------------------------------------
tb0287_defconfig (mips, gcc-8) — PASS, 0 errors, 2 warnings, 0 section mismatches

Warnings:
    <stdin>:1511:2: warning: #warning syscall clone3 not implemented [-Wcpp]
    <stdin>:1511:2: warning: #warning syscall clone3 not implemented [-Wcpp]

--------------------------------------------------------------------------------
tct_hammer_defconfig (arm, gcc-8) — PASS, 0 errors, 0 warnings, 0 section mismatches

--------------------------------------------------------------------------------
tegra_defconfig (arm, gcc-8) — PASS, 0 errors, 2 warnings, 0 section mismatches

Warnings:
    WARNING: "return_address" [vmlinux] is a static EXPORT_SYMBOL_GPL
    WARNING: "return_address" [vmlinux] is a static EXPORT_SYMBOL_GPL

--------------------------------------------------------------------------------
tinyconfig (i386, gcc-8) — PASS, 0 errors, 0 warnings, 0 section mismatches

--------------------------------------------------------------------------------
tinyconfig (arm64, gcc-8) — PASS, 0 errors, 0 warnings, 0 section mismatches

--------------------------------------------------------------------------------
tinyconfig (x86_64, gcc-8) — PASS, 0 errors, 1 warning, 0 section mismatches

Warnings:
    .config:1178:warning: override: UNWINDER_GUESS changes choice state

--------------------------------------------------------------------------------
tinyconfig (arm, gcc-8) — PASS, 0 errors, 0 warnings, 0 section mismatches

--------------------------------------------------------------------------------
tinyconfig (riscv, gcc-8) — PASS, 0 errors, 0 warnings, 0 section mismatches

--------------------------------------------------------------------------------
tinyconfig (mips, gcc-8) — PASS, 0 errors, 1 warning, 0 section mismatches

Warnings:
    <stdin>:1511:2: warning: #warning syscall clone3 not implemented [-Wcpp]

--------------------------------------------------------------------------------
tinyconfig (arc, gcc-8) — PASS, 0 errors, 1 warning, 0 section mismatches

Warnings:
    <stdin>:1511:2: warning: #warning syscall clone3 not implemented [-Wcpp]

--------------------------------------------------------------------------------
trizeps4_defconfig (arm, gcc-8) — PASS, 0 errors, 2 warnings, 0 section mismatches

Warnings:
    WARNING: "return_address" [vmlinux] is a static EXPORT_SYMBOL_GPL
    WARNING: "return_address" [vmlinux] is a static EXPORT_SYMBOL_GPL

--------------------------------------------------------------------------------
u300_defconfig (arm, gcc-8) — PASS, 0 errors, 2 warnings, 0 section mismatches

Warnings:
    WARNING: "return_address" [vmlinux] is a static EXPORT_SYMBOL_GPL
    WARNING: "return_address" [vmlinux] is a static EXPORT_SYMBOL_GPL

--------------------------------------------------------------------------------
u8500_defconfig (arm, gcc-8) — PASS, 0 errors, 2 warnings, 0 section mismatches

Warnings:
    WARNING: "return_address" [vmlinux] is a static EXPORT_SYMBOL_GPL
    WARNING: "return_address" [vmlinux] is a static EXPORT_SYMBOL_GPL

--------------------------------------------------------------------------------
vdk_hs38_defconfig (arc, gcc-8) — PASS, 0 errors, 1 warning, 0 section mismatches

Warnings:
    <stdin>:1511:2: warning: #warning syscall clone3 not implemented [-Wcpp]

--------------------------------------------------------------------------------
vdk_hs38_smp_defconfig (arc, gcc-8) — PASS, 0 errors, 1 warning, 0 section mismatches

Warnings:
    <stdin>:1511:2: warning: #warning syscall clone3 not implemented [-Wcpp]

--------------------------------------------------------------------------------
versatile_defconfig (arm, gcc-8) — PASS, 0 errors, 2 warnings, 0 section mismatches

Warnings:
    WARNING: "return_address" [vmlinux] is a static EXPORT_SYMBOL_GPL
    WARNING: "return_address" [vmlinux] is a static EXPORT_SYMBOL_GPL

--------------------------------------------------------------------------------
vexpress_defconfig (arm, gcc-8) — PASS, 0 errors, 2 warnings, 0 section mismatches

Warnings:
    WARNING: "return_address" [vmlinux] is a static EXPORT_SYMBOL_GPL
    WARNING: "return_address" [vmlinux] is a static EXPORT_SYMBOL_GPL

--------------------------------------------------------------------------------
vf610m4_defconfig (arm, gcc-8) — PASS, 0 errors, 0 warnings, 0 section mismatches

--------------------------------------------------------------------------------
viper_defconfig (arm, gcc-8) — PASS, 0 errors, 2 warnings, 0 section mismatches

Warnings:
    WARNING: "return_address" [vmlinux] is a static EXPORT_SYMBOL_GPL
    WARNING: "return_address" [vmlinux] is a static EXPORT_SYMBOL_GPL

--------------------------------------------------------------------------------
vocore2_defconfig (mips, gcc-8) — PASS, 0 errors, 1 warning, 0 section mismatches

Warnings:
    <stdin>:1511:2: warning: #warning syscall clone3 not implemented [-Wcpp]

--------------------------------------------------------------------------------
vt8500_v6_v7_defconfig (arm, gcc-8) — PASS, 0 errors, 0 warnings, 0 section mismatches

--------------------------------------------------------------------------------
workpad_defconfig (mips, gcc-8) — PASS, 0 errors, 2 warnings, 0 section mismatches

Warnings:
    <stdin>:1511:2: warning: #warning syscall clone3 not implemented [-Wcpp]
    <stdin>:1511:2: warning: #warning syscall clone3 not implemented [-Wcpp]

--------------------------------------------------------------------------------
x86_64_defconfig (x86_64, gcc-8) — PASS, 0 errors, 0 warnings, 0 section mismatches

--------------------------------------------------------------------------------
x86_64_defconfig+kselftest (x86_64, gcc-8) — FAIL, 0 errors, 0 warnings, 0 section mismatches

--------------------------------------------------------------------------------
xcep_defconfig (arm, gcc-8) — PASS, 0 errors, 2 warnings, 0 section mismatches

Warnings:
    WARNING: "return_address" [vmlinux] is a static EXPORT_SYMBOL_GPL
    WARNING: "return_address" [vmlinux] is a static EXPORT_SYMBOL_GPL

--------------------------------------------------------------------------------
xway_defconfig (mips, gcc-8) — PASS, 0 errors, 2 warnings, 0 section mismatches

Warnings:
    <stdin>:1511:2: warning: #warning syscall clone3 not implemented [-Wcpp]
    <stdin>:1511:2: warning: #warning syscall clone3 not implemented [-Wcpp]

--------------------------------------------------------------------------------
zeus_defconfig (arm, gcc-8) — PASS, 0 errors, 2 warnings, 0 section mismatches

Warnings:
    WARNING: "return_address" [vmlinux] is a static EXPORT_SYMBOL_GPL
    WARNING: "return_address" [vmlinux] is a static EXPORT_SYMBOL_GPL

--------------------------------------------------------------------------------
zx_defconfig (arm, gcc-8) — PASS, 0 errors, 0 warnings, 0 section mismatches

---
For more info write to <info@kernelci.org>

^ permalink raw reply	[flat|nested] only message in thread

only message in thread, back to index

Thread overview: (only message) (download: mbox.gz / follow: Atom feed)
-- links below jump to the message on this page --
2019-09-02 15:53 next/master build: 218 builds: 17 failed, 201 passed, 10 errors, 351 warnings (next-20190902) kernelci.org bot

Linux-Next Archive on lore.kernel.org

Archives are clonable:
	git clone --mirror https://lore.kernel.org/linux-next/0 linux-next/git/0.git

	# If you have public-inbox 1.1+ installed, you may
	# initialize and index your mirror using the following commands:
	public-inbox-init -V2 linux-next linux-next/ https://lore.kernel.org/linux-next \
		linux-next@vger.kernel.org linux-next@archiver.kernel.org
	public-inbox-index linux-next


Newsgroup available over NNTP:
	nntp://nntp.lore.kernel.org/org.kernel.vger.linux-next


AGPL code for this site: git clone https://public-inbox.org/ public-inbox