Linux-Next Archive on lore.kernel.org
 help / color / Atom feed
* next/pending-fixes build: 169 builds: 2 failed, 167 passed, 9 errors, 74 warnings (v5.8-rc3-210-g0a3929819868)
@ 2020-06-30  4:24 kernelci.org bot
  0 siblings, 0 replies; only message in thread
From: kernelci.org bot @ 2020-06-30  4:24 UTC (permalink / raw)
  To: linux-next

next/pending-fixes build: 169 builds: 2 failed, 167 passed, 9 errors, 74 warnings (v5.8-rc3-210-g0a3929819868)

Full Build Summary: https://kernelci.org/build/next/branch/pending-fixes/kernel/v5.8-rc3-210-g0a3929819868/

Tree: next
Branch: pending-fixes
Git Describe: v5.8-rc3-210-g0a3929819868
Git Commit: 0a39298198681fe7b6ad576dc2ae15b326d0344a
Git URL: https://git.kernel.org/pub/scm/linux/kernel/git/next/linux-next.git
Built: 7 unique architectures

Build Failures Detected:

mips:
    malta_kvm_defconfig: (gcc-8) FAIL
    xway_defconfig: (gcc-8) FAIL

Errors and Warnings Detected:

arc:

arm64:
    allmodconfig (gcc-8): 8 warnings
    defconfig (gcc-8): 8 warnings
    defconfig+CONFIG_CPU_BIG_ENDIAN=y (gcc-8): 8 warnings
    defconfig+CONFIG_RANDOMIZE_BASE=y (gcc-8): 8 warnings
    defconfig+kselftest (gcc-8): 8 warnings

arm:
    allmodconfig (gcc-8): 20 warnings
    mps2_defconfig (gcc-8): 1 warning
    xcep_defconfig (gcc-8): 2 warnings

i386:

mips:
    loongson3_defconfig (gcc-8): 1 warning
    malta_kvm_defconfig (gcc-8): 8 errors, 1 warning
    malta_qemu_32r6_defconfig (gcc-8): 1 warning
    mtx1_defconfig (gcc-8): 1 warning
    xway_defconfig (gcc-8): 1 error

riscv:
    rv32_defconfig (gcc-8): 6 warnings

x86_64:
    tinyconfig (gcc-8): 1 warning

Errors summary:

    1    drivers/mtd/nand/raw/xway_nand.c:227:30: error: ‘mtd’ undeclared (first use in this function)
    1    arch/mips/kvm/emulate.c:1808:27: error: left shift count >= width of type [-Werror=shift-count-overflow]
    1    arch/mips/kvm/emulate.c:1804:27: error: left shift count >= width of type [-Werror=shift-count-overflow]
    1    arch/mips/kvm/emulate.c:1800:27: error: left shift count >= width of type [-Werror=shift-count-overflow]
    1    arch/mips/kvm/emulate.c:1796:27: error: left shift count >= width of type [-Werror=shift-count-overflow]
    1    arch/mips/kvm/emulate.c:1746:28: error: right shift count >= width of type [-Werror=shift-count-overflow]
    1    arch/mips/kvm/emulate.c:1742:28: error: right shift count >= width of type [-Werror=shift-count-overflow]
    1    arch/mips/kvm/emulate.c:1738:28: error: right shift count >= width of type [-Werror=shift-count-overflow]
    1    arch/mips/kvm/emulate.c:1734:28: error: right shift count >= width of type [-Werror=shift-count-overflow]

Warnings summary:

    24   arch/arm64/boot/dts/broadcom/stingray/stingray-usb.dtsi:7.3-14: Warning (dma_ranges_format): /usb:dma-ranges: empty "dma-ranges" property but its #size-cells (1) differs from / (2)
    24   arch/arm64/boot/dts/broadcom/stingray/stingray-usb.dtsi:7.3-14: Warning (dma_ranges_format): /usb:dma-ranges: empty "dma-ranges" property but its #address-cells (1) differs from / (2)
    18   drivers/net/phy/mdio-cavium.h:113:48: warning: cast to pointer from integer of different size [-Wint-to-pointer-cast]
    8    drivers/net/phy/mdio-cavium.h:114:37: warning: cast to pointer from integer of different size [-Wint-to-pointer-cast]
    8    arch/arm64/boot/dts/qcom/ipq6018.dtsi:127.3-14: Warning (dma_ranges_format): /soc:dma-ranges: empty "dma-ranges" property but its #size-cells (1) differs from / (2)
    8    arch/arm64/boot/dts/qcom/ipq6018.dtsi:127.3-14: Warning (dma_ranges_format): /soc:dma-ranges: empty "dma-ranges" property but its #address-cells (1) differs from / (2)
    4    drivers/net/ethernet/intel/ice/ice_flow.h:197:33: warning: cast from pointer to integer of different size [-Wpointer-to-int-cast]
    4    <stdin>:830:2: warning: #warning syscall fstat64 not implemented [-Wcpp]
    4    <stdin>:1511:2: warning: #warning syscall clone3 not implemented [-Wcpp]
    4    <stdin>:1127:2: warning: #warning syscall fstatat64 not implemented [-Wcpp]
    3    net/sunrpc/svcsock.c:226:5: warning: "ARCH_IMPLEMENTS_FLUSH_DCACHE_PAGE" is not defined, evaluates to 0 [-Wundef]
    2    {standard input}:141: Warning: macro instruction expanded into multiple instructions
    2    include/linux/kern_levels.h:5:18: warning: format ‘%lu’ expects argument of type ‘long unsigned int’, but argument 2 has type ‘unsigned int’ [-Wformat=]
    2    drivers/net/phy/mdio-octeon.c:48:3: warning: cast from pointer to integer of different size [-Wpointer-to-int-cast]
    2    drivers/net/ethernet/intel/ice/ice_flow.h:198:32: warning: cast to pointer from integer of different size [-Wint-to-pointer-cast]
    1    include/linux/compiler_attributes.h:201:41: warning: statement will never be executed [-Wswitch-unreachable]
    1    drivers/media/tuners/mxl5005s.c:3953:1: warning: the frame size of 1120 bytes is larger than 1024 bytes [-Wframe-larger-than=]
    1    cc1: all warnings being treated as errors
    1    /tmp/ccQ5LssZ.s:18191: Warning: using r15 results in unpredictable behaviour
    1    /tmp/ccQ5LssZ.s:18119: Warning: using r15 results in unpredictable behaviour
    1    /tmp/ccLnwFWr.s:18191: Warning: using r15 results in unpredictable behaviour
    1    /tmp/ccLnwFWr.s:18119: Warning: using r15 results in unpredictable behaviour
    1    .config:1167:warning: override: UNWINDER_GUESS changes choice state

Section mismatches summary:

    1    WARNING: modpost: vmlinux.o(.text.unlikely+0x2c00): Section mismatch in reference from the function pmax_setup_memory_region() to the function .init.text:add_memory_region()
    1    WARNING: modpost: vmlinux.o(.text.unlikely+0x2980): Section mismatch in reference from the function pmax_setup_memory_region() to the function .init.text:add_memory_region()

================================================================================

Detailed per-defconfig build reports:

--------------------------------------------------------------------------------
32r2el_defconfig+kselftest (mips, gcc-8) — PASS, 0 errors, 0 warnings, 0 section mismatches

--------------------------------------------------------------------------------
allmodconfig (arm, gcc-8) — PASS, 0 errors, 20 warnings, 0 section mismatches

Warnings:
    /tmp/ccQ5LssZ.s:18119: Warning: using r15 results in unpredictable behaviour
    /tmp/ccQ5LssZ.s:18191: Warning: using r15 results in unpredictable behaviour
    include/linux/kern_levels.h:5:18: warning: format ‘%lu’ expects argument of type ‘long unsigned int’, but argument 2 has type ‘unsigned int’ [-Wformat=]
    drivers/net/phy/mdio-cavium.h:114:37: warning: cast to pointer from integer of different size [-Wint-to-pointer-cast]
    drivers/net/phy/mdio-cavium.h:113:48: warning: cast to pointer from integer of different size [-Wint-to-pointer-cast]
    drivers/net/phy/mdio-cavium.h:113:48: warning: cast to pointer from integer of different size [-Wint-to-pointer-cast]
    drivers/net/phy/mdio-cavium.h:113:48: warning: cast to pointer from integer of different size [-Wint-to-pointer-cast]
    drivers/net/phy/mdio-cavium.h:114:37: warning: cast to pointer from integer of different size [-Wint-to-pointer-cast]
    drivers/net/phy/mdio-cavium.h:113:48: warning: cast to pointer from integer of different size [-Wint-to-pointer-cast]
    drivers/net/phy/mdio-cavium.h:114:37: warning: cast to pointer from integer of different size [-Wint-to-pointer-cast]
    drivers/net/phy/mdio-cavium.h:113:48: warning: cast to pointer from integer of different size [-Wint-to-pointer-cast]
    drivers/net/phy/mdio-cavium.h:113:48: warning: cast to pointer from integer of different size [-Wint-to-pointer-cast]
    drivers/net/phy/mdio-cavium.h:114:37: warning: cast to pointer from integer of different size [-Wint-to-pointer-cast]
    drivers/net/phy/mdio-octeon.c:48:3: warning: cast from pointer to integer of different size [-Wpointer-to-int-cast]
    drivers/net/phy/mdio-cavium.h:113:48: warning: cast to pointer from integer of different size [-Wint-to-pointer-cast]
    drivers/net/phy/mdio-cavium.h:113:48: warning: cast to pointer from integer of different size [-Wint-to-pointer-cast]
    drivers/net/phy/mdio-cavium.h:113:48: warning: cast to pointer from integer of different size [-Wint-to-pointer-cast]
    drivers/net/ethernet/intel/ice/ice_flow.h:197:33: warning: cast from pointer to integer of different size [-Wpointer-to-int-cast]
    drivers/net/ethernet/intel/ice/ice_flow.h:198:32: warning: cast to pointer from integer of different size [-Wint-to-pointer-cast]
    drivers/net/ethernet/intel/ice/ice_flow.h:197:33: warning: cast from pointer to integer of different size [-Wpointer-to-int-cast]

--------------------------------------------------------------------------------
allmodconfig (x86_64, gcc-8) — PASS, 0 errors, 0 warnings, 0 section mismatches

--------------------------------------------------------------------------------
allmodconfig (arm64, gcc-8) — PASS, 0 errors, 8 warnings, 0 section mismatches

Warnings:
    arch/arm64/boot/dts/broadcom/stingray/stingray-usb.dtsi:7.3-14: Warning (dma_ranges_format): /usb:dma-ranges: empty "dma-ranges" property but its #address-cells (1) differs from / (2)
    arch/arm64/boot/dts/broadcom/stingray/stingray-usb.dtsi:7.3-14: Warning (dma_ranges_format): /usb:dma-ranges: empty "dma-ranges" property but its #size-cells (1) differs from / (2)
    arch/arm64/boot/dts/broadcom/stingray/stingray-usb.dtsi:7.3-14: Warning (dma_ranges_format): /usb:dma-ranges: empty "dma-ranges" property but its #address-cells (1) differs from / (2)
    arch/arm64/boot/dts/broadcom/stingray/stingray-usb.dtsi:7.3-14: Warning (dma_ranges_format): /usb:dma-ranges: empty "dma-ranges" property but its #size-cells (1) differs from / (2)
    arch/arm64/boot/dts/broadcom/stingray/stingray-usb.dtsi:7.3-14: Warning (dma_ranges_format): /usb:dma-ranges: empty "dma-ranges" property but its #address-cells (1) differs from / (2)
    arch/arm64/boot/dts/broadcom/stingray/stingray-usb.dtsi:7.3-14: Warning (dma_ranges_format): /usb:dma-ranges: empty "dma-ranges" property but its #size-cells (1) differs from / (2)
    arch/arm64/boot/dts/qcom/ipq6018.dtsi:127.3-14: Warning (dma_ranges_format): /soc:dma-ranges: empty "dma-ranges" property but its #address-cells (1) differs from / (2)
    arch/arm64/boot/dts/qcom/ipq6018.dtsi:127.3-14: Warning (dma_ranges_format): /soc:dma-ranges: empty "dma-ranges" property but its #size-cells (1) differs from / (2)

--------------------------------------------------------------------------------
allnoconfig (x86_64, gcc-8) — PASS, 0 errors, 0 warnings, 0 section mismatches

--------------------------------------------------------------------------------
allnoconfig (arc, gcc-8) — PASS, 0 errors, 0 warnings, 0 section mismatches

--------------------------------------------------------------------------------
allnoconfig (i386, gcc-8) — PASS, 0 errors, 0 warnings, 0 section mismatches

--------------------------------------------------------------------------------
allnoconfig (arm64, gcc-8) — PASS, 0 errors, 0 warnings, 0 section mismatches

--------------------------------------------------------------------------------
allnoconfig (riscv, gcc-8) — PASS, 0 errors, 0 warnings, 0 section mismatches

--------------------------------------------------------------------------------
allnoconfig (arm, gcc-8) — PASS, 0 errors, 0 warnings, 0 section mismatches

--------------------------------------------------------------------------------
allnoconfig (mips, gcc-8) — PASS, 0 errors, 0 warnings, 0 section mismatches

--------------------------------------------------------------------------------
am200epdkit_defconfig (arm, gcc-8) — PASS, 0 errors, 0 warnings, 0 section mismatches

--------------------------------------------------------------------------------
aspeed_g4_defconfig (arm, gcc-8) — PASS, 0 errors, 0 warnings, 0 section mismatches

--------------------------------------------------------------------------------
aspeed_g5_defconfig (arm, gcc-8) — PASS, 0 errors, 0 warnings, 0 section mismatches

--------------------------------------------------------------------------------
assabet_defconfig (arm, gcc-8) — PASS, 0 errors, 0 warnings, 0 section mismatches

--------------------------------------------------------------------------------
at91_dt_defconfig (arm, gcc-8) — PASS, 0 errors, 0 warnings, 0 section mismatches

--------------------------------------------------------------------------------
ath25_defconfig (mips, gcc-8) — PASS, 0 errors, 0 warnings, 0 section mismatches

--------------------------------------------------------------------------------
ath79_defconfig (mips, gcc-8) — PASS, 0 errors, 0 warnings, 0 section mismatches

--------------------------------------------------------------------------------
axm55xx_defconfig (arm, gcc-8) — PASS, 0 errors, 0 warnings, 0 section mismatches

--------------------------------------------------------------------------------
axs103_defconfig (arc, gcc-8) — PASS, 0 errors, 0 warnings, 0 section mismatches

--------------------------------------------------------------------------------
axs103_smp_defconfig (arc, gcc-8) — PASS, 0 errors, 0 warnings, 0 section mismatches

--------------------------------------------------------------------------------
badge4_defconfig (arm, gcc-8) — PASS, 0 errors, 0 warnings, 0 section mismatches

--------------------------------------------------------------------------------
bcm2835_defconfig (arm, gcc-8) — PASS, 0 errors, 0 warnings, 0 section mismatches

--------------------------------------------------------------------------------
bcm47xx_defconfig (mips, gcc-8) — PASS, 0 errors, 0 warnings, 0 section mismatches

--------------------------------------------------------------------------------
bcm63xx_defconfig (mips, gcc-8) — PASS, 0 errors, 0 warnings, 0 section mismatches

--------------------------------------------------------------------------------
bmips_be_defconfig (mips, gcc-8) — PASS, 0 errors, 0 warnings, 0 section mismatches

--------------------------------------------------------------------------------
bmips_stb_defconfig (mips, gcc-8) — PASS, 0 errors, 0 warnings, 0 section mismatches

--------------------------------------------------------------------------------
capcella_defconfig (mips, gcc-8) — PASS, 0 errors, 0 warnings, 0 section mismatches

--------------------------------------------------------------------------------
cerfcube_defconfig (arm, gcc-8) — PASS, 0 errors, 0 warnings, 0 section mismatches

--------------------------------------------------------------------------------
ci20_defconfig (mips, gcc-8) — PASS, 0 errors, 0 warnings, 0 section mismatches

--------------------------------------------------------------------------------
clps711x_defconfig (arm, gcc-8) — PASS, 0 errors, 0 warnings, 0 section mismatches

--------------------------------------------------------------------------------
cm_x300_defconfig (arm, gcc-8) — PASS, 0 errors, 0 warnings, 0 section mismatches

--------------------------------------------------------------------------------
cns3420vb_defconfig (arm, gcc-8) — PASS, 0 errors, 0 warnings, 0 section mismatches

--------------------------------------------------------------------------------
cobalt_defconfig (mips, gcc-8) — PASS, 0 errors, 0 warnings, 0 section mismatches

--------------------------------------------------------------------------------
colibri_pxa300_defconfig (arm, gcc-8) — PASS, 0 errors, 0 warnings, 0 section mismatches

--------------------------------------------------------------------------------
corgi_defconfig (arm, gcc-8) — PASS, 0 errors, 0 warnings, 0 section mismatches

--------------------------------------------------------------------------------
cu1000-neo_defconfig (mips, gcc-8) — PASS, 0 errors, 0 warnings, 0 section mismatches

--------------------------------------------------------------------------------
db1xxx_defconfig (mips, gcc-8) — PASS, 0 errors, 0 warnings, 0 section mismatches

--------------------------------------------------------------------------------
decstation_64_defconfig (mips, gcc-8) — PASS, 0 errors, 0 warnings, 0 section mismatches

--------------------------------------------------------------------------------
decstation_defconfig (mips, gcc-8) — PASS, 0 errors, 0 warnings, 0 section mismatches

Section mismatches:
    WARNING: modpost: vmlinux.o(.text.unlikely+0x2c00): Section mismatch in reference from the function pmax_setup_memory_region() to the function .init.text:add_memory_region()

--------------------------------------------------------------------------------
decstation_r4k_defconfig (mips, gcc-8) — PASS, 0 errors, 0 warnings, 0 section mismatches

Section mismatches:
    WARNING: modpost: vmlinux.o(.text.unlikely+0x2980): Section mismatch in reference from the function pmax_setup_memory_region() to the function .init.text:add_memory_region()

--------------------------------------------------------------------------------
defconfig (riscv, gcc-8) — PASS, 0 errors, 0 warnings, 0 section mismatches

--------------------------------------------------------------------------------
defconfig (arm64, gcc-8) — PASS, 0 errors, 8 warnings, 0 section mismatches

Warnings:
    arch/arm64/boot/dts/broadcom/stingray/stingray-usb.dtsi:7.3-14: Warning (dma_ranges_format): /usb:dma-ranges: empty "dma-ranges" property but its #address-cells (1) differs from / (2)
    arch/arm64/boot/dts/broadcom/stingray/stingray-usb.dtsi:7.3-14: Warning (dma_ranges_format): /usb:dma-ranges: empty "dma-ranges" property but its #size-cells (1) differs from / (2)
    arch/arm64/boot/dts/broadcom/stingray/stingray-usb.dtsi:7.3-14: Warning (dma_ranges_format): /usb:dma-ranges: empty "dma-ranges" property but its #address-cells (1) differs from / (2)
    arch/arm64/boot/dts/broadcom/stingray/stingray-usb.dtsi:7.3-14: Warning (dma_ranges_format): /usb:dma-ranges: empty "dma-ranges" property but its #size-cells (1) differs from / (2)
    arch/arm64/boot/dts/broadcom/stingray/stingray-usb.dtsi:7.3-14: Warning (dma_ranges_format): /usb:dma-ranges: empty "dma-ranges" property but its #address-cells (1) differs from / (2)
    arch/arm64/boot/dts/broadcom/stingray/stingray-usb.dtsi:7.3-14: Warning (dma_ranges_format): /usb:dma-ranges: empty "dma-ranges" property but its #size-cells (1) differs from / (2)
    arch/arm64/boot/dts/qcom/ipq6018.dtsi:127.3-14: Warning (dma_ranges_format): /soc:dma-ranges: empty "dma-ranges" property but its #address-cells (1) differs from / (2)
    arch/arm64/boot/dts/qcom/ipq6018.dtsi:127.3-14: Warning (dma_ranges_format): /soc:dma-ranges: empty "dma-ranges" property but its #size-cells (1) differs from / (2)

--------------------------------------------------------------------------------
defconfig+CONFIG_CPU_BIG_ENDIAN=y (arm64, gcc-8) — PASS, 0 errors, 8 warnings, 0 section mismatches

Warnings:
    arch/arm64/boot/dts/broadcom/stingray/stingray-usb.dtsi:7.3-14: Warning (dma_ranges_format): /usb:dma-ranges: empty "dma-ranges" property but its #address-cells (1) differs from / (2)
    arch/arm64/boot/dts/broadcom/stingray/stingray-usb.dtsi:7.3-14: Warning (dma_ranges_format): /usb:dma-ranges: empty "dma-ranges" property but its #size-cells (1) differs from / (2)
    arch/arm64/boot/dts/broadcom/stingray/stingray-usb.dtsi:7.3-14: Warning (dma_ranges_format): /usb:dma-ranges: empty "dma-ranges" property but its #address-cells (1) differs from / (2)
    arch/arm64/boot/dts/broadcom/stingray/stingray-usb.dtsi:7.3-14: Warning (dma_ranges_format): /usb:dma-ranges: empty "dma-ranges" property but its #size-cells (1) differs from / (2)
    arch/arm64/boot/dts/broadcom/stingray/stingray-usb.dtsi:7.3-14: Warning (dma_ranges_format): /usb:dma-ranges: empty "dma-ranges" property but its #address-cells (1) differs from / (2)
    arch/arm64/boot/dts/broadcom/stingray/stingray-usb.dtsi:7.3-14: Warning (dma_ranges_format): /usb:dma-ranges: empty "dma-ranges" property but its #size-cells (1) differs from / (2)
    arch/arm64/boot/dts/qcom/ipq6018.dtsi:127.3-14: Warning (dma_ranges_format): /soc:dma-ranges: empty "dma-ranges" property but its #address-cells (1) differs from / (2)
    arch/arm64/boot/dts/qcom/ipq6018.dtsi:127.3-14: Warning (dma_ranges_format): /soc:dma-ranges: empty "dma-ranges" property but its #size-cells (1) differs from / (2)

--------------------------------------------------------------------------------
defconfig+CONFIG_RANDOMIZE_BASE=y (arm64, gcc-8) — PASS, 0 errors, 8 warnings, 0 section mismatches

Warnings:
    arch/arm64/boot/dts/broadcom/stingray/stingray-usb.dtsi:7.3-14: Warning (dma_ranges_format): /usb:dma-ranges: empty "dma-ranges" property but its #address-cells (1) differs from / (2)
    arch/arm64/boot/dts/broadcom/stingray/stingray-usb.dtsi:7.3-14: Warning (dma_ranges_format): /usb:dma-ranges: empty "dma-ranges" property but its #size-cells (1) differs from / (2)
    arch/arm64/boot/dts/broadcom/stingray/stingray-usb.dtsi:7.3-14: Warning (dma_ranges_format): /usb:dma-ranges: empty "dma-ranges" property but its #address-cells (1) differs from / (2)
    arch/arm64/boot/dts/broadcom/stingray/stingray-usb.dtsi:7.3-14: Warning (dma_ranges_format): /usb:dma-ranges: empty "dma-ranges" property but its #size-cells (1) differs from / (2)
    arch/arm64/boot/dts/broadcom/stingray/stingray-usb.dtsi:7.3-14: Warning (dma_ranges_format): /usb:dma-ranges: empty "dma-ranges" property but its #address-cells (1) differs from / (2)
    arch/arm64/boot/dts/broadcom/stingray/stingray-usb.dtsi:7.3-14: Warning (dma_ranges_format): /usb:dma-ranges: empty "dma-ranges" property but its #size-cells (1) differs from / (2)
    arch/arm64/boot/dts/qcom/ipq6018.dtsi:127.3-14: Warning (dma_ranges_format): /soc:dma-ranges: empty "dma-ranges" property but its #address-cells (1) differs from / (2)
    arch/arm64/boot/dts/qcom/ipq6018.dtsi:127.3-14: Warning (dma_ranges_format): /soc:dma-ranges: empty "dma-ranges" property but its #size-cells (1) differs from / (2)

--------------------------------------------------------------------------------
defconfig+kselftest (riscv, gcc-8) — PASS, 0 errors, 0 warnings, 0 section mismatches

--------------------------------------------------------------------------------
defconfig+kselftest (arm64, gcc-8) — PASS, 0 errors, 8 warnings, 0 section mismatches

Warnings:
    arch/arm64/boot/dts/broadcom/stingray/stingray-usb.dtsi:7.3-14: Warning (dma_ranges_format): /usb:dma-ranges: empty "dma-ranges" property but its #address-cells (1) differs from / (2)
    arch/arm64/boot/dts/broadcom/stingray/stingray-usb.dtsi:7.3-14: Warning (dma_ranges_format): /usb:dma-ranges: empty "dma-ranges" property but its #size-cells (1) differs from / (2)
    arch/arm64/boot/dts/broadcom/stingray/stingray-usb.dtsi:7.3-14: Warning (dma_ranges_format): /usb:dma-ranges: empty "dma-ranges" property but its #address-cells (1) differs from / (2)
    arch/arm64/boot/dts/broadcom/stingray/stingray-usb.dtsi:7.3-14: Warning (dma_ranges_format): /usb:dma-ranges: empty "dma-ranges" property but its #size-cells (1) differs from / (2)
    arch/arm64/boot/dts/broadcom/stingray/stingray-usb.dtsi:7.3-14: Warning (dma_ranges_format): /usb:dma-ranges: empty "dma-ranges" property but its #address-cells (1) differs from / (2)
    arch/arm64/boot/dts/broadcom/stingray/stingray-usb.dtsi:7.3-14: Warning (dma_ranges_format): /usb:dma-ranges: empty "dma-ranges" property but its #size-cells (1) differs from / (2)
    arch/arm64/boot/dts/qcom/ipq6018.dtsi:127.3-14: Warning (dma_ranges_format): /soc:dma-ranges: empty "dma-ranges" property but its #address-cells (1) differs from / (2)
    arch/arm64/boot/dts/qcom/ipq6018.dtsi:127.3-14: Warning (dma_ranges_format): /soc:dma-ranges: empty "dma-ranges" property but its #size-cells (1) differs from / (2)

--------------------------------------------------------------------------------
dove_defconfig (arm, gcc-8) — PASS, 0 errors, 0 warnings, 0 section mismatches

--------------------------------------------------------------------------------
ebsa110_defconfig (arm, gcc-8) — PASS, 0 errors, 0 warnings, 0 section mismatches

--------------------------------------------------------------------------------
efm32_defconfig (arm, gcc-8) — PASS, 0 errors, 0 warnings, 0 section mismatches

--------------------------------------------------------------------------------
eseries_pxa_defconfig (arm, gcc-8) — PASS, 0 errors, 0 warnings, 0 section mismatches

--------------------------------------------------------------------------------
exynos_defconfig (arm, gcc-8) — PASS, 0 errors, 0 warnings, 0 section mismatches

--------------------------------------------------------------------------------
ezx_defconfig (arm, gcc-8) — PASS, 0 errors, 0 warnings, 0 section mismatches

--------------------------------------------------------------------------------
footbridge_defconfig (arm, gcc-8) — PASS, 0 errors, 0 warnings, 0 section mismatches

--------------------------------------------------------------------------------
fuloong2e_defconfig (mips, gcc-8) — PASS, 0 errors, 0 warnings, 0 section mismatches

--------------------------------------------------------------------------------
gemini_defconfig (arm, gcc-8) — PASS, 0 errors, 0 warnings, 0 section mismatches

--------------------------------------------------------------------------------
gpr_defconfig (mips, gcc-8) — PASS, 0 errors, 0 warnings, 0 section mismatches

--------------------------------------------------------------------------------
h3600_defconfig (arm, gcc-8) — PASS, 0 errors, 0 warnings, 0 section mismatches

--------------------------------------------------------------------------------
h5000_defconfig (arm, gcc-8) — PASS, 0 errors, 0 warnings, 0 section mismatches

--------------------------------------------------------------------------------
hackkit_defconfig (arm, gcc-8) — PASS, 0 errors, 0 warnings, 0 section mismatches

--------------------------------------------------------------------------------
haps_hs_smp_defconfig (arc, gcc-8) — PASS, 0 errors, 0 warnings, 0 section mismatches

--------------------------------------------------------------------------------
hisi_defconfig (arm, gcc-8) — PASS, 0 errors, 0 warnings, 0 section mismatches

--------------------------------------------------------------------------------
hsdk_defconfig (arc, gcc-8) — PASS, 0 errors, 0 warnings, 0 section mismatches

--------------------------------------------------------------------------------
i386_defconfig (i386, gcc-8) — PASS, 0 errors, 0 warnings, 0 section mismatches

--------------------------------------------------------------------------------
i386_defconfig+kselftest (i386, gcc-8) — PASS, 0 errors, 0 warnings, 0 section mismatches

--------------------------------------------------------------------------------
imote2_defconfig (arm, gcc-8) — PASS, 0 errors, 0 warnings, 0 section mismatches

--------------------------------------------------------------------------------
imx_v4_v5_defconfig (arm, gcc-8) — PASS, 0 errors, 0 warnings, 0 section mismatches

--------------------------------------------------------------------------------
imx_v6_v7_defconfig (arm, gcc-8) — PASS, 0 errors, 0 warnings, 0 section mismatches

--------------------------------------------------------------------------------
integrator_defconfig (arm, gcc-8) — PASS, 0 errors, 0 warnings, 0 section mismatches

--------------------------------------------------------------------------------
iop32x_defconfig (arm, gcc-8) — PASS, 0 errors, 0 warnings, 0 section mismatches

--------------------------------------------------------------------------------
ip22_defconfig (mips, gcc-8) — PASS, 0 errors, 0 warnings, 0 section mismatches

--------------------------------------------------------------------------------
ip27_defconfig (mips, gcc-8) — PASS, 0 errors, 0 warnings, 0 section mismatches

--------------------------------------------------------------------------------
ip28_defconfig (mips, gcc-8) — PASS, 0 errors, 0 warnings, 0 section mismatches

--------------------------------------------------------------------------------
ip32_defconfig (mips, gcc-8) — PASS, 0 errors, 0 warnings, 0 section mismatches

--------------------------------------------------------------------------------
jazz_defconfig (mips, gcc-8) — PASS, 0 errors, 0 warnings, 0 section mismatches

--------------------------------------------------------------------------------
jmr3927_defconfig (mips, gcc-8) — PASS, 0 errors, 0 warnings, 0 section mismatches

--------------------------------------------------------------------------------
jornada720_defconfig (arm, gcc-8) — PASS, 0 errors, 0 warnings, 0 section mismatches

--------------------------------------------------------------------------------
lart_defconfig (arm, gcc-8) — PASS, 0 errors, 0 warnings, 0 section mismatches

--------------------------------------------------------------------------------
lemote2f_defconfig (mips, gcc-8) — PASS, 0 errors, 0 warnings, 0 section mismatches

--------------------------------------------------------------------------------
loongson1b_defconfig (mips, gcc-8) — PASS, 0 errors, 0 warnings, 0 section mismatches

--------------------------------------------------------------------------------
loongson1c_defconfig (mips, gcc-8) — PASS, 0 errors, 0 warnings, 0 section mismatches

--------------------------------------------------------------------------------
loongson3_defconfig (mips, gcc-8) — PASS, 0 errors, 1 warning, 0 section mismatches

Warnings:
    drivers/media/tuners/mxl5005s.c:3953:1: warning: the frame size of 1120 bytes is larger than 1024 bytes [-Wframe-larger-than=]

--------------------------------------------------------------------------------
lpc18xx_defconfig (arm, gcc-8) — PASS, 0 errors, 0 warnings, 0 section mismatches

--------------------------------------------------------------------------------
lpc32xx_defconfig (arm, gcc-8) — PASS, 0 errors, 0 warnings, 0 section mismatches

--------------------------------------------------------------------------------
lpd270_defconfig (arm, gcc-8) — PASS, 0 errors, 0 warnings, 0 section mismatches

--------------------------------------------------------------------------------
lubbock_defconfig (arm, gcc-8) — PASS, 0 errors, 0 warnings, 0 section mismatches

--------------------------------------------------------------------------------
magician_defconfig (arm, gcc-8) — PASS, 0 errors, 0 warnings, 0 section mismatches

--------------------------------------------------------------------------------
malta_defconfig (mips, gcc-8) — PASS, 0 errors, 0 warnings, 0 section mismatches

--------------------------------------------------------------------------------
malta_kvm_defconfig (mips, gcc-8) — FAIL, 8 errors, 1 warning, 0 section mismatches

Errors:
    arch/mips/kvm/emulate.c:1734:28: error: right shift count >= width of type [-Werror=shift-count-overflow]
    arch/mips/kvm/emulate.c:1738:28: error: right shift count >= width of type [-Werror=shift-count-overflow]
    arch/mips/kvm/emulate.c:1742:28: error: right shift count >= width of type [-Werror=shift-count-overflow]
    arch/mips/kvm/emulate.c:1746:28: error: right shift count >= width of type [-Werror=shift-count-overflow]
    arch/mips/kvm/emulate.c:1796:27: error: left shift count >= width of type [-Werror=shift-count-overflow]
    arch/mips/kvm/emulate.c:1800:27: error: left shift count >= width of type [-Werror=shift-count-overflow]
    arch/mips/kvm/emulate.c:1804:27: error: left shift count >= width of type [-Werror=shift-count-overflow]
    arch/mips/kvm/emulate.c:1808:27: error: left shift count >= width of type [-Werror=shift-count-overflow]

Warnings:
    cc1: all warnings being treated as errors

--------------------------------------------------------------------------------
malta_kvm_guest_defconfig (mips, gcc-8) — PASS, 0 errors, 0 warnings, 0 section mismatches

--------------------------------------------------------------------------------
malta_qemu_32r6_defconfig (mips, gcc-8) — PASS, 0 errors, 1 warning, 0 section mismatches

Warnings:
    {standard input}:141: Warning: macro instruction expanded into multiple instructions

--------------------------------------------------------------------------------
maltaaprp_defconfig (mips, gcc-8) — PASS, 0 errors, 0 warnings, 0 section mismatches

--------------------------------------------------------------------------------
maltasmvp_defconfig (mips, gcc-8) — PASS, 0 errors, 0 warnings, 0 section mismatches

--------------------------------------------------------------------------------
maltasmvp_eva_defconfig (mips, gcc-8) — PASS, 0 errors, 0 warnings, 0 section mismatches

--------------------------------------------------------------------------------
maltaup_defconfig (mips, gcc-8) — PASS, 0 errors, 0 warnings, 0 section mismatches

--------------------------------------------------------------------------------
maltaup_xpa_defconfig (mips, gcc-8) — PASS, 0 errors, 0 warnings, 0 section mismatches

--------------------------------------------------------------------------------
milbeaut_m10v_defconfig (arm, gcc-8) — PASS, 0 errors, 0 warnings, 0 section mismatches

--------------------------------------------------------------------------------
mini2440_defconfig (arm, gcc-8) — PASS, 0 errors, 0 warnings, 0 section mismatches

--------------------------------------------------------------------------------
mips_paravirt_defconfig (mips, gcc-8) — PASS, 0 errors, 0 warnings, 0 section mismatches

--------------------------------------------------------------------------------
mpc30x_defconfig (mips, gcc-8) — PASS, 0 errors, 0 warnings, 0 section mismatches

--------------------------------------------------------------------------------
mps2_defconfig (arm, gcc-8) — PASS, 0 errors, 1 warning, 0 section mismatches

Warnings:
    net/sunrpc/svcsock.c:226:5: warning: "ARCH_IMPLEMENTS_FLUSH_DCACHE_PAGE" is not defined, evaluates to 0 [-Wundef]

--------------------------------------------------------------------------------
mtx1_defconfig (mips, gcc-8) — PASS, 0 errors, 1 warning, 0 section mismatches

Warnings:
    include/linux/compiler_attributes.h:201:41: warning: statement will never be executed [-Wswitch-unreachable]

--------------------------------------------------------------------------------
multi_v4t_defconfig (arm, gcc-8) — PASS, 0 errors, 0 warnings, 0 section mismatches

--------------------------------------------------------------------------------
multi_v5_defconfig (arm, gcc-8) — PASS, 0 errors, 0 warnings, 0 section mismatches

--------------------------------------------------------------------------------
multi_v7_defconfig+CONFIG_CPU_BIG_ENDIAN=y (arm, gcc-8) — PASS, 0 errors, 0 warnings, 0 section mismatches

--------------------------------------------------------------------------------
multi_v7_defconfig+CONFIG_EFI=y+CONFIG_ARM_LPAE=y (arm, gcc-8) — PASS, 0 errors, 0 warnings, 0 section mismatches

--------------------------------------------------------------------------------
multi_v7_defconfig+CONFIG_SMP=n (arm, gcc-8) — PASS, 0 errors, 0 warnings, 0 section mismatches

--------------------------------------------------------------------------------
multi_v7_defconfig+kselftest (arm, gcc-8) — PASS, 0 errors, 0 warnings, 0 section mismatches

--------------------------------------------------------------------------------
mv78xx0_defconfig (arm, gcc-8) — PASS, 0 errors, 0 warnings, 0 section mismatches

--------------------------------------------------------------------------------
mvebu_v5_defconfig (arm, gcc-8) — PASS, 0 errors, 0 warnings, 0 section mismatches

--------------------------------------------------------------------------------
mvebu_v7_defconfig (arm, gcc-8) — PASS, 0 errors, 0 warnings, 0 section mismatches

--------------------------------------------------------------------------------
neponset_defconfig (arm, gcc-8) — PASS, 0 errors, 0 warnings, 0 section mismatches

--------------------------------------------------------------------------------
netwinder_defconfig (arm, gcc-8) — PASS, 0 errors, 0 warnings, 0 section mismatches

--------------------------------------------------------------------------------
nhk8815_defconfig (arm, gcc-8) — PASS, 0 errors, 0 warnings, 0 section mismatches

--------------------------------------------------------------------------------
nlm_xlp_defconfig (mips, gcc-8) — PASS, 0 errors, 0 warnings, 0 section mismatches

--------------------------------------------------------------------------------
nlm_xlr_defconfig (mips, gcc-8) — PASS, 0 errors, 0 warnings, 0 section mismatches

--------------------------------------------------------------------------------
nommu_k210_defconfig (riscv, gcc-8) — PASS, 0 errors, 0 warnings, 0 section mismatches

--------------------------------------------------------------------------------
nommu_virt_defconfig (riscv, gcc-8) — PASS, 0 errors, 0 warnings, 0 section mismatches

--------------------------------------------------------------------------------
nsimosci_hs_defconfig (arc, gcc-8) — PASS, 0 errors, 0 warnings, 0 section mismatches

--------------------------------------------------------------------------------
nsimosci_hs_smp_defconfig (arc, gcc-8) — PASS, 0 errors, 0 warnings, 0 section mismatches

--------------------------------------------------------------------------------
omap1_defconfig (arm, gcc-8) — PASS, 0 errors, 0 warnings, 0 section mismatches

--------------------------------------------------------------------------------
omap2plus_defconfig (arm, gcc-8) — PASS, 0 errors, 0 warnings, 0 section mismatches

--------------------------------------------------------------------------------
omega2p_defconfig (mips, gcc-8) — PASS, 0 errors, 0 warnings, 0 section mismatches

--------------------------------------------------------------------------------
orion5x_defconfig (arm, gcc-8) — PASS, 0 errors, 0 warnings, 0 section mismatches

--------------------------------------------------------------------------------
oxnas_v6_defconfig (arm, gcc-8) — PASS, 0 errors, 0 warnings, 0 section mismatches

--------------------------------------------------------------------------------
palmz72_defconfig (arm, gcc-8) — PASS, 0 errors, 0 warnings, 0 section mismatches

--------------------------------------------------------------------------------
pcm027_defconfig (arm, gcc-8) — PASS, 0 errors, 0 warnings, 0 section mismatches

--------------------------------------------------------------------------------
pic32mzda_defconfig (mips, gcc-8) — PASS, 0 errors, 0 warnings, 0 section mismatches

--------------------------------------------------------------------------------
pistachio_defconfig (mips, gcc-8) — PASS, 0 errors, 0 warnings, 0 section mismatches

--------------------------------------------------------------------------------
pleb_defconfig (arm, gcc-8) — PASS, 0 errors, 0 warnings, 0 section mismatches

--------------------------------------------------------------------------------
pnx8335_stb225_defconfig (mips, gcc-8) — PASS, 0 errors, 0 warnings, 0 section mismatches

--------------------------------------------------------------------------------
pxa168_defconfig (arm, gcc-8) — PASS, 0 errors, 0 warnings, 0 section mismatches

--------------------------------------------------------------------------------
pxa255-idp_defconfig (arm, gcc-8) — PASS, 0 errors, 0 warnings, 0 section mismatches

--------------------------------------------------------------------------------
pxa910_defconfig (arm, gcc-8) — PASS, 0 errors, 0 warnings, 0 section mismatches

--------------------------------------------------------------------------------
pxa_defconfig (arm, gcc-8) — PASS, 0 errors, 0 warnings, 0 section mismatches

--------------------------------------------------------------------------------
qi_lb60_defconfig (mips, gcc-8) — PASS, 0 errors, 0 warnings, 0 section mismatches

--------------------------------------------------------------------------------
rb532_defconfig (mips, gcc-8) — PASS, 0 errors, 0 warnings, 0 section mismatches

--------------------------------------------------------------------------------
rpc_defconfig (arm, gcc-8) — PASS, 0 errors, 0 warnings, 0 section mismatches

--------------------------------------------------------------------------------
rt305x_defconfig (mips, gcc-8) — PASS, 0 errors, 0 warnings, 0 section mismatches

--------------------------------------------------------------------------------
rv32_defconfig (riscv, gcc-8) — PASS, 0 errors, 6 warnings, 0 section mismatches

Warnings:
    <stdin>:830:2: warning: #warning syscall fstat64 not implemented [-Wcpp]
    <stdin>:1127:2: warning: #warning syscall fstatat64 not implemented [-Wcpp]
    <stdin>:1511:2: warning: #warning syscall clone3 not implemented [-Wcpp]
    <stdin>:830:2: warning: #warning syscall fstat64 not implemented [-Wcpp]
    <stdin>:1127:2: warning: #warning syscall fstatat64 not implemented [-Wcpp]
    <stdin>:1511:2: warning: #warning syscall clone3 not implemented [-Wcpp]

--------------------------------------------------------------------------------
s3c6400_defconfig (arm, gcc-8) — PASS, 0 errors, 0 warnings, 0 section mismatches

--------------------------------------------------------------------------------
sama5_defconfig (arm, gcc-8) — PASS, 0 errors, 0 warnings, 0 section mismatches

--------------------------------------------------------------------------------
sb1250_swarm_defconfig (mips, gcc-8) — PASS, 0 errors, 0 warnings, 0 section mismatches

--------------------------------------------------------------------------------
shannon_defconfig (arm, gcc-8) — PASS, 0 errors, 0 warnings, 0 section mismatches

--------------------------------------------------------------------------------
shmobile_defconfig (arm, gcc-8) — PASS, 0 errors, 0 warnings, 0 section mismatches

--------------------------------------------------------------------------------
socfpga_defconfig (arm, gcc-8) — PASS, 0 errors, 0 warnings, 0 section mismatches

--------------------------------------------------------------------------------
spear13xx_defconfig (arm, gcc-8) — PASS, 0 errors, 0 warnings, 0 section mismatches

--------------------------------------------------------------------------------
spear3xx_defconfig (arm, gcc-8) — PASS, 0 errors, 0 warnings, 0 section mismatches

--------------------------------------------------------------------------------
spear6xx_defconfig (arm, gcc-8) — PASS, 0 errors, 0 warnings, 0 section mismatches

--------------------------------------------------------------------------------
sunxi_defconfig (arm, gcc-8) — PASS, 0 errors, 0 warnings, 0 section mismatches

--------------------------------------------------------------------------------
tango4_defconfig (arm, gcc-8) — PASS, 0 errors, 0 warnings, 0 section mismatches

--------------------------------------------------------------------------------
tb0219_defconfig (mips, gcc-8) — PASS, 0 errors, 0 warnings, 0 section mismatches

--------------------------------------------------------------------------------
tct_hammer_defconfig (arm, gcc-8) — PASS, 0 errors, 0 warnings, 0 section mismatches

--------------------------------------------------------------------------------
tinyconfig (mips, gcc-8) — PASS, 0 errors, 0 warnings, 0 section mismatches

--------------------------------------------------------------------------------
tinyconfig (riscv, gcc-8) — PASS, 0 errors, 0 warnings, 0 section mismatches

--------------------------------------------------------------------------------
tinyconfig (x86_64, gcc-8) — PASS, 0 errors, 1 warning, 0 section mismatches

Warnings:
    .config:1167:warning: override: UNWINDER_GUESS changes choice state

--------------------------------------------------------------------------------
tinyconfig (i386, gcc-8) — PASS, 0 errors, 0 warnings, 0 section mismatches

--------------------------------------------------------------------------------
u8500_defconfig (arm, gcc-8) — PASS, 0 errors, 0 warnings, 0 section mismatches

--------------------------------------------------------------------------------
vdk_hs38_defconfig (arc, gcc-8) — PASS, 0 errors, 0 warnings, 0 section mismatches

--------------------------------------------------------------------------------
vdk_hs38_smp_defconfig (arc, gcc-8) — PASS, 0 errors, 0 warnings, 0 section mismatches

--------------------------------------------------------------------------------
versatile_defconfig (arm, gcc-8) — PASS, 0 errors, 0 warnings, 0 section mismatches

--------------------------------------------------------------------------------
vexpress_defconfig (arm, gcc-8) — PASS, 0 errors, 0 warnings, 0 section mismatches

--------------------------------------------------------------------------------
vf610m4_defconfig (arm, gcc-8) — PASS, 0 errors, 0 warnings, 0 section mismatches

--------------------------------------------------------------------------------
vocore2_defconfig (mips, gcc-8) — PASS, 0 errors, 0 warnings, 0 section mismatches

--------------------------------------------------------------------------------
vt8500_v6_v7_defconfig (arm, gcc-8) — PASS, 0 errors, 0 warnings, 0 section mismatches

--------------------------------------------------------------------------------
workpad_defconfig (mips, gcc-8) — PASS, 0 errors, 0 warnings, 0 section mismatches

--------------------------------------------------------------------------------
x86_64_defconfig (x86_64, gcc-8) — PASS, 0 errors, 0 warnings, 0 section mismatches

--------------------------------------------------------------------------------
x86_64_defconfig+kselftest (x86_64, gcc-8) — PASS, 0 errors, 0 warnings, 0 section mismatches

--------------------------------------------------------------------------------
x86_64_defconfig+kvm_guest (x86_64, gcc-8) — PASS, 0 errors, 0 warnings, 0 section mismatches

--------------------------------------------------------------------------------
xcep_defconfig (arm, gcc-8) — PASS, 0 errors, 2 warnings, 0 section mismatches

Warnings:
    net/sunrpc/svcsock.c:226:5: warning: "ARCH_IMPLEMENTS_FLUSH_DCACHE_PAGE" is not defined, evaluates to 0 [-Wundef]
    net/sunrpc/svcsock.c:226:5: warning: "ARCH_IMPLEMENTS_FLUSH_DCACHE_PAGE" is not defined, evaluates to 0 [-Wundef]

--------------------------------------------------------------------------------
xway_defconfig (mips, gcc-8) — FAIL, 1 error, 0 warnings, 0 section mismatches

Errors:
    drivers/mtd/nand/raw/xway_nand.c:227:30: error: ‘mtd’ undeclared (first use in this function)

---
For more info write to <info@kernelci.org>

^ permalink raw reply	[flat|nested] only message in thread

only message in thread, back to index

Thread overview: (only message) (download: mbox.gz / follow: Atom feed)
-- links below jump to the message on this page --
2020-06-30  4:24 next/pending-fixes build: 169 builds: 2 failed, 167 passed, 9 errors, 74 warnings (v5.8-rc3-210-g0a3929819868) kernelci.org bot

Linux-Next Archive on lore.kernel.org

Archives are clonable:
	git clone --mirror https://lore.kernel.org/linux-next/0 linux-next/git/0.git

	# If you have public-inbox 1.1+ installed, you may
	# initialize and index your mirror using the following commands:
	public-inbox-init -V2 linux-next linux-next/ https://lore.kernel.org/linux-next \
		linux-next@vger.kernel.org
	public-inbox-index linux-next

Example config snippet for mirrors

Newsgroup available over NNTP:
	nntp://nntp.lore.kernel.org/org.kernel.vger.linux-next


AGPL code for this site: git clone https://public-inbox.org/public-inbox.git